Hospital Service Area,Hospital County,Operating Certificate Number,Permanent Facility Id,Facility Name,Age Group,Zip Code - 3 digits,Gender,Race,Ethnicity,Length of Stay,Type of Admission,Patient Disposition,Discharge Year,CCS Diagnosis Code,CCS Diagnosis Description,CCS Procedure Code,CCS Procedure Description,APR DRG Code,APR DRG Description,APR MDC Code,APR MDC Description,APR Severity of Illness Code,APR Severity of Illness Description,APR Risk of Mortality,APR Medical Surgical Description,Payment Typology 1,Payment Typology 2,Payment Typology 3,Birth Weight,Abortion Edit Indicator,Emergency Department Indicator,Total Charges,Total Costs
New York City,Manhattan,7002001,001438,Bellevue Hospital Center,30 to 49,114,M,Other Race,Spanish/Hispanic,10,Emergency,Home or Self Care,2019,GEN003,CHRONIC KIDNEY DISEASE,GIS006,PARACENTESIS,470,CHRONIC KIDNEY DISEASE,11,DISEASES AND DISORDERS OF THE KIDNEY AND URINARY TRACT,4,Extreme,Extreme,Medical,Medicaid,,,,,true,66508.89,44201.81
New York City,Manhattan,7002001,001438,Bellevue Hospital Center,18 to 29,,M,White,Spanish/Hispanic,12,Emergency,Home or Self Care,2019,GEN003,CHRONIC KIDNEY DISEASE,ESA001,HEMODIALYSIS,470,CHRONIC KIDNEY DISEASE,11,DISEASES AND DISORDERS OF THE KIDNEY AND URINARY TRACT,3,Major,Major,Medical,Medicaid,Medicaid,,,,true,65589.65,43590.88
New York City,Manhattan,7002001,001438,Bellevue Hospital Center,50 to 69,113,M,Other Race,Spanish/Hispanic,2,Emergency,Home or Self Care,2019,GEN003,CHRONIC KIDNEY DISEASE,MAM004,CARDIAC STRESS TESTS,470,CHRONIC KIDNEY DISEASE,11,DISEASES AND DISORDERS OF THE KIDNEY AND URINARY TRACT,3,Major,Moderate,Medical,Medicare,Medicaid,,,,true,20169.12,13404.4
New York City,Queens,7003010,001637,New York - Presbyterian/Queens,70 or Older,113,F,Other Race,Not Span/Hispanic,2,Emergency,Home w/ Home Health Services,2019,GEN003,CHRONIC KIDNEY DISEASE,ESA001,HEMODIALYSIS,470,CHRONIC KIDNEY DISEASE,11,DISEASES AND DISORDERS OF THE KIDNEY AND URINARY TRACT,3,Major,Major,Medical,Medicare,Blue Cross/Blue Shield,Self-Pay,,,true,18954.04,4761.86
New York City,Kings,7001016,001301,Kings County Hospital Center,70 or Older,112,M,Black/African American,Not Span/Hispanic,1,Emergency,Home or Self Care,2019,GEN003,CHRONIC KIDNEY DISEASE,,,470,CHRONIC KIDNEY DISEASE,11,DISEASES AND DISORDERS OF THE KIDNEY AND URINARY TRACT,2,Moderate,Moderate,Medical,Medicare,Medicare,Medicaid,,,true,7161.6,5087.32
New York City,Bronx,7000008,001172,Lincoln Medical & Mental Health Center,70 or Older,104,M,Other Race,Spanish/Hispanic,1,Emergency,Home or Self Care,2019,GEN003,CHRONIC KIDNEY DISEASE,ADM001,TRANSFUSION OF BLOOD AND BLOOD PRODUCTS,470,CHRONIC KIDNEY DISEASE,11,DISEASES AND DISORDERS OF THE KIDNEY AND URINARY TRACT,2,Moderate,Major,Medical,Medicare,Medicare,Medicaid,,,true,7413.27,4377.96
New York City,Bronx,7000008,001172,Lincoln Medical & Mental Health Center,50 to 69,104,F,Other Race,Spanish/Hispanic,1,Emergency,Home or Self Care,2019,GEN003,CHRONIC KIDNEY DISEASE,,,470,CHRONIC KIDNEY DISEASE,11,DISEASES AND DISORDERS OF THE KIDNEY AND URINARY TRACT,2,Moderate,Minor,Medical,Medicaid,Medicaid,,,,false,6179.36,3649.26
New York City,Manhattan,7002001,001438,Bellevue Hospital Center,50 to 69,112,F,Other Race,Not Span/Hispanic,1,Emergency,Home or Self Care,2019,GEN003,CHRONIC KIDNEY DISEASE,ESA001,HEMODIALYSIS,470,CHRONIC KIDNEY DISEASE,11,DISEASES AND DISORDERS OF THE KIDNEY AND URINARY TRACT,2,Moderate,Minor,Medical,Medicare,Medicaid,,,,false,6110,4060.71
New York City,Kings,7002002,001324,Mount Sinai Brooklyn,70 or Older,112,F,Black/African American,Not Span/Hispanic,13,Emergency,Skilled Nursing Home,2019,GEN003,CHRONIC KIDNEY DISEASE,CAR025,PLACEMENT OF TUNNELED OR IMPLANTABLE PORTION OF A VASCULAR ACCESS DEVICE,470,CHRONIC KIDNEY DISEASE,11,DISEASES AND DISORDERS OF THE KIDNEY AND URINARY TRACT,3,Major,Major,Medical,Medicare,Medicaid,,,,true,185976.82,35653.06
Hudson Valley,Rockland,4329000,000779,Good Samaritan Hospital of Suffern,50 to 69,109,M,Other Race,Spanish/Hispanic,3,Emergency,Home or Self Care,2019,GEN003,CHRONIC KIDNEY DISEASE,ESA001,HEMODIALYSIS,470,CHRONIC KIDNEY DISEASE,11,DISEASES AND DISORDERS OF THE KIDNEY AND URINARY TRACT,2,Moderate,Moderate,Medical,Medicaid,,,,,true,33833.01,5367.22
Capital/Adirond,Albany,0101004,000005,St. Peter's Hospital,70 or Older,121,F,White,Not Span/Hispanic,4,Emergency,Skilled Nursing Home,2019,GEN003,CHRONIC KIDNEY DISEASE,,,470,CHRONIC KIDNEY DISEASE,11,DISEASES AND DISORDERS OF THE KIDNEY AND URINARY TRACT,3,Major,Major,Medical,Medicare,,,,,true,30761.1,8342.88
Finger Lakes,Monroe,2701003,000411,Rochester General Hospital,50 to 69,146,M,Black/African American,Not Span/Hispanic,1,Emergency,Home or Self Care,2019,GEN003,CHRONIC KIDNEY DISEASE,,,470,CHRONIC KIDNEY DISEASE,11,DISEASES AND DISORDERS OF THE KIDNEY AND URINARY TRACT,2,Moderate,Moderate,Medical,Medicare,,,,,true,6965.32,2445.58
Southern Tier,Broome,0303001,000058,United Health Services Hospitals Inc. - Wilson Medical Center,50 to 69,139,M,Other Race,Not Span/Hispanic,6,Urgent,Hospice - Home,2019,GEN003,CHRONIC KIDNEY DISEASE,ESA001,HEMODIALYSIS,470,CHRONIC KIDNEY DISEASE,11,DISEASES AND DISORDERS OF THE KIDNEY AND URINARY TRACT,3,Major,Major,Medical,Medicare,Medicare,Private Health Insurance,,,false,18550.7,9207.36
New York City,Kings,7001020,001305,Maimonides Medical Center,50 to 69,112,F,Other Race,Not Span/Hispanic,2,Emergency,Home or Self Care,2019,GEN003,CHRONIC KIDNEY DISEASE,,,470,CHRONIC KIDNEY DISEASE,11,DISEASES AND DISORDERS OF THE KIDNEY AND URINARY TRACT,3,Major,Moderate,Medical,Medicaid,Self-Pay,,,,true,25007.03,8062.6
New York City,Manhattan,7002054,001437,New York-Presbyterian/Lower Manhattan Hospital,70 or Older,100,F,Other Race,Not Span/Hispanic,1,Emergency,Expired,2019,GEN003,CHRONIC KIDNEY DISEASE,ESA003,MECHANICAL VENTILATION,470,CHRONIC KIDNEY DISEASE,11,DISEASES AND DISORDERS OF THE KIDNEY AND URINARY TRACT,4,Extreme,Extreme,Medical,Medicare,Medicaid,Self-Pay,,,true,20517.47,4976.29
Central NY,Oneida,3202003,000599,Faxton-St Lukes Healthcare St Lukes Division,50 to 69,135,M,White,Not Span/Hispanic,37,Urgent,Home or Self Care,2019,GEN003,CHRONIC KIDNEY DISEASE,MST001,ARTHROCENTESIS,470,CHRONIC KIDNEY DISEASE,11,DISEASES AND DISORDERS OF THE KIDNEY AND URINARY TRACT,2,Moderate,Moderate,Medical,Medicare,Private Health Insurance,,,,false,101149.05,26930.11
New York City,Kings,7001046,001309,Interfaith Medical Center,50 to 69,104,F,Black/African American,Not Span/Hispanic,12,Emergency,Left Against Medical Advice,2019,GEN003,CHRONIC KIDNEY DISEASE,CAR029,"CARDIOVASCULAR DEVICE PROCEDURES, NEC",470,CHRONIC KIDNEY DISEASE,11,DISEASES AND DISORDERS OF THE KIDNEY AND URINARY TRACT,4,Extreme,Major,Medical,Medicaid,Medicaid,,,,true,73150.41,34050.6
New York City,Manhattan,7002054,001464,New York-Presbyterian Hospital - Columbia Presbyterian Center,30 to 49,100,M,White,Not Span/Hispanic,13,Emergency,Home or Self Care,2019,GEN003,CHRONIC KIDNEY DISEASE,ESA001,HEMODIALYSIS,470,CHRONIC KIDNEY DISEASE,11,DISEASES AND DISORDERS OF THE KIDNEY AND URINARY TRACT,3,Major,Moderate,Medical,Medicare,Medicaid,Self-Pay,,,true,180836.33,44750.48
New York City,Bronx,7000024,001186,North Central Bronx Hospital,50 to 69,104,F,Other Race,Not Span/Hispanic,46,Urgent,Home or Self Care,2019,GEN003,CHRONIC KIDNEY DISEASE,ESA001,HEMODIALYSIS,470,CHRONIC KIDNEY DISEASE,11,DISEASES AND DISORDERS OF THE KIDNEY AND URINARY TRACT,3,Major,Major,Medical,Medicaid,,,,,false,224332.39,134668.75
New York City,Kings,7001021,001306,New York - Presbyterian Brooklyn Methodist Hospital,30 to 49,112,F,White,Not Span/Hispanic,3,Emergency,Short-term Hospital,2019,GEN003,CHRONIC KIDNEY DISEASE,CAR024,VENOUS AND ARTERIAL CATHETER PLACEMENT,470,CHRONIC KIDNEY DISEASE,11,DISEASES AND DISORDERS OF THE KIDNEY AND URINARY TRACT,3,Major,Moderate,Medical,Blue Cross/Blue Shield,Self-Pay,,,,true,39478.15,10531.19
New York City,Bronx,7000006,001169,Montefiore Medical Center - Henry & Lucy Moses Div,50 to 69,104,F,Other Race,Spanish/Hispanic,9,Emergency,Home w/ Home Health Services,2019,GEN003,CHRONIC KIDNEY DISEASE,CAR025,PLACEMENT OF TUNNELED OR IMPLANTABLE PORTION OF A VASCULAR ACCESS DEVICE,470,CHRONIC KIDNEY DISEASE,11,DISEASES AND DISORDERS OF THE KIDNEY AND URINARY TRACT,3,Major,Major,Medical,Medicaid,,,,,true,136278.31,27432.36
New York City,Manhattan,7002054,001437,New York-Presbyterian/Lower Manhattan Hospital,50 to 69,112,M,Black/African American,Not Span/Hispanic,1,Emergency,Left Against Medical Advice,2019,GEN003,CHRONIC KIDNEY DISEASE,ESA001,HEMODIALYSIS,470,CHRONIC KIDNEY DISEASE,11,DISEASES AND DISORDERS OF THE KIDNEY AND URINARY TRACT,2,Moderate,Minor,Medical,"Managed Care, Unspecified",Medicaid,Self-Pay,,,true,14159.14,3190.76
New York City,Bronx,7000024,001186,North Central Bronx Hospital,50 to 69,104,F,Other Race,Not Span/Hispanic,7,Emergency,Psychiatric Hospital or Unit of Hosp,2019,GEN003,CHRONIC KIDNEY DISEASE,RES007,AIRWAY INTUBATION,470,CHRONIC KIDNEY DISEASE,11,DISEASES AND DISORDERS OF THE KIDNEY AND URINARY TRACT,4,Extreme,Major,Medical,Medicaid,Medicaid,,,,true,54483.52,32706.95
New York City,Kings,7001002,001286,Brookdale Hospital Medical Center,50 to 69,112,F,Black/African American,Unknown,2,Emergency,Home or Self Care,2019,GEN003,CHRONIC KIDNEY DISEASE,ESA001,HEMODIALYSIS,470,CHRONIC KIDNEY DISEASE,11,DISEASES AND DISORDERS OF THE KIDNEY AND URINARY TRACT,2,Moderate,Moderate,Medical,Private Health Insurance,,,,,true,13215.66,6328.84
Hudson Valley,Dutchess,5957001,000180,Mid-Hudson Valley Division of Westchester Medical Center,70 or Older,125,F,White,Not Span/Hispanic,5,Emergency,Home or Self Care,2019,GEN003,CHRONIC KIDNEY DISEASE,ESA001,HEMODIALYSIS,470,CHRONIC KIDNEY DISEASE,11,DISEASES AND DISORDERS OF THE KIDNEY AND URINARY TRACT,3,Major,Moderate,Medical,Medicare,Blue Cross/Blue Shield,,,,true,144342.59,25301.33
Capital/Adirond,Albany,0101004,000005,St. Peter's Hospital,30 to 49,122,M,Black/African American,Not Span/Hispanic,3,Emergency,Home or Self Care,2019,GEN003,CHRONIC KIDNEY DISEASE,ESA001,HEMODIALYSIS,470,CHRONIC KIDNEY DISEASE,11,DISEASES AND DISORDERS OF THE KIDNEY AND URINARY TRACT,3,Major,Major,Medical,Medicaid,Medicaid,,,,true,17472.55,5867.96
Hudson Valley,Ulster,5501001,000990,HealthAlliance Hospital Broadway Campus,70 or Older,124,F,White,Not Span/Hispanic,7,Emergency,Hospice - Home,2019,GEN003,CHRONIC KIDNEY DISEASE,,,470,CHRONIC KIDNEY DISEASE,11,DISEASES AND DISORDERS OF THE KIDNEY AND URINARY TRACT,2,Moderate,Major,Medical,Medicare,Medicaid,Medicare,,,true,69766.68,10345.17
New York City,Manhattan,7002032,001466,Mount Sinai West,70 or Older,100,M,Other Race,Spanish/Hispanic,2,Urgent,Home or Self Care,2019,GEN003,CHRONIC KIDNEY DISEASE,IMG002,FLUOROSCOPIC ANGIOGRAPHY (EXCLUDING CORONARY),470,CHRONIC KIDNEY DISEASE,11,DISEASES AND DISORDERS OF THE KIDNEY AND URINARY TRACT,2,Moderate,Major,Medical,Medicare,Medicare,Self-Pay,,,false,44787.01,12245.87
New York City,Richmond,7004010,001738,Richmond University Medical Center,70 or Older,103,F,Black/African American,Not Span/Hispanic,7,Emergency,Home or Self Care,2019,GEN003,CHRONIC KIDNEY DISEASE,CAR024,VENOUS AND ARTERIAL CATHETER PLACEMENT,470,CHRONIC KIDNEY DISEASE,11,DISEASES AND DISORDERS OF THE KIDNEY AND URINARY TRACT,3,Major,Major,Medical,Medicare,Medicaid,Self-Pay,,,true,51410.63,14712.05
Finger Lakes,Monroe,2701003,000411,Rochester General Hospital,50 to 69,146,F,White,Not Span/Hispanic,5,Emergency,Home w/ Home Health Services,2019,GEN003,CHRONIC KIDNEY DISEASE,CAR025,PLACEMENT OF TUNNELED OR IMPLANTABLE PORTION OF A VASCULAR ACCESS DEVICE,470,CHRONIC KIDNEY DISEASE,11,DISEASES AND DISORDERS OF THE KIDNEY AND URINARY TRACT,3,Major,Major,Medical,Medicare,Medicaid,,,,true,30854.9,12050.41
Capital/Adirond,Albany,0101004,000005,St. Peter's Hospital,50 to 69,122,M,Other Race,Not Span/Hispanic,5,Emergency,Home or Self Care,2019,GEN003,CHRONIC KIDNEY DISEASE,ESA001,HEMODIALYSIS,470,CHRONIC KIDNEY DISEASE,11,DISEASES AND DISORDERS OF THE KIDNEY AND URINARY TRACT,3,Major,Major,Medical,Medicare,,,,,true,31543.65,11184.92
New York City,Manhattan,7002054,001437,New York-Presbyterian/Lower Manhattan Hospital,30 to 49,104,M,Black/African American,Not Span/Hispanic,4,Emergency,Home or Self Care,2019,GEN003,CHRONIC KIDNEY DISEASE,ADM021,"ADMINISTRATION OF THERAPEUTIC SUBSTANCES, NEC",470,CHRONIC KIDNEY DISEASE,11,DISEASES AND DISORDERS OF THE KIDNEY AND URINARY TRACT,2,Moderate,Minor,Medical,Medicare,Medicaid,Self-Pay,,,true,49820.92,10779.92
Central NY,Cayuga,0501000,000085,Auburn Community Hospital,30 to 49,130,F,White,Not Span/Hispanic,3,Emergency,Left Against Medical Advice,2019,GEN003,CHRONIC KIDNEY DISEASE,CAR024,VENOUS AND ARTERIAL CATHETER PLACEMENT,470,CHRONIC KIDNEY DISEASE,11,DISEASES AND DISORDERS OF THE KIDNEY AND URINARY TRACT,4,Extreme,Major,Medical,Medicaid,,,,,true,17262.99,4351.5
Southern Tier,Broome,0301001,000043,Our Lady of Lourdes Memorial Hospital,18 to 29,137,F,Black/African American,Not Span/Hispanic,1,Emergency,Home or Self Care,2019,GEN003,CHRONIC KIDNEY DISEASE,ESA001,HEMODIALYSIS,470,CHRONIC KIDNEY DISEASE,11,DISEASES AND DISORDERS OF THE KIDNEY AND URINARY TRACT,2,Moderate,Moderate,Medical,Medicaid,Self-Pay,Self-Pay,,,true,4953.29,955.39
New York City,Kings,7002002,001324,Mount Sinai Brooklyn,70 or Older,112,M,White,Not Span/Hispanic,30,Emergency,Skilled Nursing Home,2019,GEN003,CHRONIC KIDNEY DISEASE,ESA001,HEMODIALYSIS,470,CHRONIC KIDNEY DISEASE,11,DISEASES AND DISORDERS OF THE KIDNEY AND URINARY TRACT,3,Major,Major,Medical,Medicare,Private Health Insurance,Medicaid,,,true,314113.39,55227.89
New York City,Manhattan,7002001,001438,Bellevue Hospital Center,30 to 49,113,M,Other Race,Not Span/Hispanic,1,Emergency,Home or Self Care,2019,GEN003,CHRONIC KIDNEY DISEASE,ESA001,HEMODIALYSIS,470,CHRONIC KIDNEY DISEASE,11,DISEASES AND DISORDERS OF THE KIDNEY AND URINARY TRACT,3,Major,Minor,Medical,Medicaid,,,,,false,6953.92,4621.58
Central NY,Oneida,3202003,000599,Faxton-St Lukes Healthcare St Lukes Division,70 or Older,135,M,White,Not Span/Hispanic,17,Urgent,Home or Self Care,2019,GEN003,CHRONIC KIDNEY DISEASE,ESA001,HEMODIALYSIS,470,CHRONIC KIDNEY DISEASE,11,DISEASES AND DISORDERS OF THE KIDNEY AND URINARY TRACT,2,Moderate,Moderate,Medical,Medicare,,,,,false,54433.74,13073.86
New York City,Manhattan,7002001,001438,Bellevue Hospital Center,50 to 69,113,M,Black/African American,Not Span/Hispanic,9,Emergency,Home or Self Care,2019,GEN003,CHRONIC KIDNEY DISEASE,ESA001,HEMODIALYSIS,470,CHRONIC KIDNEY DISEASE,11,DISEASES AND DISORDERS OF THE KIDNEY AND URINARY TRACT,3,Major,Moderate,Medical,Medicaid,,,,,true,51184.15,34016.99
Capital/Adirond,Otsego,3801000,000739,A.O. Fox Memorial Hospital,70 or Older,,F,Other Race,Not Span/Hispanic,12,Elective,Home w/ Home Health Services,2019,GEN003,CHRONIC KIDNEY DISEASE,GIS002,COLONOSCOPY AND PROCTOSCOPY WITH BIOPSY,470,CHRONIC KIDNEY DISEASE,11,DISEASES AND DISORDERS OF THE KIDNEY AND URINARY TRACT,2,Moderate,Major,Medical,Medicare,,,,,false,23105.37,17647.93
New York City,Kings,7001021,001306,New York - Presbyterian Brooklyn Methodist Hospital,70 or Older,112,M,Black/African American,Not Span/Hispanic,7,Emergency,Skilled Nursing Home,2019,GEN003,CHRONIC KIDNEY DISEASE,ADM001,TRANSFUSION OF BLOOD AND BLOOD PRODUCTS,470,CHRONIC KIDNEY DISEASE,11,DISEASES AND DISORDERS OF THE KIDNEY AND URINARY TRACT,4,Extreme,Major,Medical,Medicare,Medicaid,Self-Pay,,,true,47963.9,12095.49
New York City,Queens,7003004,001638,Long Island Jewish Forest Hills,70 or Older,113,M,White,Spanish/Hispanic,1,Emergency,Home w/ Home Health Services,2019,GEN003,CHRONIC KIDNEY DISEASE,ESA001,HEMODIALYSIS,470,CHRONIC KIDNEY DISEASE,11,DISEASES AND DISORDERS OF THE KIDNEY AND URINARY TRACT,3,Major,Major,Medical,Medicare,Medicare,,,,true,13387.4,2343.34
New York City,Bronx,7000006,001168,Montefiore Medical Center-Wakefield Hospital,50 to 69,104,M,Other Race,Not Span/Hispanic,12,Emergency,Home w/ Home Health Services,2019,GEN003,CHRONIC KIDNEY DISEASE,CAR024,VENOUS AND ARTERIAL CATHETER PLACEMENT,470,CHRONIC KIDNEY DISEASE,11,DISEASES AND DISORDERS OF THE KIDNEY AND URINARY TRACT,3,Major,Major,Medical,Medicaid,,,,,true,170874.87,34948.67
Hudson Valley,Rockland,4324000,000776,Montefiore Nyack,70 or Older,109,F,White,Not Span/Hispanic,1,Emergency,Skilled Nursing Home,2019,GEN003,CHRONIC KIDNEY DISEASE,,,470,CHRONIC KIDNEY DISEASE,11,DISEASES AND DISORDERS OF THE KIDNEY AND URINARY TRACT,2,Moderate,Moderate,Medical,Medicare,Medicaid,,,,false,35409.42,5718.7
New York City,Bronx,7000001,001178,BronxCare Hospital Center,50 to 69,104,M,Other Race,Spanish/Hispanic,2,Emergency,Skilled Nursing Home,2019,GEN003,CHRONIC KIDNEY DISEASE,ESA001,HEMODIALYSIS,470,CHRONIC KIDNEY DISEASE,11,DISEASES AND DISORDERS OF THE KIDNEY AND URINARY TRACT,3,Major,Major,Medical,Medicare,Medicaid,Miscellaneous/Other,,,true,9129.63,10084.42
Central NY,Oneida,3202003,000599,Faxton-St Lukes Healthcare St Lukes Division,30 to 49,135,F,White,Not Span/Hispanic,11,Emergency,Home or Self Care,2019,GEN003,CHRONIC KIDNEY DISEASE,GIS001,ESOPHAGOGASTRODUODENOSCOPY (EGD) WITH BIOPSY,470,CHRONIC KIDNEY DISEASE,11,DISEASES AND DISORDERS OF THE KIDNEY AND URINARY TRACT,2,Moderate,Moderate,Medical,Medicare,Medicaid,,,,true,52482.42,12023.29
New York City,Kings,7002002,001324,Mount Sinai Brooklyn,30 to 49,,M,Black/African American,Not Span/Hispanic,8,Emergency,Home or Self Care,2019,GEN003,CHRONIC KIDNEY DISEASE,ESA001,HEMODIALYSIS,470,CHRONIC KIDNEY DISEASE,11,DISEASES AND DISORDERS OF THE KIDNEY AND URINARY TRACT,3,Major,Moderate,Medical,Medicare,Medicaid,Self-Pay,,,true,95975.24,16554.61
New York City,Manhattan,7002032,001469,Mount Sinai Morningside,50 to 69,104,M,Black/African American,Not Span/Hispanic,3,Urgent,Home or Self Care,2019,GEN003,CHRONIC KIDNEY DISEASE,ADM021,"ADMINISTRATION OF THERAPEUTIC SUBSTANCES, NEC",470,CHRONIC KIDNEY DISEASE,11,DISEASES AND DISORDERS OF THE KIDNEY AND URINARY TRACT,3,Major,Moderate,Medical,Medicaid,Medicaid,Self-Pay,,,false,28327.21,6617.66
New York City,Kings,7001021,001306,New York - Presbyterian Brooklyn Methodist Hospital,18 to 29,112,F,Black/African American,Not Span/Hispanic,1,Emergency,Home or Self Care,2019,GEN003,CHRONIC KIDNEY DISEASE,ADM001,TRANSFUSION OF BLOOD AND BLOOD PRODUCTS,470,CHRONIC KIDNEY DISEASE,11,DISEASES AND DISORDERS OF THE KIDNEY AND URINARY TRACT,2,Moderate,Moderate,Medical,Blue Cross/Blue Shield,Self-Pay,,,,true,12486.46,2815.95
Long Island,Suffolk,5153000,000913,Huntington Hospital,50 to 69,117,M,White,Not Span/Hispanic,1,Emergency,Home or Self Care,2019,GEN003,CHRONIC KIDNEY DISEASE,ESA001,HEMODIALYSIS,470,CHRONIC KIDNEY DISEASE,11,DISEASES AND DISORDERS OF THE KIDNEY AND URINARY TRACT,2,Moderate,Minor,Medical,Medicare,Private Health Insurance,,,,true,13884,8214.88
New York City,Bronx,7000008,001172,Lincoln Medical & Mental Health Center,50 to 69,104,F,Other Race,Spanish/Hispanic,3,Emergency,Home or Self Care,2019,GEN003,CHRONIC KIDNEY DISEASE,ESA001,HEMODIALYSIS,470,CHRONIC KIDNEY DISEASE,11,DISEASES AND DISORDERS OF THE KIDNEY AND URINARY TRACT,3,Major,Major,Medical,Medicaid,,,,,false,16965.85,10019.3
Hudson Valley,Rockland,4324000,000776,Montefiore Nyack,70 or Older,109,M,Black/African American,Not Span/Hispanic,4,Emergency,Home or Self Care,2019,GEN003,CHRONIC KIDNEY DISEASE,RES002,"LUNG, PLEURA, OR DIAPHRAGM BIOPSY (NON-ENDOSCOPIC)",470,CHRONIC KIDNEY DISEASE,11,DISEASES AND DISORDERS OF THE KIDNEY AND URINARY TRACT,3,Major,Major,Medical,Medicare,Blue Cross/Blue Shield,,,,false,47128.85,10614.68
New York City,Bronx,7000006,001169,Montefiore Medical Center - Henry & Lucy Moses Div,50 to 69,104,F,Other Race,Not Span/Hispanic,1,Emergency,Home or Self Care,2019,GEN003,CHRONIC KIDNEY DISEASE,ADM017,ADMINISTRATION OF NUTRITIONAL AND ELECTROLYTIC SUBSTANCES,470,CHRONIC KIDNEY DISEASE,11,DISEASES AND DISORDERS OF THE KIDNEY AND URINARY TRACT,3,Major,Moderate,Medical,Medicare,Medicaid,,,,true,26488.3,3867.21
New York City,Bronx,7000006,001169,Montefiore Medical Center - Henry & Lucy Moses Div,70 or Older,104,F,Other Race,Not Span/Hispanic,2,Emergency,Home w/ Home Health Services,2019,GEN003,CHRONIC KIDNEY DISEASE,ADM001,TRANSFUSION OF BLOOD AND BLOOD PRODUCTS,470,CHRONIC KIDNEY DISEASE,11,DISEASES AND DISORDERS OF THE KIDNEY AND URINARY TRACT,2,Moderate,Moderate,Medical,Medicaid,,,,,true,38234.93,7668.83
New York City,Bronx,7000006,001168,Montefiore Medical Center-Wakefield Hospital,70 or Older,104,M,Black/African American,Not Span/Hispanic,1,Emergency,Skilled Nursing Home,2019,GEN003,CHRONIC KIDNEY DISEASE,ADM001,TRANSFUSION OF BLOOD AND BLOOD PRODUCTS,470,CHRONIC KIDNEY DISEASE,11,DISEASES AND DISORDERS OF THE KIDNEY AND URINARY TRACT,3,Major,Major,Medical,Medicare,Medicaid,,,,true,22405.48,3852.3
New York City,Queens,7003004,001638,Long Island Jewish Forest Hills,70 or Older,114,M,White,Not Span/Hispanic,1,Emergency,Home or Self Care,2019,GEN003,CHRONIC KIDNEY DISEASE,ADM001,TRANSFUSION OF BLOOD AND BLOOD PRODUCTS,470,CHRONIC KIDNEY DISEASE,11,DISEASES AND DISORDERS OF THE KIDNEY AND URINARY TRACT,3,Major,Moderate,Medical,Medicare,Medicaid,,,,true,21370,8055.35
New York City,Bronx,7000006,001169,Montefiore Medical Center - Henry & Lucy Moses Div,30 to 49,104,M,Other Race,Spanish/Hispanic,1,Emergency,Home or Self Care,2019,GEN003,CHRONIC KIDNEY DISEASE,,,470,CHRONIC KIDNEY DISEASE,11,DISEASES AND DISORDERS OF THE KIDNEY AND URINARY TRACT,3,Major,Moderate,Medical,Blue Cross/Blue Shield,Medicare,,,,false,23512,4273.33
New York City,Kings,7002002,001324,Mount Sinai Brooklyn,30 to 49,112,M,Black/African American,Unknown,5,Emergency,Home or Self Care,2019,GEN003,CHRONIC KIDNEY DISEASE,IMG008,ULTRASONOGRAPHY,470,CHRONIC KIDNEY DISEASE,11,DISEASES AND DISORDERS OF THE KIDNEY AND URINARY TRACT,3,Major,Moderate,Medical,Blue Cross/Blue Shield,Self-Pay,,,,true,60852.22,10020.27
New York City,Richmond,7004003,001740,Staten Island University Hosp-North,50 to 69,103,M,Black/African American,Not Span/Hispanic,4,Emergency,Home or Self Care,2019,GEN003,CHRONIC KIDNEY DISEASE,MAM011,ELECTROENCEPHALOGRAM (EEG),470,CHRONIC KIDNEY DISEASE,11,DISEASES AND DISORDERS OF THE KIDNEY AND URINARY TRACT,3,Major,Moderate,Medical,Private Health Insurance,Medicare,,,,true,37167.8,8120.6
New York City,Manhattan,7002054,001464,New York-Presbyterian Hospital - Columbia Presbyterian Center,30 to 49,105,M,Black/African American,Not Span/Hispanic,10,Emergency,Home or Self Care,2019,GEN003,CHRONIC KIDNEY DISEASE,CAR025,PLACEMENT OF TUNNELED OR IMPLANTABLE PORTION OF A VASCULAR ACCESS DEVICE,470,CHRONIC KIDNEY DISEASE,11,DISEASES AND DISORDERS OF THE KIDNEY AND URINARY TRACT,3,Major,Major,Medical,Private Health Insurance,Self-Pay,,,,true,153607.52,40951.37
New York City,Bronx,7000006,001169,Montefiore Medical Center - Henry & Lucy Moses Div,30 to 49,104,M,Black/African American,Not Span/Hispanic,3,Emergency,Skilled Nursing Home,2019,GEN003,CHRONIC KIDNEY DISEASE,ESA001,HEMODIALYSIS,470,CHRONIC KIDNEY DISEASE,11,DISEASES AND DISORDERS OF THE KIDNEY AND URINARY TRACT,3,Major,Major,Medical,Medicaid,,,,,true,33576.51,7236.54
Southern Tier,Broome,0303001,000058,United Health Services Hospitals Inc. - Wilson Medical Center,50 to 69,137,F,White,Not Span/Hispanic,2,Emergency,Left Against Medical Advice,2019,GEN003,CHRONIC KIDNEY DISEASE,ADM001,TRANSFUSION OF BLOOD AND BLOOD PRODUCTS,470,CHRONIC KIDNEY DISEASE,11,DISEASES AND DISORDERS OF THE KIDNEY AND URINARY TRACT,2,Moderate,Moderate,Medical,Medicaid,Medicaid,,,,true,10367.5,5371.02
Capital/Adirond,Albany,0101000,000001,Albany Medical Center Hospital,50 to 69,122,F,White,Not Span/Hispanic,1,Elective,Home or Self Care,2019,GEN003,CHRONIC KIDNEY DISEASE,,,470,CHRONIC KIDNEY DISEASE,11,DISEASES AND DISORDERS OF THE KIDNEY AND URINARY TRACT,2,Moderate,Moderate,Medical,Federal/State/Local/VA,Medicare,Private Health Insurance,,,false,7684.07,1924.06