Hospital Service Area,Hospital County,Operating Certificate Number,Permanent Facility Id,Facility Name,Age Group,Zip Code - 3 digits,Gender,Race,Ethnicity,Length of Stay,Type of Admission,Patient Disposition,Discharge Year,CCS Diagnosis Code,CCS Diagnosis Description,CCS Procedure Code,CCS Procedure Description,APR DRG Code,APR DRG Description,APR MDC Code,APR MDC Description,APR Severity of Illness Code,APR Severity of Illness Description,APR Risk of Mortality,APR Medical Surgical Description,Payment Typology 1,Payment Typology 2,Payment Typology 3,Birth Weight,Abortion Edit Indicator,Emergency Department Indicator,Total Charges,Total Costs
New York City,Bronx,7000006,003058,Montefiore Med Center - Jack D Weiler Hosp of A Einstein College Div,70 or Older,104,F,Black/African American,Not Span/Hispanic,6,Emergency,Home or Self Care,2020,GEN003,CHRONIC KIDNEY DISEASE,ADM017,ADMINISTRATION OF NUTRITIONAL AND ELECTROLYTIC SUBSTANCES,470,CHRONIC KIDNEY DISEASE,11,DISEASES AND DISORDERS OF THE KIDNEY AND URINARY TRACT,3,Major,Major,Medical,Medicare,,,,,Y,87722.39,15406.09
New York City,Bronx,7000006,003058,Montefiore Med Center - Jack D Weiler Hosp of A Einstein College Div,70 or Older,104,M,Black/African American,Not Span/Hispanic,7,Emergency,Home or Self Care,2020,GEN003,CHRONIC KIDNEY DISEASE,,,470,CHRONIC KIDNEY DISEASE,11,DISEASES AND DISORDERS OF THE KIDNEY AND URINARY TRACT,3,Major,Moderate,Medical,Medicare,,,,,Y,86386.22,15889.43
New York City,Bronx,7000006,001168,Montefiore Medical Center-Wakefield Hospital,50 to 69,104,M,Black/African American,Not Span/Hispanic,6,Emergency,Skilled Nursing Home,2020,GEN003,CHRONIC KIDNEY DISEASE,ADM001,TRANSFUSION OF BLOOD AND BLOOD PRODUCTS,470,CHRONIC KIDNEY DISEASE,11,DISEASES AND DISORDERS OF THE KIDNEY AND URINARY TRACT,2,Moderate,Moderate,Medical,Medicaid,,,,,Y,81401.96,14189.12
Hudson Valley,Westchester,5903001,001061,Montefiore Mount Vernon Hospital,50 to 69,125,M,Other Race,Unknown,1,Emergency,Court/Law Enforcement,2020,GEN003,CHRONIC KIDNEY DISEASE,ESA001,HEMODIALYSIS,470,CHRONIC KIDNEY DISEASE,11,DISEASES AND DISORDERS OF THE KIDNEY AND URINARY TRACT,2,Moderate,Moderate,Medical,Department of Corrections,Self-Pay,,,,N,6794.48,2538.33
Hudson Valley,Westchester,5903001,001061,Montefiore Mount Vernon Hospital,50 to 69,105,F,Black/African American,Unknown,2,Emergency,Short-term Hospital,2020,GEN003,CHRONIC KIDNEY DISEASE,,,470,CHRONIC KIDNEY DISEASE,11,DISEASES AND DISORDERS OF THE KIDNEY AND URINARY TRACT,3,Major,Major,Medical,Medicare,Medicare,Medicaid,,,Y,17173.1,6578.11
New York City,Bronx,7000006,001168,Montefiore Medical Center-Wakefield Hospital,70 or Older,104,M,Black/African American,Spanish/Hispanic,21,Emergency,Skilled Nursing Home,2020,GEN003,CHRONIC KIDNEY DISEASE,GIS017,GASTROSTOMY,470,CHRONIC KIDNEY DISEASE,11,DISEASES AND DISORDERS OF THE KIDNEY AND URINARY TRACT,4,Extreme,Extreme,Medical,Medicare,Medicaid,,,,Y,252586.68,50177.58
New York City,Bronx,7000006,001169,Montefiore Medical Center - Henry & Lucy Moses Div,30 to 49,104,M,Black/African American,Not Span/Hispanic,13,Emergency,Left Against Medical Advice,2020,GEN003,CHRONIC KIDNEY DISEASE,GIS001,ESOPHAGOGASTRODUODENOSCOPY (EGD) WITH BIOPSY,470,CHRONIC KIDNEY DISEASE,11,DISEASES AND DISORDERS OF THE KIDNEY AND URINARY TRACT,3,Major,Major,Medical,Medicaid,,,,,Y,151160.22,30594.35
New York City,Bronx,7000006,003058,Montefiore Med Center - Jack D Weiler Hosp of A Einstein College Div,50 to 69,104,M,Other Race,Not Span/Hispanic,6,Emergency,Home or Self Care,2020,GEN003,CHRONIC KIDNEY DISEASE,CAR024,VENOUS AND ARTERIAL CATHETER PLACEMENT,470,CHRONIC KIDNEY DISEASE,11,DISEASES AND DISORDERS OF THE KIDNEY AND URINARY TRACT,3,Major,Major,Medical,Medicaid,,,,,Y,124111.87,22468.9
New York City,Bronx,7000006,001169,Montefiore Medical Center - Henry & Lucy Moses Div,50 to 69,104,M,Black/African American,Not Span/Hispanic,4,Emergency,Skilled Nursing Home,2020,GEN003,CHRONIC KIDNEY DISEASE,ADM001,TRANSFUSION OF BLOOD AND BLOOD PRODUCTS,470,CHRONIC KIDNEY DISEASE,11,DISEASES AND DISORDERS OF THE KIDNEY AND URINARY TRACT,3,Major,Major,Medical,Medicare,Medicaid,,,,Y,63789.74,11239.84
New York City,Bronx,7000006,001169,Montefiore Medical Center - Henry & Lucy Moses Div,50 to 69,104,F,Other Race,Not Span/Hispanic,2,Emergency,Home or Self Care,2020,GEN003,CHRONIC KIDNEY DISEASE,,,470,CHRONIC KIDNEY DISEASE,11,DISEASES AND DISORDERS OF THE KIDNEY AND URINARY TRACT,1,Minor,Moderate,Medical,Medicaid,,,,,N,62669.79,10642.19
New York City,Bronx,7000006,001169,Montefiore Medical Center - Henry & Lucy Moses Div,50 to 69,105,F,Black/African American,Not Span/Hispanic,1,Emergency,Home or Self Care,2020,GEN003,CHRONIC KIDNEY DISEASE,,,470,CHRONIC KIDNEY DISEASE,11,DISEASES AND DISORDERS OF THE KIDNEY AND URINARY TRACT,3,Major,Major,Medical,Medicare,Private Health Insurance,,,,N,37935.19,4881.99
New York City,Bronx,7000006,001168,Montefiore Medical Center-Wakefield Hospital,70 or Older,104,F,White,Not Span/Hispanic,8,Emergency,Skilled Nursing Home,2020,GEN003,CHRONIC KIDNEY DISEASE,ADM016,ADMINISTRATION OF ANTI-INFLAMMATORY AGENTS,470,CHRONIC KIDNEY DISEASE,11,DISEASES AND DISORDERS OF THE KIDNEY AND URINARY TRACT,2,Moderate,Major,Medical,Medicare,,,,,Y,88911.84,17805.97
New York City,Bronx,7000006,001169,Montefiore Medical Center - Henry & Lucy Moses Div,30 to 49,104,F,Black/African American,Not Span/Hispanic,1,Emergency,Home or Self Care,2020,GEN003,CHRONIC KIDNEY DISEASE,ESA001,HEMODIALYSIS,470,CHRONIC KIDNEY DISEASE,11,DISEASES AND DISORDERS OF THE KIDNEY AND URINARY TRACT,2,Moderate,Major,Medical,Medicare,Medicaid,,,,Y,20619.68,2830.39
New York City,Manhattan,7002002,001439,Mount Sinai Beth Israel,70 or Older,100,M,Other Race,Unknown,2,Emergency,Home or Self Care,2020,GEN003,CHRONIC KIDNEY DISEASE,ESA001,HEMODIALYSIS,470,CHRONIC KIDNEY DISEASE,11,DISEASES AND DISORDERS OF THE KIDNEY AND URINARY TRACT,3,Major,Extreme,Medical,Medicare,Medicaid,Self-Pay,,,Y,30375.12,8291.24
New York City,Bronx,7000006,001169,Montefiore Medical Center - Henry & Lucy Moses Div,50 to 69,104,F,Other Race,Spanish/Hispanic,15,Emergency,Home or Self Care,2020,GEN003,CHRONIC KIDNEY DISEASE,ADM001,TRANSFUSION OF BLOOD AND BLOOD PRODUCTS,470,CHRONIC KIDNEY DISEASE,11,DISEASES AND DISORDERS OF THE KIDNEY AND URINARY TRACT,3,Major,Major,Medical,Private Health Insurance,,,,,Y,226243.07,38901.58
Hudson Valley,Westchester,5901000,001039,NewYork-Presbyterian/Hudson Valley Hospital,30 to 49,105,M,Black/African American,Not Span/Hispanic,14,Emergency,Home or Self Care,2020,GEN003,CHRONIC KIDNEY DISEASE,CAR024,VENOUS AND ARTERIAL CATHETER PLACEMENT,470,CHRONIC KIDNEY DISEASE,11,DISEASES AND DISORDERS OF THE KIDNEY AND URINARY TRACT,3,Major,Major,Medical,Medicaid,,,,,Y,184801.95,63922.29
New York City,Manhattan,7002024,001456,Mount Sinai Hospital,70 or Older,104,F,Other Race,Not Span/Hispanic,5,Emergency,Skilled Nursing Home,2020,GEN003,CHRONIC KIDNEY DISEASE,ADM001,TRANSFUSION OF BLOOD AND BLOOD PRODUCTS,470,CHRONIC KIDNEY DISEASE,11,DISEASES AND DISORDERS OF THE KIDNEY AND URINARY TRACT,3,Major,Major,Medical,Medicare,Medicaid,Self-Pay,,,Y,63997.98,16398.17
New York City,Bronx,7000006,001168,Montefiore Medical Center-Wakefield Hospital,50 to 69,104,F,Other Race,Unknown,4,Emergency,Home w/ Home Health Services,2020,GEN003,CHRONIC KIDNEY DISEASE,URN002,KIDNEY AND OTHER URINARY TRACT BIOPSY (NON-ENDOSCOPIC),470,CHRONIC KIDNEY DISEASE,11,DISEASES AND DISORDERS OF THE KIDNEY AND URINARY TRACT,2,Moderate,Moderate,Medical,Medicaid,,,,,Y,74979.71,12593.09
New York City,Bronx,7000006,003058,Montefiore Med Center - Jack D Weiler Hosp of A Einstein College Div,50 to 69,104,M,Other Race,Spanish/Hispanic,3,Emergency,Home or Self Care,2020,GEN003,CHRONIC KIDNEY DISEASE,,,470,CHRONIC KIDNEY DISEASE,11,DISEASES AND DISORDERS OF THE KIDNEY AND URINARY TRACT,2,Moderate,Moderate,Medical,Medicaid,,,,,Y,48835.67,7786.99
New York City,Bronx,7000006,001169,Montefiore Medical Center - Henry & Lucy Moses Div,50 to 69,104,F,Black/African American,Not Span/Hispanic,4,Emergency,Home or Self Care,2020,GEN003,CHRONIC KIDNEY DISEASE,ADM001,TRANSFUSION OF BLOOD AND BLOOD PRODUCTS,470,CHRONIC KIDNEY DISEASE,11,DISEASES AND DISORDERS OF THE KIDNEY AND URINARY TRACT,3,Major,Extreme,Medical,Medicare,Medicaid,,,,Y,88655.23,13584.46
New York City,Bronx,7000006,001169,Montefiore Medical Center - Henry & Lucy Moses Div,30 to 49,104,F,Black/African American,Not Span/Hispanic,1,Emergency,Home or Self Care,2020,GEN003,CHRONIC KIDNEY DISEASE,,,470,CHRONIC KIDNEY DISEASE,11,DISEASES AND DISORDERS OF THE KIDNEY AND URINARY TRACT,2,Moderate,Moderate,Medical,Medicare,Medicaid,,,,N,21465,4222.51
Hudson Valley,Westchester,5904001,001072,Montefiore New Rochelle Hospital,70 or Older,108,M,Other Race,Unknown,3,Emergency,Home w/ Home Health Services,2020,GEN003,CHRONIC KIDNEY DISEASE,ADM016,ADMINISTRATION OF ANTI-INFLAMMATORY AGENTS,470,CHRONIC KIDNEY DISEASE,11,DISEASES AND DISORDERS OF THE KIDNEY AND URINARY TRACT,3,Major,Major,Medical,Medicare,Medicare,Medicaid,,,Y,24958.2,8025.59
Hudson Valley,Westchester,5904001,001072,Montefiore New Rochelle Hospital,70 or Older,108,F,White,Unknown,2,Emergency,Home or Self Care,2020,GEN003,CHRONIC KIDNEY DISEASE,ADM001,TRANSFUSION OF BLOOD AND BLOOD PRODUCTS,470,CHRONIC KIDNEY DISEASE,11,DISEASES AND DISORDERS OF THE KIDNEY AND URINARY TRACT,3,Major,Major,Medical,Medicare,Medicare,Private Health Insurance,,,Y,20180.16,10329.44
Hudson Valley,Westchester,5904001,001072,Montefiore New Rochelle Hospital,70 or Older,108,M,Black/African American,Unknown,1,Emergency,Home or Self Care,2020,GEN003,CHRONIC KIDNEY DISEASE,ADM001,TRANSFUSION OF BLOOD AND BLOOD PRODUCTS,470,CHRONIC KIDNEY DISEASE,11,DISEASES AND DISORDERS OF THE KIDNEY AND URINARY TRACT,2,Moderate,Minor,Medical,Medicare,Medicare,Self-Pay,,,Y,9703.92,2857.44
New York City,Bronx,7000006,003058,Montefiore Med Center - Jack D Weiler Hosp of A Einstein College Div,70 or Older,104,M,Black/African American,Not Span/Hispanic,4,Emergency,Home or Self Care,2020,GEN003,CHRONIC KIDNEY DISEASE,ADM021,"ADMINISTRATION OF THERAPEUTIC SUBSTANCES, NEC",470,CHRONIC KIDNEY DISEASE,11,DISEASES AND DISORDERS OF THE KIDNEY AND URINARY TRACT,2,Moderate,Major,Medical,Medicare,,,,,Y,48195.99,8080.8
New York City,Bronx,7000006,001169,Montefiore Medical Center - Henry & Lucy Moses Div,70 or Older,104,F,Black/African American,Not Span/Hispanic,12,Emergency,Skilled Nursing Home,2020,GEN003,CHRONIC KIDNEY DISEASE,ESA001,HEMODIALYSIS,470,CHRONIC KIDNEY DISEASE,11,DISEASES AND DISORDERS OF THE KIDNEY AND URINARY TRACT,3,Major,Moderate,Medical,Medicare,Medicaid,,,,Y,158493.42,29362.54
New York City,Manhattan,7002054,003975,New York Presbyterian Hospital - Allen Hospital,70 or Older,104,F,Black/African American,Not Span/Hispanic,8,Emergency,Hospice - Medical Facility,2020,GEN003,CHRONIC KIDNEY DISEASE,URN006,BLADDER CATHETERIZATION AND DRAINAGE,470,CHRONIC KIDNEY DISEASE,11,DISEASES AND DISORDERS OF THE KIDNEY AND URINARY TRACT,3,Major,Moderate,Medical,Medicare,Medicaid,Self-Pay,,,Y,91722.25,19781.65
New York City,Manhattan,7002054,003975,New York Presbyterian Hospital - Allen Hospital,70 or Older,100,M,Other Race,Multi-ethnic,2,Emergency,Home or Self Care,2020,GEN003,CHRONIC KIDNEY DISEASE,,,470,CHRONIC KIDNEY DISEASE,11,DISEASES AND DISORDERS OF THE KIDNEY AND URINARY TRACT,3,Major,Major,Medical,Medicare,Medicare,Medicaid,,,Y,28240.11,6241.66
New York City,Manhattan,7002054,001464,New York-Presbyterian Hospital - Columbia Presbyterian Center,50 to 69,100,M,Other Race,Not Span/Hispanic,5,Emergency,Skilled Nursing Home,2020,GEN003,CHRONIC KIDNEY DISEASE,ESA001,HEMODIALYSIS,470,CHRONIC KIDNEY DISEASE,11,DISEASES AND DISORDERS OF THE KIDNEY AND URINARY TRACT,3,Major,Moderate,Medical,Medicaid,Medicaid,Self-Pay,,,Y,68914.9,15932.35
New York City,Manhattan,7002054,001464,New York-Presbyterian Hospital - Columbia Presbyterian Center,50 to 69,104,M,White,Spanish/Hispanic,1,Emergency,Home or Self Care,2020,GEN003,CHRONIC KIDNEY DISEASE,ESA001,HEMODIALYSIS,470,CHRONIC KIDNEY DISEASE,11,DISEASES AND DISORDERS OF THE KIDNEY AND URINARY TRACT,2,Moderate,Moderate,Medical,Medicaid,Medicaid,Self-Pay,,,Y,19430.1,4529.85
New York City,Manhattan,7002054,001464,New York-Presbyterian Hospital - Columbia Presbyterian Center,50 to 69,100,M,Other Race,Not Span/Hispanic,5,Emergency,Home or Self Care,2020,GEN003,CHRONIC KIDNEY DISEASE,ESA001,HEMODIALYSIS,470,CHRONIC KIDNEY DISEASE,11,DISEASES AND DISORDERS OF THE KIDNEY AND URINARY TRACT,3,Major,Moderate,Medical,Medicaid,Self-Pay,,,,Y,75024.01,17858.11
New York City,Manhattan,7002024,001456,Mount Sinai Hospital,50 to 69,100,F,Black/African American,Not Span/Hispanic,1,Emergency,Skilled Nursing Home,2020,GEN003,CHRONIC KIDNEY DISEASE,ADM001,TRANSFUSION OF BLOOD AND BLOOD PRODUCTS,470,CHRONIC KIDNEY DISEASE,11,DISEASES AND DISORDERS OF THE KIDNEY AND URINARY TRACT,3,Major,Moderate,Medical,Medicare,Medicaid,Self-Pay,,,Y,21864.56,5019.18
New York City,Manhattan,7002024,001456,Mount Sinai Hospital,70 or Older,104,M,White,Not Span/Hispanic,2,Emergency,Home w/ Home Health Services,2020,GEN003,CHRONIC KIDNEY DISEASE,OTR004,ISOLATION PROCEDURES,470,CHRONIC KIDNEY DISEASE,11,DISEASES AND DISORDERS OF THE KIDNEY AND URINARY TRACT,2,Moderate,Major,Medical,Medicare,Medicaid,Self-Pay,,,Y,28357.65,6905.2
New York City,Queens,7003010,001637,New York - Presbyterian/Queens,70 or Older,113,F,Black/African American,Not Span/Hispanic,3,Emergency,Skilled Nursing Home,2020,GEN003,CHRONIC KIDNEY DISEASE,ADM001,TRANSFUSION OF BLOOD AND BLOOD PRODUCTS,470,CHRONIC KIDNEY DISEASE,11,DISEASES AND DISORDERS OF THE KIDNEY AND URINARY TRACT,2,Moderate,Minor,Medical,Medicare,Medicaid,Self-Pay,,,Y,34310.7,7363.8
New York City,Queens,7003010,001637,New York - Presbyterian/Queens,70 or Older,113,F,Other Race,Not Span/Hispanic,9,Emergency,Skilled Nursing Home,2020,GEN003,CHRONIC KIDNEY DISEASE,CAR025,PLACEMENT OF TUNNELED OR IMPLANTABLE PORTION OF A VASCULAR ACCESS DEVICE,470,CHRONIC KIDNEY DISEASE,11,DISEASES AND DISORDERS OF THE KIDNEY AND URINARY TRACT,3,Major,Major,Medical,Medicare,Medicaid,Self-Pay,,,Y,159950.4,43508.56
New York City,Bronx,7000006,001168,Montefiore Medical Center-Wakefield Hospital,30 to 49,104,F,Black/African American,Not Span/Hispanic,1,Emergency,Home or Self Care,2020,GEN003,CHRONIC KIDNEY DISEASE,ESA001,HEMODIALYSIS,470,CHRONIC KIDNEY DISEASE,11,DISEASES AND DISORDERS OF THE KIDNEY AND URINARY TRACT,3,Major,Moderate,Medical,Medicaid,,,,,Y,32820.86,5314.05
New York City,Bronx,7000006,003058,Montefiore Med Center - Jack D Weiler Hosp of A Einstein College Div,30 to 49,104,M,Other Race,Unknown,3,Emergency,Home or Self Care,2020,GEN003,CHRONIC KIDNEY DISEASE,ADM021,"ADMINISTRATION OF THERAPEUTIC SUBSTANCES, NEC",470,CHRONIC KIDNEY DISEASE,11,DISEASES AND DISORDERS OF THE KIDNEY AND URINARY TRACT,3,Major,Moderate,Medical,Medicaid,,,,,N,57226.64,10548.24
New York City,Queens,7003010,001637,New York - Presbyterian/Queens,50 to 69,114,F,Black/African American,Not Span/Hispanic,11,Emergency,Skilled Nursing Home,2020,GEN003,CHRONIC KIDNEY DISEASE,CAR024,VENOUS AND ARTERIAL CATHETER PLACEMENT,470,CHRONIC KIDNEY DISEASE,11,DISEASES AND DISORDERS OF THE KIDNEY AND URINARY TRACT,3,Major,Major,Medical,Medicare,Medicaid,Self-Pay,,,Y,94197.22,23478.97
New York City,Queens,7003010,001637,New York - Presbyterian/Queens,30 to 49,113,M,Black/African American,Not Span/Hispanic,2,Emergency,Skilled Nursing Home,2020,GEN003,CHRONIC KIDNEY DISEASE,ADM001,TRANSFUSION OF BLOOD AND BLOOD PRODUCTS,470,CHRONIC KIDNEY DISEASE,11,DISEASES AND DISORDERS OF THE KIDNEY AND URINARY TRACT,3,Major,Minor,Medical,Medicaid,Self-Pay,,,,Y,25201.4,5994.27
New York City,Queens,7003010,001637,New York - Presbyterian/Queens,70 or Older,113,F,White,Spanish/Hispanic,17,Emergency,Skilled Nursing Home,2020,GEN003,CHRONIC KIDNEY DISEASE,CAR025,PLACEMENT OF TUNNELED OR IMPLANTABLE PORTION OF A VASCULAR ACCESS DEVICE,470,CHRONIC KIDNEY DISEASE,11,DISEASES AND DISORDERS OF THE KIDNEY AND URINARY TRACT,3,Major,Major,Medical,Medicare,Self-Pay,,,,Y,150240.45,34940.03
New York City,Bronx,7000006,003058,Montefiore Med Center - Jack D Weiler Hosp of A Einstein College Div,50 to 69,104,M,Black/African American,Not Span/Hispanic,5,Emergency,Home or Self Care,2020,GEN003,CHRONIC KIDNEY DISEASE,ESA001,HEMODIALYSIS,470,CHRONIC KIDNEY DISEASE,11,DISEASES AND DISORDERS OF THE KIDNEY AND URINARY TRACT,2,Moderate,Moderate,Medical,Private Health Insurance,,,,,Y,43509.27,7253.38
New York City,Kings,7001037,001320,University Hospital of Brooklyn,30 to 49,112,M,Black/African American,Not Span/Hispanic,12,Emergency,Home or Self Care,2020,GEN003,CHRONIC KIDNEY DISEASE,ESA001,HEMODIALYSIS,470,CHRONIC KIDNEY DISEASE,11,DISEASES AND DISORDERS OF THE KIDNEY AND URINARY TRACT,3,Major,Moderate,Medical,Medicare,Medicaid,Self-Pay,,,Y,76434,52228.86
New York City,Kings,7001037,001320,University Hospital of Brooklyn,30 to 49,112,F,Black/African American,Not Span/Hispanic,1,Emergency,Home or Self Care,2020,GEN003,CHRONIC KIDNEY DISEASE,ESA001,HEMODIALYSIS,470,CHRONIC KIDNEY DISEASE,11,DISEASES AND DISORDERS OF THE KIDNEY AND URINARY TRACT,2,Moderate,Moderate,Medical,Medicaid,Medicaid,Self-Pay,,,Y,8542,4802.4
New York City,Queens,7003010,001637,New York - Presbyterian/Queens,50 to 69,113,M,Other Race,Not Span/Hispanic,6,Emergency,Home or Self Care,2020,GEN003,CHRONIC KIDNEY DISEASE,CAR024,VENOUS AND ARTERIAL CATHETER PLACEMENT,470,CHRONIC KIDNEY DISEASE,11,DISEASES AND DISORDERS OF THE KIDNEY AND URINARY TRACT,3,Major,Major,Medical,"Managed Care, Unspecified",Medicaid,Self-Pay,,,Y,71865.09,17731.4
New York City,Kings,7001037,001320,University Hospital of Brooklyn,50 to 69,112,M,Other Race,Not Span/Hispanic,6,Emergency,Home w/ Home Health Services,2020,GEN003,CHRONIC KIDNEY DISEASE,CAR025,PLACEMENT OF TUNNELED OR IMPLANTABLE PORTION OF A VASCULAR ACCESS DEVICE,470,CHRONIC KIDNEY DISEASE,11,DISEASES AND DISORDERS OF THE KIDNEY AND URINARY TRACT,2,Moderate,Moderate,Medical,Medicare,Medicare,Medicare,,,Y,41619.4,27961.75
New York City,Manhattan,7002054,001437,New York-Presbyterian/Lower Manhattan Hospital,50 to 69,104,F,White,Spanish/Hispanic,10,Emergency,Home w/ Home Health Services,2020,GEN003,CHRONIC KIDNEY DISEASE,CAR025,PLACEMENT OF TUNNELED OR IMPLANTABLE PORTION OF A VASCULAR ACCESS DEVICE,470,CHRONIC KIDNEY DISEASE,11,DISEASES AND DISORDERS OF THE KIDNEY AND URINARY TRACT,3,Major,Moderate,Medical,Medicare,Self-Pay,,,,Y,130352.74,31451.65
New York City,Kings,7001037,001320,University Hospital of Brooklyn,30 to 49,112,M,Black/African American,Not Span/Hispanic,3,Emergency,Home w/ Home Health Services,2020,GEN003,CHRONIC KIDNEY DISEASE,IMG008,ULTRASONOGRAPHY,470,CHRONIC KIDNEY DISEASE,11,DISEASES AND DISORDERS OF THE KIDNEY AND URINARY TRACT,2,Moderate,Moderate,Medical,Medicare,Medicare,Medicaid,,,Y,19907,13975.46
New York City,Manhattan,7002054,001458,New York-Presbyterian Hospital - New York Weill Cornell Center,50 to 69,104,M,Black/African American,Not Span/Hispanic,7,Emergency,Home or Self Care,2020,GEN003,CHRONIC KIDNEY DISEASE,ESA001,HEMODIALYSIS,470,CHRONIC KIDNEY DISEASE,11,DISEASES AND DISORDERS OF THE KIDNEY AND URINARY TRACT,2,Moderate,Moderate,Medical,Medicare,Medicaid,Self-Pay,,,Y,97219.79,21748.41
New York City,Kings,7001021,001306,New York - Presbyterian Brooklyn Methodist Hospital,70 or Older,114,F,Black/African American,Not Span/Hispanic,13,Emergency,Home w/ Home Health Services,2020,GEN003,CHRONIC KIDNEY DISEASE,CAR024,VENOUS AND ARTERIAL CATHETER PLACEMENT,470,CHRONIC KIDNEY DISEASE,11,DISEASES AND DISORDERS OF THE KIDNEY AND URINARY TRACT,3,Major,Moderate,Medical,Private Health Insurance,Medicare,,,,N,120160.62,36565
New York City,Kings,7001021,001306,New York - Presbyterian Brooklyn Methodist Hospital,30 to 49,112,M,Black/African American,Not Span/Hispanic,1,Emergency,Home or Self Care,2020,GEN003,CHRONIC KIDNEY DISEASE,ESA001,HEMODIALYSIS,470,CHRONIC KIDNEY DISEASE,11,DISEASES AND DISORDERS OF THE KIDNEY AND URINARY TRACT,2,Moderate,Minor,Medical,Medicare,Self-Pay,,,,Y,11005.35,3268.07
New York City,Kings,7001021,001306,New York - Presbyterian Brooklyn Methodist Hospital,70 or Older,112,F,White,Not Span/Hispanic,6,Emergency,Left Against Medical Advice,2020,GEN003,CHRONIC KIDNEY DISEASE,ESA003,MECHANICAL VENTILATION,470,CHRONIC KIDNEY DISEASE,11,DISEASES AND DISORDERS OF THE KIDNEY AND URINARY TRACT,4,Extreme,Major,Medical,Medicare,Medicaid,Self-Pay,,,Y,69544.79,22132.31
New York City,Manhattan,7002054,001458,New York-Presbyterian Hospital - New York Weill Cornell Center,50 to 69,115,M,White,Not Span/Hispanic,1,Emergency,Home or Self Care,2020,GEN003,CHRONIC KIDNEY DISEASE,ESA001,HEMODIALYSIS,470,CHRONIC KIDNEY DISEASE,11,DISEASES AND DISORDERS OF THE KIDNEY AND URINARY TRACT,2,Moderate,Moderate,Medical,Blue Cross/Blue Shield,Self-Pay,,,,Y,28370.64,7525.21
New York City,Kings,7001021,001306,New York - Presbyterian Brooklyn Methodist Hospital,50 to 69,112,F,Black/African American,Not Span/Hispanic,5,Emergency,Home or Self Care,2020,GEN003,CHRONIC KIDNEY DISEASE,CAR024,VENOUS AND ARTERIAL CATHETER PLACEMENT,470,CHRONIC KIDNEY DISEASE,11,DISEASES AND DISORDERS OF THE KIDNEY AND URINARY TRACT,2,Moderate,Moderate,Medical,Medicaid,Self-Pay,,,,Y,36648.31,10623.62
New York City,Manhattan,7002054,001458,New York-Presbyterian Hospital - New York Weill Cornell Center,0 to 17,112,M,Black/African American,Not Span/Hispanic,3,Emergency,Home or Self Care,2020,GEN003,CHRONIC KIDNEY DISEASE,ESA001,HEMODIALYSIS,470,CHRONIC KIDNEY DISEASE,11,DISEASES AND DISORDERS OF THE KIDNEY AND URINARY TRACT,2,Moderate,Minor,Medical,"Managed Care, Unspecified",Medicaid,Self-Pay,,,N,55336.39,27916.24
New York City,Kings,7001021,001306,New York - Presbyterian Brooklyn Methodist Hospital,50 to 69,112,F,Black/African American,Not Span/Hispanic,3,Emergency,Home or Self Care,2020,GEN003,CHRONIC KIDNEY DISEASE,ESA001,HEMODIALYSIS,470,CHRONIC KIDNEY DISEASE,11,DISEASES AND DISORDERS OF THE KIDNEY AND URINARY TRACT,3,Major,Moderate,Medical,Medicare,Medicaid,Self-Pay,,,Y,31051.05,9107.35
New York City,Manhattan,7002054,001458,New York-Presbyterian Hospital - New York Weill Cornell Center,50 to 69,OOS,F,Other Race,Not Span/Hispanic,2,Elective,Home or Self Care,2020,GEN003,CHRONIC KIDNEY DISEASE,IMG002,FLUOROSCOPIC ANGIOGRAPHY (EXCLUDING CORONARY),470,CHRONIC KIDNEY DISEASE,11,DISEASES AND DISORDERS OF THE KIDNEY AND URINARY TRACT,2,Moderate,Moderate,Medical,Private Health Insurance,Self-Pay,,,,N,44253.6,12274.81
New York City,Kings,7001021,001306,New York - Presbyterian Brooklyn Methodist Hospital,70 or Older,112,M,Black/African American,Not Span/Hispanic,4,Emergency,Home w/ Home Health Services,2020,GEN003,CHRONIC KIDNEY DISEASE,MAM011,ELECTROENCEPHALOGRAM (EEG),470,CHRONIC KIDNEY DISEASE,11,DISEASES AND DISORDERS OF THE KIDNEY AND URINARY TRACT,3,Major,Major,Medical,Medicare,Medicaid,Self-Pay,,,Y,41116.1,11901.2
New York City,Kings,7001021,001306,New York - Presbyterian Brooklyn Methodist Hospital,30 to 49,112,F,Black/African American,Not Span/Hispanic,5,Emergency,Home w/ Home Health Services,2020,GEN003,CHRONIC KIDNEY DISEASE,IMG008,ULTRASONOGRAPHY,470,CHRONIC KIDNEY DISEASE,11,DISEASES AND DISORDERS OF THE KIDNEY AND URINARY TRACT,3,Major,Moderate,Medical,Medicare,Medicaid,Self-Pay,,,Y,35930.52,10287.81
New York City,Kings,7001021,001306,New York - Presbyterian Brooklyn Methodist Hospital,70 or Older,112,F,Black/African American,Not Span/Hispanic,7,Emergency,Home w/ Home Health Services,2020,GEN003,CHRONIC KIDNEY DISEASE,ESA001,HEMODIALYSIS,470,CHRONIC KIDNEY DISEASE,11,DISEASES AND DISORDERS OF THE KIDNEY AND URINARY TRACT,3,Major,Major,Medical,Medicare,Blue Cross/Blue Shield,Self-Pay,,,Y,50461.39,14912.01