Hospital Service Area,Hospital County,Operating Certificate Number,Permanent Facility Id,Facility Name,Age Group,Zip Code - 3 digits,Gender,Race,Ethnicity,Length of Stay,Type of Admission,Patient Disposition,Discharge Year,CCS Diagnosis Code,CCS Diagnosis Description,CCS Procedure Code,CCS Procedure Description,APR DRG Code,APR DRG Description,APR MDC Code,APR MDC Description,APR Severity of Illness Code,APR Severity of Illness Description,APR Risk of Mortality,APR Medical Surgical Description,Payment Typology 1,Payment Typology 2,Payment Typology 3,Birth Weight,Abortion Edit Indicator,Emergency Department Indicator,Total Charges,Total Costs
Long Island,Nassau,2908000,000511,NYU Langone Hospital-Long Island,50 to 69,115,M,Black/African American,Not Span/Hispanic,7,Emergency,Home or Self Care,2020,GEN003,CHRONIC KIDNEY DISEASE,ESA001,HEMODIALYSIS,470,CHRONIC KIDNEY DISEASE,11,DISEASES AND DISORDERS OF THE KIDNEY AND URINARY TRACT,3,Major,Major,Medical,Private Health Insurance,,,,,Y,133244.01,42835.48
Long Island,Nassau,2908000,000511,NYU Langone Hospital-Long Island,18 to 29,115,F,Black/African American,Not Span/Hispanic,16,Emergency,Home or Self Care,2020,GEN003,CHRONIC KIDNEY DISEASE,CAR025,PLACEMENT OF TUNNELED OR IMPLANTABLE PORTION OF A VASCULAR ACCESS DEVICE,470,CHRONIC KIDNEY DISEASE,11,DISEASES AND DISORDERS OF THE KIDNEY AND URINARY TRACT,3,Major,Moderate,Medical,Private Health Insurance,,,,,Y,336645.47,103208.41
Long Island,Nassau,2908000,000511,NYU Langone Hospital-Long Island,50 to 69,115,F,White,Not Span/Hispanic,19,Emergency,Home w/ Home Health Services,2020,GEN003,CHRONIC KIDNEY DISEASE,ESA001,HEMODIALYSIS,470,CHRONIC KIDNEY DISEASE,11,DISEASES AND DISORDERS OF THE KIDNEY AND URINARY TRACT,3,Major,Major,Medical,Medicare,,,,,Y,286130.54,81329.08
Long Island,Nassau,2908000,000511,NYU Langone Hospital-Long Island,70 or Older,110,F,Other Race,Not Span/Hispanic,1,Emergency,Home w/ Home Health Services,2020,GEN003,CHRONIC KIDNEY DISEASE,ADM001,TRANSFUSION OF BLOOD AND BLOOD PRODUCTS,470,CHRONIC KIDNEY DISEASE,11,DISEASES AND DISORDERS OF THE KIDNEY AND URINARY TRACT,3,Major,Minor,Medical,Private Health Insurance,,,,,Y,30084.39,11090.59
Long Island,Nassau,2908000,000511,NYU Langone Hospital-Long Island,50 to 69,112,M,Black/African American,Not Span/Hispanic,4,Emergency,Home or Self Care,2020,GEN003,CHRONIC KIDNEY DISEASE,,,470,CHRONIC KIDNEY DISEASE,11,DISEASES AND DISORDERS OF THE KIDNEY AND URINARY TRACT,3,Major,Major,Medical,Medicare,Private Health Insurance,,,,Y,77541.45,17172.35
Long Island,Nassau,2908000,000511,NYU Langone Hospital-Long Island,30 to 49,115,M,White,Not Span/Hispanic,3,Emergency,Home or Self Care,2020,GEN003,CHRONIC KIDNEY DISEASE,,,470,CHRONIC KIDNEY DISEASE,11,DISEASES AND DISORDERS OF THE KIDNEY AND URINARY TRACT,3,Major,Moderate,Medical,Medicaid,,,,,Y,47549.11,13543.23
Long Island,Nassau,2908000,000511,NYU Langone Hospital-Long Island,30 to 49,114,M,Other Race,Not Span/Hispanic,6,Emergency,Home or Self Care,2020,GEN003,CHRONIC KIDNEY DISEASE,CAR025,PLACEMENT OF TUNNELED OR IMPLANTABLE PORTION OF A VASCULAR ACCESS DEVICE,470,CHRONIC KIDNEY DISEASE,11,DISEASES AND DISORDERS OF THE KIDNEY AND URINARY TRACT,3,Major,Moderate,Medical,Private Health Insurance,,,,,Y,157944.35,48235.97
Long Island,Nassau,2908000,000511,NYU Langone Hospital-Long Island,70 or Older,117,M,White,Not Span/Hispanic,3,Emergency,Skilled Nursing Home,2020,GEN003,CHRONIC KIDNEY DISEASE,,,470,CHRONIC KIDNEY DISEASE,11,DISEASES AND DISORDERS OF THE KIDNEY AND URINARY TRACT,1,Minor,Moderate,Medical,Medicare,Blue Cross/Blue Shield,,,,Y,43646.95,11671.38
Long Island,Nassau,2908000,000511,NYU Langone Hospital-Long Island,0 to 17,114,M,Other Race,Not Span/Hispanic,1,Emergency,Home or Self Care,2020,GEN003,CHRONIC KIDNEY DISEASE,,,470,CHRONIC KIDNEY DISEASE,11,DISEASES AND DISORDERS OF THE KIDNEY AND URINARY TRACT,2,Moderate,Moderate,Medical,Private Health Insurance,,,,,Y,17757.22,3537.95
Long Island,Nassau,2908000,000511,NYU Langone Hospital-Long Island,70 or Older,115,F,White,Not Span/Hispanic,4,Emergency,Skilled Nursing Home,2020,GEN003,CHRONIC KIDNEY DISEASE,ADM001,TRANSFUSION OF BLOOD AND BLOOD PRODUCTS,470,CHRONIC KIDNEY DISEASE,11,DISEASES AND DISORDERS OF THE KIDNEY AND URINARY TRACT,3,Major,Major,Medical,Medicare,Medicare,,,,Y,52622.02,15235.79
Long Island,Nassau,2908000,000511,NYU Langone Hospital-Long Island,30 to 49,113,F,Black/African American,Not Span/Hispanic,8,Emergency,Home or Self Care,2020,GEN003,CHRONIC KIDNEY DISEASE,CAR025,PLACEMENT OF TUNNELED OR IMPLANTABLE PORTION OF A VASCULAR ACCESS DEVICE,470,CHRONIC KIDNEY DISEASE,11,DISEASES AND DISORDERS OF THE KIDNEY AND URINARY TRACT,3,Major,Major,Medical,Blue Cross/Blue Shield,,,,,Y,184889.24,52994.78
Long Island,Nassau,2908000,000511,NYU Langone Hospital-Long Island,70 or Older,115,F,White,Not Span/Hispanic,2,Emergency,Home or Self Care,2020,GEN003,CHRONIC KIDNEY DISEASE,,,470,CHRONIC KIDNEY DISEASE,11,DISEASES AND DISORDERS OF THE KIDNEY AND URINARY TRACT,3,Major,Moderate,Medical,Private Health Insurance,,,,,Y,46567.2,14804.02
Long Island,Nassau,2908000,000511,NYU Langone Hospital-Long Island,30 to 49,117,M,White,Spanish/Hispanic,2,Emergency,Home or Self Care,2020,GEN003,CHRONIC KIDNEY DISEASE,ESA001,HEMODIALYSIS,470,CHRONIC KIDNEY DISEASE,11,DISEASES AND DISORDERS OF THE KIDNEY AND URINARY TRACT,2,Moderate,Minor,Medical,Medicaid,,,,,Y,34097.55,13362.75
Long Island,Nassau,2908000,000511,NYU Langone Hospital-Long Island,70 or Older,OOS,F,Black/African American,Not Span/Hispanic,2,Emergency,Inpatient Rehabilitation Facility,2020,GEN003,CHRONIC KIDNEY DISEASE,,,470,CHRONIC KIDNEY DISEASE,11,DISEASES AND DISORDERS OF THE KIDNEY AND URINARY TRACT,3,Major,Moderate,Medical,Medicare,,,,,Y,51357.88,9998.6
Long Island,Nassau,2908000,000511,NYU Langone Hospital-Long Island,50 to 69,115,F,White,Spanish/Hispanic,12,Emergency,Home or Self Care,2020,GEN003,CHRONIC KIDNEY DISEASE,ESA001,HEMODIALYSIS,470,CHRONIC KIDNEY DISEASE,11,DISEASES AND DISORDERS OF THE KIDNEY AND URINARY TRACT,3,Major,Major,Medical,Medicaid,,,,,Y,188640.61,63851.88
Long Island,Nassau,2908000,000511,NYU Langone Hospital-Long Island,30 to 49,115,M,Other Race,Spanish/Hispanic,2,Emergency,Home or Self Care,2020,GEN003,CHRONIC KIDNEY DISEASE,ADM012,CHEMOTHERAPY,470,CHRONIC KIDNEY DISEASE,11,DISEASES AND DISORDERS OF THE KIDNEY AND URINARY TRACT,2,Moderate,Moderate,Medical,Private Health Insurance,,,,,Y,157082.62,14019.68
Long Island,Nassau,2908000,000511,NYU Langone Hospital-Long Island,50 to 69,110,M,White,Not Span/Hispanic,6,Emergency,Home w/ Home Health Services,2020,GEN003,CHRONIC KIDNEY DISEASE,,,470,CHRONIC KIDNEY DISEASE,11,DISEASES AND DISORDERS OF THE KIDNEY AND URINARY TRACT,3,Major,Major,Medical,Medicare,,,,,Y,83872.25,21540.88
Long Island,Nassau,2908000,000511,NYU Langone Hospital-Long Island,50 to 69,115,M,Black/African American,Not Span/Hispanic,3,Emergency,Left Against Medical Advice,2020,GEN003,CHRONIC KIDNEY DISEASE,GIS006,PARACENTESIS,470,CHRONIC KIDNEY DISEASE,11,DISEASES AND DISORDERS OF THE KIDNEY AND URINARY TRACT,3,Major,Major,Medical,Medicare,Medicaid,,,,Y,109416.61,26282.31
Long Island,Nassau,2908000,000511,NYU Langone Hospital-Long Island,50 to 69,115,M,Other Race,Spanish/Hispanic,2,Emergency,Home w/ Home Health Services,2020,GEN003,CHRONIC KIDNEY DISEASE,,,470,CHRONIC KIDNEY DISEASE,11,DISEASES AND DISORDERS OF THE KIDNEY AND URINARY TRACT,3,Major,Major,Medical,Medicare,Medicaid,,,,Y,50975.54,9352.61
Long Island,Nassau,2908000,000511,NYU Langone Hospital-Long Island,30 to 49,115,M,Black/African American,Not Span/Hispanic,1,Emergency,Home or Self Care,2020,GEN003,CHRONIC KIDNEY DISEASE,ESA001,HEMODIALYSIS,470,CHRONIC KIDNEY DISEASE,11,DISEASES AND DISORDERS OF THE KIDNEY AND URINARY TRACT,3,Major,Moderate,Medical,Medicare,Medicaid,,,,Y,33273.84,10744.21
Long Island,Nassau,2908000,000511,NYU Langone Hospital-Long Island,50 to 69,115,F,Black/African American,Not Span/Hispanic,8,Emergency,Home or Self Care,2020,GEN003,CHRONIC KIDNEY DISEASE,CAR024,VENOUS AND ARTERIAL CATHETER PLACEMENT,470,CHRONIC KIDNEY DISEASE,11,DISEASES AND DISORDERS OF THE KIDNEY AND URINARY TRACT,3,Major,Moderate,Medical,Blue Cross/Blue Shield,,,,,Y,153671.32,43132.84
Long Island,Nassau,2908000,000511,NYU Langone Hospital-Long Island,70 or Older,110,F,White,Not Span/Hispanic,1,Emergency,Home or Self Care,2020,GEN003,CHRONIC KIDNEY DISEASE,,,470,CHRONIC KIDNEY DISEASE,11,DISEASES AND DISORDERS OF THE KIDNEY AND URINARY TRACT,1,Minor,Minor,Medical,Medicare,,,,,Y,20767.01,4971.42
Long Island,Nassau,2908000,000511,NYU Langone Hospital-Long Island,70 or Older,115,F,Other Race,Spanish/Hispanic,3,Emergency,Home w/ Home Health Services,2020,GEN003,CHRONIC KIDNEY DISEASE,ESA001,HEMODIALYSIS,470,CHRONIC KIDNEY DISEASE,11,DISEASES AND DISORDERS OF THE KIDNEY AND URINARY TRACT,2,Moderate,Moderate,Medical,Medicare,Medicare,,,,Y,51254.39,20711.51
Long Island,Nassau,2908000,000511,NYU Langone Hospital-Long Island,70 or Older,117,F,Other Race,Not Span/Hispanic,1,Emergency,Home or Self Care,2020,GEN003,CHRONIC KIDNEY DISEASE,ESA001,HEMODIALYSIS,470,CHRONIC KIDNEY DISEASE,11,DISEASES AND DISORDERS OF THE KIDNEY AND URINARY TRACT,2,Moderate,Moderate,Medical,Medicare,,,,,Y,33096.79,12066.76
Long Island,Nassau,2908000,000511,NYU Langone Hospital-Long Island,18 to 29,115,M,Other Race,Spanish/Hispanic,3,Emergency,Home or Self Care,2020,GEN003,CHRONIC KIDNEY DISEASE,OTR004,ISOLATION PROCEDURES,470,CHRONIC KIDNEY DISEASE,11,DISEASES AND DISORDERS OF THE KIDNEY AND URINARY TRACT,3,Major,Moderate,Medical,Medicaid,,,,,Y,84726.76,21915.42
Long Island,Nassau,2908000,000511,NYU Langone Hospital-Long Island,50 to 69,110,M,White,Not Span/Hispanic,5,Emergency,Home or Self Care,2020,GEN003,CHRONIC KIDNEY DISEASE,CAR025,PLACEMENT OF TUNNELED OR IMPLANTABLE PORTION OF A VASCULAR ACCESS DEVICE,470,CHRONIC KIDNEY DISEASE,11,DISEASES AND DISORDERS OF THE KIDNEY AND URINARY TRACT,3,Major,Moderate,Medical,Blue Cross/Blue Shield,,,,,Y,163401.11,45881.94
Long Island,Nassau,2908000,000511,NYU Langone Hospital-Long Island,50 to 69,110,F,Black/African American,Not Span/Hispanic,2,Emergency,Home w/ Home Health Services,2020,GEN003,CHRONIC KIDNEY DISEASE,,,470,CHRONIC KIDNEY DISEASE,11,DISEASES AND DISORDERS OF THE KIDNEY AND URINARY TRACT,2,Moderate,Major,Medical,Medicaid,,,,,Y,49074.81,12317.85
Long Island,Nassau,2908000,000511,NYU Langone Hospital-Long Island,50 to 69,115,M,Black/African American,Not Span/Hispanic,1,Emergency,Home or Self Care,2020,GEN003,CHRONIC KIDNEY DISEASE,ESA001,HEMODIALYSIS,470,CHRONIC KIDNEY DISEASE,11,DISEASES AND DISORDERS OF THE KIDNEY AND URINARY TRACT,2,Moderate,Minor,Medical,Private Health Insurance,,,,,Y,25800.39,10344.8
Long Island,Nassau,2908000,000511,NYU Langone Hospital-Long Island,70 or Older,117,M,Other Race,Not Span/Hispanic,7,Emergency,Home w/ Home Health Services,2020,GEN003,CHRONIC KIDNEY DISEASE,ESA001,HEMODIALYSIS,470,CHRONIC KIDNEY DISEASE,11,DISEASES AND DISORDERS OF THE KIDNEY AND URINARY TRACT,4,Extreme,Major,Medical,Medicare,Medicare,,,,Y,196365.08,58895.12
Long Island,Nassau,2908000,000511,NYU Langone Hospital-Long Island,70 or Older,115,F,Black/African American,Not Span/Hispanic,5,Emergency,Home w/ Home Health Services,2020,GEN003,CHRONIC KIDNEY DISEASE,MAM004,CARDIAC STRESS TESTS,470,CHRONIC KIDNEY DISEASE,11,DISEASES AND DISORDERS OF THE KIDNEY AND URINARY TRACT,2,Moderate,Major,Medical,Medicare,,,,,Y,91451.98,26354.92
Long Island,Nassau,2908000,000511,NYU Langone Hospital-Long Island,70 or Older,115,F,White,Not Span/Hispanic,6,Emergency,Home w/ Home Health Services,2020,GEN003,CHRONIC KIDNEY DISEASE,CAR024,VENOUS AND ARTERIAL CATHETER PLACEMENT,470,CHRONIC KIDNEY DISEASE,11,DISEASES AND DISORDERS OF THE KIDNEY AND URINARY TRACT,3,Major,Major,Medical,Medicare,Private Health Insurance,,,,Y,133334.93,43033.97
Long Island,Nassau,2908000,000511,NYU Langone Hospital-Long Island,70 or Older,117,M,Other Race,Not Span/Hispanic,1,Emergency,Home w/ Home Health Services,2020,GEN003,CHRONIC KIDNEY DISEASE,ADM001,TRANSFUSION OF BLOOD AND BLOOD PRODUCTS,470,CHRONIC KIDNEY DISEASE,11,DISEASES AND DISORDERS OF THE KIDNEY AND URINARY TRACT,2,Moderate,Moderate,Medical,Medicare,Medicare,,,,Y,37693.35,9800.72
Long Island,Nassau,2908000,000511,NYU Langone Hospital-Long Island,50 to 69,115,M,Black/African American,Not Span/Hispanic,3,Emergency,Home or Self Care,2020,GEN003,CHRONIC KIDNEY DISEASE,ESA001,HEMODIALYSIS,470,CHRONIC KIDNEY DISEASE,11,DISEASES AND DISORDERS OF THE KIDNEY AND URINARY TRACT,3,Major,Major,Medical,Medicare,,,,,Y,62005.91,19554.32
Long Island,Nassau,2908000,000511,NYU Langone Hospital-Long Island,70 or Older,110,F,White,Not Span/Hispanic,1,Emergency,Home or Self Care,2020,GEN003,CHRONIC KIDNEY DISEASE,ESA001,HEMODIALYSIS,470,CHRONIC KIDNEY DISEASE,11,DISEASES AND DISORDERS OF THE KIDNEY AND URINARY TRACT,3,Major,Major,Medical,Blue Cross/Blue Shield,Medicare,,,,Y,50050.65,15277.07
Long Island,Nassau,2908000,000511,NYU Langone Hospital-Long Island,70 or Older,110,F,Black/African American,Not Span/Hispanic,2,Emergency,Inpatient Rehabilitation Facility,2020,GEN003,CHRONIC KIDNEY DISEASE,,,470,CHRONIC KIDNEY DISEASE,11,DISEASES AND DISORDERS OF THE KIDNEY AND URINARY TRACT,3,Major,Major,Medical,Medicare,Medicare,,,,Y,51337.58,17699.96
Long Island,Nassau,2908000,000511,NYU Langone Hospital-Long Island,70 or Older,117,F,Black/African American,Not Span/Hispanic,4,Emergency,Home or Self Care,2020,GEN003,CHRONIC KIDNEY DISEASE,,,470,CHRONIC KIDNEY DISEASE,11,DISEASES AND DISORDERS OF THE KIDNEY AND URINARY TRACT,2,Moderate,Minor,Medical,Medicare,,,,,Y,78620.13,27378.64
Long Island,Nassau,2908000,000511,NYU Langone Hospital-Long Island,70 or Older,115,F,Black/African American,Not Span/Hispanic,3,Emergency,Home or Self Care,2020,GEN003,CHRONIC KIDNEY DISEASE,ADM001,TRANSFUSION OF BLOOD AND BLOOD PRODUCTS,470,CHRONIC KIDNEY DISEASE,11,DISEASES AND DISORDERS OF THE KIDNEY AND URINARY TRACT,3,Major,Major,Medical,Medicare,,,,,Y,46616.09,18193.76
Long Island,Nassau,2908000,000511,NYU Langone Hospital-Long Island,70 or Older,110,M,Black/African American,Not Span/Hispanic,6,Emergency,Home or Self Care,2020,GEN003,CHRONIC KIDNEY DISEASE,,,470,CHRONIC KIDNEY DISEASE,11,DISEASES AND DISORDERS OF THE KIDNEY AND URINARY TRACT,2,Moderate,Moderate,Medical,Private Health Insurance,Medicare,,,,Y,98866.31,30709.97
Long Island,Nassau,2908000,000511,NYU Langone Hospital-Long Island,70 or Older,110,M,Other Race,Not Span/Hispanic,3,Emergency,Home or Self Care,2020,GEN003,CHRONIC KIDNEY DISEASE,,,470,CHRONIC KIDNEY DISEASE,11,DISEASES AND DISORDERS OF THE KIDNEY AND URINARY TRACT,2,Moderate,Moderate,Medical,Private Health Insurance,,,,,Y,71036.11,21698.49
Long Island,Nassau,2908000,000511,NYU Langone Hospital-Long Island,50 to 69,115,M,Black/African American,Not Span/Hispanic,5,Emergency,Home or Self Care,2020,GEN003,CHRONIC KIDNEY DISEASE,ESA001,HEMODIALYSIS,470,CHRONIC KIDNEY DISEASE,11,DISEASES AND DISORDERS OF THE KIDNEY AND URINARY TRACT,3,Major,Major,Medical,Medicare,Medicaid,,,,Y,95415.82,35448.26
Long Island,Nassau,2908000,000511,NYU Langone Hospital-Long Island,70 or Older,115,F,White,Not Span/Hispanic,2,Emergency,Hospice - Home,2020,GEN003,CHRONIC KIDNEY DISEASE,OTR004,ISOLATION PROCEDURES,470,CHRONIC KIDNEY DISEASE,11,DISEASES AND DISORDERS OF THE KIDNEY AND URINARY TRACT,4,Extreme,Major,Medical,Medicare,,,,,Y,65510.8,16778.16
Long Island,Nassau,2908000,000511,NYU Langone Hospital-Long Island,0 to 17,117,M,White,Unknown,3,Emergency,Home or Self Care,2020,GEN003,CHRONIC KIDNEY DISEASE,CAR025,PLACEMENT OF TUNNELED OR IMPLANTABLE PORTION OF A VASCULAR ACCESS DEVICE,470,CHRONIC KIDNEY DISEASE,11,DISEASES AND DISORDERS OF THE KIDNEY AND URINARY TRACT,3,Major,Moderate,Medical,Private Health Insurance,,,,,Y,109635.13,32304.62
Long Island,Nassau,2908000,000511,NYU Langone Hospital-Long Island,70 or Older,115,M,Black/African American,Not Span/Hispanic,11,Elective,Home or Self Care,2020,GEN003,CHRONIC KIDNEY DISEASE,CAR024,VENOUS AND ARTERIAL CATHETER PLACEMENT,470,CHRONIC KIDNEY DISEASE,11,DISEASES AND DISORDERS OF THE KIDNEY AND URINARY TRACT,3,Major,Major,Medical,Medicare,Medicare,,,,N,338030.17,95528.44
Long Island,Nassau,2908000,000511,NYU Langone Hospital-Long Island,50 to 69,115,F,Black/African American,Not Span/Hispanic,4,Emergency,Home or Self Care,2020,GEN003,CHRONIC KIDNEY DISEASE,ADM001,TRANSFUSION OF BLOOD AND BLOOD PRODUCTS,470,CHRONIC KIDNEY DISEASE,11,DISEASES AND DISORDERS OF THE KIDNEY AND URINARY TRACT,2,Moderate,Moderate,Medical,Blue Cross/Blue Shield,,,,,Y,77328.87,23764.21
