Hospital Service Area,Hospital County,Operating Certificate Number,Permanent Facility Id,Facility Name,Age Group,Zip Code - 3 digits,Gender,Race,Ethnicity,Length of Stay,Type of Admission,Patient Disposition,Discharge Year,CCS Diagnosis Code,CCS Diagnosis Description,CCS Procedure Code,CCS Procedure Description,APR DRG Code,APR DRG Description,APR MDC Code,APR MDC Description,APR Severity of Illness Code,APR Severity of Illness Description,APR Risk of Mortality,APR Medical Surgical Description,Payment Typology 1,Payment Typology 2,Payment Typology 3,Birth Weight,Abortion Edit Indicator,Emergency Department Indicator,Total Charges,Total Costs
Long Island,Suffolk,5123000,000885,Brookhaven Memorial Hospital Medical Center Inc,50 to 69,117,F,Black/African American,Not Span/Hispanic,7,Emergency,Home or Self Care,2017,050,Diabetes mellitus with complications,000,NO PROC,048,"Peripheral, cranial & autonomic nerve disorders",01,Diseases and Disorders of the Nervous System,2,Moderate,Moderate,Medical,Medicare,Medicare,Medicaid,,N,Y,48549.68,8667.49
Long Island,Suffolk,5123000,000885,Brookhaven Memorial Hospital Medical Center Inc,70 or Older,117,F,White,Not Span/Hispanic,7,Emergency,Skilled Nursing Home,2017,050,Diabetes mellitus with complications,221,NASOGASTRIC TUBE,048,"Peripheral, cranial & autonomic nerve disorders",01,Diseases and Disorders of the Nervous System,3,Major,Moderate,Medical,Medicare,Medicare,Private Health Insurance,,N,Y,86977.92,13372.20
Long Island,Suffolk,5123000,000885,Brookhaven Memorial Hospital Medical Center Inc,50 to 69,117,F,Black/African American,Not Span/Hispanic,12,Emergency,Home or Self Care,2017,050,Diabetes mellitus with complications,070,UP GASTRO ENDOSC/BIOPSY,048,"Peripheral, cranial & autonomic nerve disorders",01,Diseases and Disorders of the Nervous System,3,Major,Moderate,Medical,Medicare,Medicare,Medicaid,,N,Y,89227.69,18186.38
Long Island,Suffolk,5123000,000885,Brookhaven Memorial Hospital Medical Center Inc,70 or Older,117,M,White,Not Span/Hispanic,6,Emergency,Home or Self Care,2017,050,Diabetes mellitus with complications,092,OTHER BOWEL DX PRCS,048,"Peripheral, cranial & autonomic nerve disorders",01,Diseases and Disorders of the Nervous System,3,Major,Major,Medical,Medicare,Medicare,Private Health Insurance,,N,Y,61107.31,10974.79
Long Island,Suffolk,5123000,000885,Brookhaven Memorial Hospital Medical Center Inc,50 to 69,117,M,Other Race,Not Span/Hispanic,2,Emergency,Home w/ Home Health Services,2017,095,Other nervous system disorders,000,NO PROC,048,"Peripheral, cranial & autonomic nerve disorders",01,Diseases and Disorders of the Nervous System,2,Moderate,Major,Medical,Medicare,Medicare,Medicaid,,N,Y,53286.15,5985.65
Long Island,Suffolk,5123000,000885,Brookhaven Memorial Hospital Medical Center Inc,30 to 49,119,M,Other Race,Not Span/Hispanic,1,Emergency,Home or Self Care,2017,050,Diabetes mellitus with complications,000,NO PROC,048,"Peripheral, cranial & autonomic nerve disorders",01,Diseases and Disorders of the Nervous System,2,Moderate,Minor,Medical,Private Health Insurance,,,,N,Y,21975.91,2032.35
Long Island,Suffolk,5123000,000885,Brookhaven Memorial Hospital Medical Center Inc,50 to 69,119,M,White,Not Span/Hispanic,3,Emergency,Home or Self Care,2017,050,Diabetes mellitus with complications,000,NO PROC,048,"Peripheral, cranial & autonomic nerve disorders",01,Diseases and Disorders of the Nervous System,2,Moderate,Minor,Medical,Private Health Insurance,,,,N,Y,34533.69,5125.10
Long Island,Suffolk,5123000,000885,Brookhaven Memorial Hospital Medical Center Inc,50 to 69,119,F,Black/African American,Not Span/Hispanic,6,Emergency,Home or Self Care,2017,050,Diabetes mellitus with complications,054,OT VASC CATH; NOT HEART,048,"Peripheral, cranial & autonomic nerve disorders",01,Diseases and Disorders of the Nervous System,2,Moderate,Minor,Medical,Medicare,Medicare,Medicaid,,N,Y,62139.92,9266.31
Long Island,Suffolk,5123000,000885,Brookhaven Memorial Hospital Medical Center Inc,50 to 69,119,F,White,Not Span/Hispanic,3,Emergency,Home or Self Care,2017,095,Other nervous system disorders,193,DX ULTRASOUND HEART,048,"Peripheral, cranial & autonomic nerve disorders",01,Diseases and Disorders of the Nervous System,1,Minor,Minor,Medical,Private Health Insurance,,,,N,N,49145.70,6209.22
Long Island,Suffolk,5123000,000885,Brookhaven Memorial Hospital Medical Center Inc,30 to 49,119,M,White,Not Span/Hispanic,3,Emergency,Home or Self Care,2017,244,Other injuries and conditions due to external causes,000,NO PROC,048,"Peripheral, cranial & autonomic nerve disorders",01,Diseases and Disorders of the Nervous System,2,Moderate,Minor,Medical,Medicaid,,,,N,Y,51176.90,6269.61
Long Island,Suffolk,5123000,000885,Brookhaven Memorial Hospital Medical Center Inc,70 or Older,117,M,Other Race,Not Span/Hispanic,2,Emergency,Home or Self Care,2017,050,Diabetes mellitus with complications,000,NO PROC,048,"Peripheral, cranial & autonomic nerve disorders",01,Diseases and Disorders of the Nervous System,3,Major,Major,Medical,Private Health Insurance,,,,N,Y,31405.11,3972.80
Long Island,Suffolk,5123000,000885,Brookhaven Memorial Hospital Medical Center Inc,70 or Older,117,M,White,Not Span/Hispanic,5,Emergency,Home w/ Home Health Services,2017,050,Diabetes mellitus with complications,000,NO PROC,048,"Peripheral, cranial & autonomic nerve disorders",01,Diseases and Disorders of the Nervous System,2,Moderate,Major,Medical,Medicare,Medicare,Private Health Insurance,,N,Y,40706.32,7423.89
Long Island,Suffolk,5123000,000885,Brookhaven Memorial Hospital Medical Center Inc,30 to 49,119,F,White,Not Span/Hispanic,3,Emergency,Home or Self Care,2017,050,Diabetes mellitus with complications,000,NO PROC,048,"Peripheral, cranial & autonomic nerve disorders",01,Diseases and Disorders of the Nervous System,3,Major,Moderate,Medical,Private Health Insurance,,,,N,Y,30199.24,4426.85
Long Island,Suffolk,5123000,000885,Brookhaven Memorial Hospital Medical Center Inc,70 or Older,117,F,White,Not Span/Hispanic,5,Emergency,Home w/ Home Health Services,2017,050,Diabetes mellitus with complications,000,NO PROC,048,"Peripheral, cranial & autonomic nerve disorders",01,Diseases and Disorders of the Nervous System,2,Moderate,Moderate,Medical,Medicare,Medicare,Private Health Insurance,,N,Y,52781.71,7148.81
Long Island,Suffolk,5123000,000885,Brookhaven Memorial Hospital Medical Center Inc,70 or Older,117,F,Black/African American,Not Span/Hispanic,6,Emergency,Home w/ Home Health Services,2017,050,Diabetes mellitus with complications,216,RESP INTUB/MECH VENTIL,048,"Peripheral, cranial & autonomic nerve disorders",01,Diseases and Disorders of the Nervous System,2,Moderate,Moderate,Medical,Medicare,Medicaid,,,N,Y,42809.75,8233.65
Long Island,Suffolk,5123000,000885,Brookhaven Memorial Hospital Medical Center Inc,50 to 69,117,M,Black/African American,Not Span/Hispanic,4,Emergency,Home or Self Care,2017,050,Diabetes mellitus with complications,000,NO PROC,048,"Peripheral, cranial & autonomic nerve disorders",01,Diseases and Disorders of the Nervous System,3,Major,Moderate,Medical,Medicare,Medicare,Medicaid,,N,Y,27896.67,5539.21
Long Island,Suffolk,5123000,000885,Brookhaven Memorial Hospital Medical Center Inc,70 or Older,117,M,White,Not Span/Hispanic,1,Emergency,Home w/ Home Health Services,2017,050,Diabetes mellitus with complications,000,NO PROC,048,"Peripheral, cranial & autonomic nerve disorders",01,Diseases and Disorders of the Nervous System,2,Moderate,Moderate,Medical,Medicare,Medicare,Blue Cross/Blue Shield,,N,Y,49873.02,4852.07
Long Island,Suffolk,5123000,000885,Brookhaven Memorial Hospital Medical Center Inc,30 to 49,119,F,White,Not Span/Hispanic,2,Emergency,Home or Self Care,2017,050,Diabetes mellitus with complications,000,NO PROC,048,"Peripheral, cranial & autonomic nerve disorders",01,Diseases and Disorders of the Nervous System,3,Major,Moderate,Medical,Private Health Insurance,,,,N,Y,25020.55,3320.19
Long Island,Suffolk,5123000,000885,Brookhaven Memorial Hospital Medical Center Inc,50 to 69,117,F,White,Not Span/Hispanic,1,Emergency,Home or Self Care,2017,091,Other eye disorders,000,NO PROC,048,"Peripheral, cranial & autonomic nerve disorders",01,Diseases and Disorders of the Nervous System,1,Minor,Minor,Medical,Medicare,Medicare,Private Health Insurance,,N,Y,63431.79,8696.41
Long Island,Suffolk,5123000,000885,Brookhaven Memorial Hospital Medical Center Inc,70 or Older,117,M,White,Not Span/Hispanic,4,Emergency,Skilled Nursing Home,2017,050,Diabetes mellitus with complications,227,"OT DX PRC (INTERVW,EVAL",048,"Peripheral, cranial & autonomic nerve disorders",01,Diseases and Disorders of the Nervous System,2,Moderate,Moderate,Medical,Medicare,Medicare,Private Health Insurance,,N,Y,35106.94,6296.63
Long Island,Suffolk,5123000,000885,Brookhaven Memorial Hospital Medical Center Inc,70 or Older,117,F,Other Race,Not Span/Hispanic,12,Emergency,Skilled Nursing Home,2017,050,Diabetes mellitus with complications,222,BLOOD TRANSFUSION,048,"Peripheral, cranial & autonomic nerve disorders",01,Diseases and Disorders of the Nervous System,2,Moderate,Moderate,Medical,Medicare,Medicare,Medicaid,,N,Y,95791.31,16956.36
Long Island,Suffolk,5123000,000885,Brookhaven Memorial Hospital Medical Center Inc,70 or Older,117,F,Other Race,Not Span/Hispanic,6,Emergency,Home w/ Home Health Services,2017,050,Diabetes mellitus with complications,000,NO PROC,048,"Peripheral, cranial & autonomic nerve disorders",01,Diseases and Disorders of the Nervous System,2,Moderate,Moderate,Medical,Medicare,Medicare,Medicaid,,N,Y,52256.23,9154.03
Long Island,Suffolk,5123000,000885,Brookhaven Memorial Hospital Medical Center Inc,30 to 49,119,M,White,Not Span/Hispanic,2,Emergency,Home or Self Care,2017,095,Other nervous system disorders,000,NO PROC,048,"Peripheral, cranial & autonomic nerve disorders",01,Diseases and Disorders of the Nervous System,1,Minor,Minor,Medical,Blue Cross/Blue Shield,,,,N,Y,58931.97,5940.82
Long Island,Suffolk,5123000,000885,Brookhaven Memorial Hospital Medical Center Inc,70 or Older,117,M,White,Not Span/Hispanic,7,Emergency,Skilled Nursing Home,2017,050,Diabetes mellitus with complications,199,ELECTROENCEPHALOGRAM,048,"Peripheral, cranial & autonomic nerve disorders",01,Diseases and Disorders of the Nervous System,3,Major,Major,Medical,Medicare,Medicare,Blue Cross/Blue Shield,,N,Y,53103.28,10265.75
Long Island,Suffolk,5123000,000885,Brookhaven Memorial Hospital Medical Center Inc,50 to 69,117,F,Black/African American,Not Span/Hispanic,2,Emergency,Home or Self Care,2017,205,Spondylosis; intervertebral disc disorders; other back problems,000,NO PROC,048,"Peripheral, cranial & autonomic nerve disorders",01,Diseases and Disorders of the Nervous System,3,Major,Moderate,Medical,Medicare,Medicare,Medicaid,,N,Y,35480.99,4697.84
Long Island,Suffolk,5123000,000885,Brookhaven Memorial Hospital Medical Center Inc,70 or Older,119,F,Other Race,Not Span/Hispanic,2,Emergency,Home or Self Care,2017,095,Other nervous system disorders,000,NO PROC,048,"Peripheral, cranial & autonomic nerve disorders",01,Diseases and Disorders of the Nervous System,1,Minor,Moderate,Medical,Medicare,,,,N,Y,31381.97,4408.01
Long Island,Suffolk,5123000,000885,Brookhaven Memorial Hospital Medical Center Inc,50 to 69,117,F,Black/African American,Not Span/Hispanic,5,Emergency,Home or Self Care,2017,050,Diabetes mellitus with complications,201,CARDIAC STRESS TESTS,048,"Peripheral, cranial & autonomic nerve disorders",01,Diseases and Disorders of the Nervous System,3,Major,Moderate,Medical,Medicaid,,,,N,Y,75489.48,12638.64
Long Island,Suffolk,5123000,000885,Brookhaven Memorial Hospital Medical Center Inc,30 to 49,119,M,Black/African American,Not Span/Hispanic,1,Emergency,Home or Self Care,2017,095,Other nervous system disorders,000,NO PROC,048,"Peripheral, cranial & autonomic nerve disorders",01,Diseases and Disorders of the Nervous System,1,Minor,Minor,Medical,Blue Cross/Blue Shield,,,,N,Y,18584.04,2919.59
Long Island,Suffolk,5123000,000885,Brookhaven Memorial Hospital Medical Center Inc,70 or Older,117,F,White,Not Span/Hispanic,2,Emergency,Home or Self Care,2017,050,Diabetes mellitus with complications,000,NO PROC,048,"Peripheral, cranial & autonomic nerve disorders",01,Diseases and Disorders of the Nervous System,2,Moderate,Moderate,Medical,Medicare,Medicare,Blue Cross/Blue Shield,,N,Y,53287.59,5117.84
Long Island,Suffolk,5123000,000885,Brookhaven Memorial Hospital Medical Center Inc,70 or Older,117,M,White,Not Span/Hispanic,3,Emergency,Skilled Nursing Home,2017,050,Diabetes mellitus with complications,000,NO PROC,048,"Peripheral, cranial & autonomic nerve disorders",01,Diseases and Disorders of the Nervous System,3,Major,Moderate,Medical,Medicare,Medicare,,,N,Y,28747.55,4803.56
Long Island,Suffolk,5123000,000885,Brookhaven Memorial Hospital Medical Center Inc,50 to 69,119,M,Other Race,Not Span/Hispanic,2,Emergency,Home or Self Care,2017,091,Other eye disorders,000,NO PROC,048,"Peripheral, cranial & autonomic nerve disorders",01,Diseases and Disorders of the Nervous System,2,Moderate,Minor,Medical,Blue Cross/Blue Shield,,,,N,Y,46154.95,5419.67
Long Island,Suffolk,5123000,000885,Brookhaven Memorial Hospital Medical Center Inc,70 or Older,117,M,White,Not Span/Hispanic,1,Emergency,Home or Self Care,2017,091,Other eye disorders,000,NO PROC,048,"Peripheral, cranial & autonomic nerve disorders",01,Diseases and Disorders of the Nervous System,2,Moderate,Major,Medical,Medicare,,,,N,Y,47469.24,4501.81
Long Island,Suffolk,5123000,000885,Brookhaven Memorial Hospital Medical Center Inc,70 or Older,119,M,White,Not Span/Hispanic,1,Emergency,Home or Self Care,2017,095,Other nervous system disorders,000,NO PROC,048,"Peripheral, cranial & autonomic nerve disorders",01,Diseases and Disorders of the Nervous System,2,Moderate,Minor,Medical,Medicare,Medicare,,,N,Y,32308.91,3069.07
Long Island,Suffolk,5123000,000885,Brookhaven Memorial Hospital Medical Center Inc,50 to 69,117,M,White,Not Span/Hispanic,2,Emergency,Home or Self Care,2017,050,Diabetes mellitus with complications,058,HEMODIALYSIS,048,"Peripheral, cranial & autonomic nerve disorders",01,Diseases and Disorders of the Nervous System,3,Major,Major,Medical,Medicare,Medicare,Medicaid,,N,Y,30763.26,4297.84
Long Island,Suffolk,5123000,000885,Brookhaven Memorial Hospital Medical Center Inc,50 to 69,117,M,White,Not Span/Hispanic,7,Emergency,Home or Self Care,2017,095,Other nervous system disorders,070,UP GASTRO ENDOSC/BIOPSY,048,"Peripheral, cranial & autonomic nerve disorders",01,Diseases and Disorders of the Nervous System,1,Minor,Minor,Medical,Private Health Insurance,,,,N,Y,83650.38,13671.85
Long Island,Suffolk,5123000,000885,Brookhaven Memorial Hospital Medical Center Inc,30 to 49,119,F,White,Not Span/Hispanic,3,Emergency,Home or Self Care,2017,050,Diabetes mellitus with complications,054,OT VASC CATH; NOT HEART,048,"Peripheral, cranial & autonomic nerve disorders",01,Diseases and Disorders of the Nervous System,3,Major,Major,Medical,Private Health Insurance,,,,N,Y,30383.66,4556.24
Long Island,Suffolk,5123000,000885,Brookhaven Memorial Hospital Medical Center Inc,70 or Older,117,M,White,Not Span/Hispanic,3,Emergency,Home or Self Care,2017,095,Other nervous system disorders,000,NO PROC,048,"Peripheral, cranial & autonomic nerve disorders",01,Diseases and Disorders of the Nervous System,3,Major,Moderate,Medical,Medicare,,,,N,Y,49431.94,6051.07
Long Island,Suffolk,5123000,000885,Brookhaven Memorial Hospital Medical Center Inc,30 to 49,117,M,Black/African American,Not Span/Hispanic,1,Emergency,Home or Self Care,2017,244,Other injuries and conditions due to external causes,214,"TRACTN, SPLNT, OT WOUND",048,"Peripheral, cranial & autonomic nerve disorders",01,Diseases and Disorders of the Nervous System,1,Minor,Minor,Medical,Private Health Insurance,,,,N,Y,8530.79,1687.80
