Hospital Service Area,Hospital County,Operating Certificate Number,Permanent Facility Id,Facility Name,Age Group,Zip Code - 3 digits,Gender,Race,Ethnicity,Length of Stay,Type of Admission,Patient Disposition,Discharge Year,CCS Diagnosis Code,CCS Diagnosis Description,CCS Procedure Code,CCS Procedure Description,APR DRG Code,APR DRG Description,APR MDC Code,APR MDC Description,APR Severity of Illness Code,APR Severity of Illness Description,APR Risk of Mortality,APR Medical Surgical Description,Payment Typology 1,Payment Typology 2,Payment Typology 3,Birth Weight,Abortion Edit Indicator,Emergency Department Indicator,Total Charges,Total Costs
New York City,Manhattan,7002001,001438,Bellevue Hospital Center,70 or Older,100,F,Black/African American,Not Span/Hispanic,5,Emergency,Home or Self Care,2019,NVS017,NERVE AND NERVE ROOT DISORDERS,CAR021,"ARTERY, VEIN, AND GREAT VESSEL PROCEDURES, NEC",048,"PERIPHERAL, CRANIAL & AUTONOMIC NERVE DISORDERS",01,DISEASES AND DISORDERS OF THE NERVOUS SYSTEM,2,Moderate,Moderate,Medical,Medicare,Medicare,Medicaid,,,true,40070.48,26630.84
New York City,Manhattan,7002001,001438,Bellevue Hospital Center,70 or Older,111,M,Other Race,Not Span/Hispanic,4,Emergency,Home or Self Care,2019,END003,DIABETES MELLITUS WITH COMPLICATION,ADM021,"ADMINISTRATION OF THERAPEUTIC SUBSTANCES, NEC",048,"PERIPHERAL, CRANIAL & AUTONOMIC NERVE DISORDERS",01,DISEASES AND DISORDERS OF THE NERVOUS SYSTEM,3,Major,Major,Medical,Medicaid,,,,,true,27122.34,18025.51
New York City,Manhattan,7002001,001438,Bellevue Hospital Center,30 to 49,113,F,Other Race,Not Span/Hispanic,1,Emergency,Home or Self Care,2019,NVS017,NERVE AND NERVE ROOT DISORDERS,IMG005,MAGNETIC RESONANCE IMAGING (MRI),048,"PERIPHERAL, CRANIAL & AUTONOMIC NERVE DISORDERS",01,DISEASES AND DISORDERS OF THE NERVOUS SYSTEM,1,Minor,Minor,Medical,Medicaid,,,,,true,12196.53,8105.81
New York City,Manhattan,7002001,001438,Bellevue Hospital Center,50 to 69,112,M,Other Race,Not Span/Hispanic,3,Emergency,Home or Self Care,2019,NVS017,NERVE AND NERVE ROOT DISORDERS,MAM008,CARDIAC MONITORING,048,"PERIPHERAL, CRANIAL & AUTONOMIC NERVE DISORDERS",01,DISEASES AND DISORDERS OF THE NERVOUS SYSTEM,1,Minor,Minor,Medical,Medicaid,Medicaid,,,,true,30996.28,20600.13
New York City,Manhattan,7002001,001438,Bellevue Hospital Center,50 to 69,112,M,White,Not Span/Hispanic,8,Emergency,Inpatient Rehabilitation Facility,2019,NVS015,POLYNEUROPATHIES,IMG007,COMPUTERIZED TOMOGRAPHY (CT) WITHOUT CONTRAST,048,"PERIPHERAL, CRANIAL & AUTONOMIC NERVE DISORDERS",01,DISEASES AND DISORDERS OF THE NERVOUS SYSTEM,3,Major,Moderate,Medical,Medicaid,Medicaid,,,,false,61790.51,41065.97
New York City,Manhattan,7002001,001438,Bellevue Hospital Center,70 or Older,112,F,Other Race,Spanish/Hispanic,1,Emergency,Home or Self Care,2019,END003,DIABETES MELLITUS WITH COMPLICATION,ADM015,ADMINISTRATION OF ANTIBIOTICS,048,"PERIPHERAL, CRANIAL & AUTONOMIC NERVE DISORDERS",01,DISEASES AND DISORDERS OF THE NERVOUS SYSTEM,3,Major,Major,Medical,Medicare,Medicare,Medicaid,,,true,8652.51,5750.46
New York City,Manhattan,7002001,001438,Bellevue Hospital Center,50 to 69,104,F,Other Race,Spanish/Hispanic,8,Emergency,Home or Self Care,2019,END003,DIABETES MELLITUS WITH COMPLICATION,ADM017,ADMINISTRATION OF NUTRITIONAL AND ELECTROLYTIC SUBSTANCES,048,"PERIPHERAL, CRANIAL & AUTONOMIC NERVE DISORDERS",01,DISEASES AND DISORDERS OF THE NERVOUS SYSTEM,4,Extreme,Major,Medical,Medicaid,,,,,true,43984.25,29231.93
New York City,Manhattan,7002001,001438,Bellevue Hospital Center,50 to 69,100,F,Other Race,Not Span/Hispanic,2,Emergency,Home or Self Care,2019,NVS017,NERVE AND NERVE ROOT DISORDERS,MAM011,ELECTROENCEPHALOGRAM (EEG),048,"PERIPHERAL, CRANIAL & AUTONOMIC NERVE DISORDERS",01,DISEASES AND DISORDERS OF THE NERVOUS SYSTEM,1,Minor,Minor,Medical,Medicare,Medicare,Medicaid,,,false,19196.21,12757.8
New York City,Manhattan,7002001,001438,Bellevue Hospital Center,30 to 49,100,M,Other Race,Spanish/Hispanic,1,Emergency,Home or Self Care,2019,NVS017,NERVE AND NERVE ROOT DISORDERS,IMG005,MAGNETIC RESONANCE IMAGING (MRI),048,"PERIPHERAL, CRANIAL & AUTONOMIC NERVE DISORDERS",01,DISEASES AND DISORDERS OF THE NERVOUS SYSTEM,1,Minor,Minor,Medical,Private Health Insurance,,,,,true,18659.8,12401.3
New York City,Manhattan,7002001,001438,Bellevue Hospital Center,50 to 69,112,F,Black/African American,Not Span/Hispanic,3,Emergency,Home or Self Care,2019,END003,DIABETES MELLITUS WITH COMPLICATION,IMG009,PLAIN RADIOGRAPHY,048,"PERIPHERAL, CRANIAL & AUTONOMIC NERVE DISORDERS",01,DISEASES AND DISORDERS OF THE NERVOUS SYSTEM,2,Moderate,Minor,Medical,Private Health Insurance,,,,,true,18202.23,12097.2
New York City,Manhattan,7002001,001438,Bellevue Hospital Center,0 to 17,114,M,Other Race,Not Span/Hispanic,1,Emergency,Home or Self Care,2019,MUS025,OTHER SPECIFIED CONNECTIVE TISSUE DISEASE,,,048,"PERIPHERAL, CRANIAL & AUTONOMIC NERVE DISORDERS",01,DISEASES AND DISORDERS OF THE NERVOUS SYSTEM,2,Moderate,Minor,Medical,Medicaid,Medicaid,,,,true,6619.28,4399.17
New York City,Manhattan,7002001,001438,Bellevue Hospital Center,50 to 69,100,M,White,Not Span/Hispanic,2,Emergency,Home or Self Care,2019,EYE006,NEURO-OPHTHALMOLOGY,IMG005,MAGNETIC RESONANCE IMAGING (MRI),048,"PERIPHERAL, CRANIAL & AUTONOMIC NERVE DISORDERS",01,DISEASES AND DISORDERS OF THE NERVOUS SYSTEM,2,Moderate,Moderate,Medical,Self-Pay,,,,,true,26439.87,17571.94
New York City,Manhattan,7002001,001438,Bellevue Hospital Center,30 to 49,113,M,Black/African American,Not Span/Hispanic,9,Emergency,Court/Law Enforcement,2019,END003,DIABETES MELLITUS WITH COMPLICATION,IMG008,ULTRASONOGRAPHY,048,"PERIPHERAL, CRANIAL & AUTONOMIC NERVE DISORDERS",01,DISEASES AND DISORDERS OF THE NERVOUS SYSTEM,2,Moderate,Moderate,Medical,Medicaid,,,,,true,86478.57,57473.66
New York City,Manhattan,7002001,001438,Bellevue Hospital Center,50 to 69,112,M,Black/African American,Spanish/Hispanic,17,Emergency,Home or Self Care,2019,NVS015,POLYNEUROPATHIES,GNR004,ENDOSCOPIC CONTROL OF BLEEDING,048,"PERIPHERAL, CRANIAL & AUTONOMIC NERVE DISORDERS",01,DISEASES AND DISORDERS OF THE NERVOUS SYSTEM,4,Extreme,Extreme,Medical,Medicaid,,,,,true,113350.15,75332.51
New York City,Manhattan,7002001,001438,Bellevue Hospital Center,50 to 69,112,M,Black/African American,Not Span/Hispanic,15,Emergency,Home or Self Care,2019,END003,DIABETES MELLITUS WITH COMPLICATION,GIS001,ESOPHAGOGASTRODUODENOSCOPY (EGD) WITH BIOPSY,048,"PERIPHERAL, CRANIAL & AUTONOMIC NERVE DISORDERS",01,DISEASES AND DISORDERS OF THE NERVOUS SYSTEM,3,Major,Moderate,Medical,Medicaid,,,,,true,112905.13,75036.75
New York City,Manhattan,7002001,001438,Bellevue Hospital Center,70 or Older,104,M,Other Race,Spanish/Hispanic,10,Emergency,Home or Self Care,2019,END003,DIABETES MELLITUS WITH COMPLICATION,IMG007,COMPUTERIZED TOMOGRAPHY (CT) WITHOUT CONTRAST,048,"PERIPHERAL, CRANIAL & AUTONOMIC NERVE DISORDERS",01,DISEASES AND DISORDERS OF THE NERVOUS SYSTEM,3,Major,Moderate,Medical,Medicare,Medicaid,,,,true,73152.49,48617.14
New York City,Manhattan,7002001,001438,Bellevue Hospital Center,30 to 49,112,F,Other Race,Spanish/Hispanic,1,Emergency,Home or Self Care,2019,NVS017,NERVE AND NERVE ROOT DISORDERS,IMG005,MAGNETIC RESONANCE IMAGING (MRI),048,"PERIPHERAL, CRANIAL & AUTONOMIC NERVE DISORDERS",01,DISEASES AND DISORDERS OF THE NERVOUS SYSTEM,1,Minor,Minor,Medical,Medicaid,,,,,true,16841.78,11193.05
New York City,Manhattan,7002001,001438,Bellevue Hospital Center,50 to 69,100,M,Black/African American,Not Span/Hispanic,5,Emergency,Home or Self Care,2019,NVS017,NERVE AND NERVE ROOT DISORDERS,,,048,"PERIPHERAL, CRANIAL & AUTONOMIC NERVE DISORDERS",01,DISEASES AND DISORDERS OF THE NERVOUS SYSTEM,3,Major,Moderate,Medical,Medicaid,,,,,true,46202.51,30706.19
New York City,Manhattan,7002001,001438,Bellevue Hospital Center,30 to 49,100,M,Black/African American,Not Span/Hispanic,3,Emergency,Home or Self Care,2019,INJ025,"INJURY TO NERVES, MUSCLES AND TENDONS, INITIAL ENCOUNTER",IMG007,COMPUTERIZED TOMOGRAPHY (CT) WITHOUT CONTRAST,048,"PERIPHERAL, CRANIAL & AUTONOMIC NERVE DISORDERS",01,DISEASES AND DISORDERS OF THE NERVOUS SYSTEM,3,Major,Minor,Medical,Medicaid,,,,,true,24860.78,16522.47
New York City,Manhattan,7002001,001438,Bellevue Hospital Center,50 to 69,100,M,Black/African American,Not Span/Hispanic,5,Emergency,Home or Self Care,2019,NVS017,NERVE AND NERVE ROOT DISORDERS,IMG007,COMPUTERIZED TOMOGRAPHY (CT) WITHOUT CONTRAST,048,"PERIPHERAL, CRANIAL & AUTONOMIC NERVE DISORDERS",01,DISEASES AND DISORDERS OF THE NERVOUS SYSTEM,3,Major,Minor,Medical,Medicaid,,,,,true,41180.14,27368.32
New York City,Manhattan,7002001,001438,Bellevue Hospital Center,50 to 69,114,F,Black/African American,Not Span/Hispanic,2,Urgent,Home or Self Care,2019,END003,DIABETES MELLITUS WITH COMPLICATION,IMG005,MAGNETIC RESONANCE IMAGING (MRI),048,"PERIPHERAL, CRANIAL & AUTONOMIC NERVE DISORDERS",01,DISEASES AND DISORDERS OF THE NERVOUS SYSTEM,2,Moderate,Moderate,Medical,Private Health Insurance,,,,,false,25796.64,17144.45
New York City,Manhattan,7002001,001438,Bellevue Hospital Center,30 to 49,113,F,Other Race,Spanish/Hispanic,1,Emergency,Home or Self Care,2019,INJ030,DRUG INDUCED OR TOXIC RELATED CONDITION,,,048,"PERIPHERAL, CRANIAL & AUTONOMIC NERVE DISORDERS",01,DISEASES AND DISORDERS OF THE NERVOUS SYSTEM,1,Minor,Minor,Medical,Medicaid,,,,,true,8658.22,5754.25
New York City,Manhattan,7002001,001438,Bellevue Hospital Center,30 to 49,112,F,Other Race,Not Span/Hispanic,1,Emergency,Home or Self Care,2019,MUS011,SPONDYLOPATHIES/SPONDYLOARTHROPATHY (INCLUDING INFECTIVE),IMG005,MAGNETIC RESONANCE IMAGING (MRI),048,"PERIPHERAL, CRANIAL & AUTONOMIC NERVE DISORDERS",01,DISEASES AND DISORDERS OF THE NERVOUS SYSTEM,2,Moderate,Minor,Medical,Medicaid,,,,,true,15859.42,10540.17
New York City,Manhattan,7002001,001438,Bellevue Hospital Center,70 or Older,100,F,Black/African American,Not Span/Hispanic,4,Emergency,Home or Self Care,2019,MUS011,SPONDYLOPATHIES/SPONDYLOARTHROPATHY (INCLUDING INFECTIVE),ADM021,"ADMINISTRATION OF THERAPEUTIC SUBSTANCES, NEC",048,"PERIPHERAL, CRANIAL & AUTONOMIC NERVE DISORDERS",01,DISEASES AND DISORDERS OF THE NERVOUS SYSTEM,2,Moderate,Moderate,Medical,Medicare,Medicaid,,,,true,38350.95,25488.04
New York City,Manhattan,7002001,001438,Bellevue Hospital Center,50 to 69,112,M,Other Race,Not Span/Hispanic,1,Emergency,Home or Self Care,2019,END003,DIABETES MELLITUS WITH COMPLICATION,ADM021,"ADMINISTRATION OF THERAPEUTIC SUBSTANCES, NEC",048,"PERIPHERAL, CRANIAL & AUTONOMIC NERVE DISORDERS",01,DISEASES AND DISORDERS OF THE NERVOUS SYSTEM,2,Moderate,Minor,Medical,Private Health Insurance,,,,,true,8019.16,5329.53
New York City,Manhattan,7002001,001438,Bellevue Hospital Center,30 to 49,112,F,Other Race,Not Span/Hispanic,6,Emergency,Inpatient Rehabilitation Facility,2019,END003,DIABETES MELLITUS WITH COMPLICATION,IMG009,PLAIN RADIOGRAPHY,048,"PERIPHERAL, CRANIAL & AUTONOMIC NERVE DISORDERS",01,DISEASES AND DISORDERS OF THE NERVOUS SYSTEM,2,Moderate,Minor,Medical,Medicaid,,,,,true,41847.02,27811.53
New York City,Manhattan,7002001,001438,Bellevue Hospital Center,50 to 69,100,M,Other Race,Spanish/Hispanic,9,Emergency,Home or Self Care,2019,NVS017,NERVE AND NERVE ROOT DISORDERS,ADM021,"ADMINISTRATION OF THERAPEUTIC SUBSTANCES, NEC",048,"PERIPHERAL, CRANIAL & AUTONOMIC NERVE DISORDERS",01,DISEASES AND DISORDERS OF THE NERVOUS SYSTEM,3,Major,Moderate,Medical,Medicaid,,,,,true,69558.6,46228.65
New York City,Manhattan,7002001,001438,Bellevue Hospital Center,30 to 49,112,F,Other Race,Not Span/Hispanic,1,Urgent,Home or Self Care,2019,NVS017,NERVE AND NERVE ROOT DISORDERS,IMG005,MAGNETIC RESONANCE IMAGING (MRI),048,"PERIPHERAL, CRANIAL & AUTONOMIC NERVE DISORDERS",01,DISEASES AND DISORDERS OF THE NERVOUS SYSTEM,1,Minor,Minor,Medical,Medicaid,,,,,false,10827.97,7196.27
New York City,Manhattan,7002001,001438,Bellevue Hospital Center,50 to 69,112,M,Black/African American,Not Span/Hispanic,1,Emergency,Home or Self Care,2019,NVS017,NERVE AND NERVE ROOT DISORDERS,,,048,"PERIPHERAL, CRANIAL & AUTONOMIC NERVE DISORDERS",01,DISEASES AND DISORDERS OF THE NERVOUS SYSTEM,2,Moderate,Moderate,Medical,Private Health Insurance,,,,,true,17206.55,11435.47
New York City,Manhattan,7002001,001438,Bellevue Hospital Center,30 to 49,100,F,Other Race,Spanish/Hispanic,2,Urgent,Home or Self Care,2019,NVS017,NERVE AND NERVE ROOT DISORDERS,IMG005,MAGNETIC RESONANCE IMAGING (MRI),048,"PERIPHERAL, CRANIAL & AUTONOMIC NERVE DISORDERS",01,DISEASES AND DISORDERS OF THE NERVOUS SYSTEM,2,Moderate,Minor,Medical,Medicaid,,,,,false,20870.45,13870.5
New York City,Manhattan,7002001,001438,Bellevue Hospital Center,50 to 69,112,F,Black/African American,Not Span/Hispanic,4,Urgent,Home or Self Care,2019,NVS008,PARALYSIS (OTHER THAN CEREBRAL PALSY),IMG005,MAGNETIC RESONANCE IMAGING (MRI),048,"PERIPHERAL, CRANIAL & AUTONOMIC NERVE DISORDERS",01,DISEASES AND DISORDERS OF THE NERVOUS SYSTEM,2,Moderate,Moderate,Medical,Private Health Insurance,,,,,false,41488.9,27573.52
New York City,Manhattan,7002001,001438,Bellevue Hospital Center,50 to 69,104,M,Black/African American,Not Span/Hispanic,6,Emergency,Home or Self Care,2019,END003,DIABETES MELLITUS WITH COMPLICATION,IMG008,ULTRASONOGRAPHY,048,"PERIPHERAL, CRANIAL & AUTONOMIC NERVE DISORDERS",01,DISEASES AND DISORDERS OF THE NERVOUS SYSTEM,3,Major,Moderate,Medical,Medicare,,,,,true,49444.3,32860.68
New York City,Manhattan,7002001,001438,Bellevue Hospital Center,50 to 69,114,M,Other Race,Unknown,1,Urgent,Home or Self Care,2019,MUS011,SPONDYLOPATHIES/SPONDYLOARTHROPATHY (INCLUDING INFECTIVE),ADM020,"ADMINISTRATION OF DIAGNOSTIC SUBSTANCES, NEC",048,"PERIPHERAL, CRANIAL & AUTONOMIC NERVE DISORDERS",01,DISEASES AND DISORDERS OF THE NERVOUS SYSTEM,1,Minor,Minor,Medical,Self-Pay,,,,,false,10310.19,6852.15
New York City,Manhattan,7002001,001438,Bellevue Hospital Center,50 to 69,100,M,Other Race,Spanish/Hispanic,3,Newborn,Home or Self Care,2019,END003,DIABETES MELLITUS WITH COMPLICATION,IMG007,COMPUTERIZED TOMOGRAPHY (CT) WITHOUT CONTRAST,048,"PERIPHERAL, CRANIAL & AUTONOMIC NERVE DISORDERS",01,DISEASES AND DISORDERS OF THE NERVOUS SYSTEM,2,Moderate,Minor,Medical,Medicaid,,,,,true,20781.31,13811.26
New York City,Manhattan,7002001,001438,Bellevue Hospital Center,50 to 69,100,M,Other Race,Spanish/Hispanic,7,Emergency,Home or Self Care,2019,END003,DIABETES MELLITUS WITH COMPLICATION,ADM007,INTRAVENOUS INDUCTION OF LABOR,048,"PERIPHERAL, CRANIAL & AUTONOMIC NERVE DISORDERS",01,DISEASES AND DISORDERS OF THE NERVOUS SYSTEM,2,Moderate,Minor,Medical,Medicaid,,,,,true,47992.97,31896.13
New York City,Manhattan,7002001,001438,Bellevue Hospital Center,50 to 69,100,M,Black/African American,Not Span/Hispanic,3,Emergency,Home or Self Care,2019,END003,DIABETES MELLITUS WITH COMPLICATION,IMG009,PLAIN RADIOGRAPHY,048,"PERIPHERAL, CRANIAL & AUTONOMIC NERVE DISORDERS",01,DISEASES AND DISORDERS OF THE NERVOUS SYSTEM,2,Moderate,Moderate,Medical,Medicare,,,,,true,30678.05,20388.63
New York City,Manhattan,7002001,001438,Bellevue Hospital Center,30 to 49,111,F,Other Race,Spanish/Hispanic,1,Emergency,Home or Self Care,2019,NVS017,NERVE AND NERVE ROOT DISORDERS,CNS002,LUMBAR PUNCTURE,048,"PERIPHERAL, CRANIAL & AUTONOMIC NERVE DISORDERS",01,DISEASES AND DISORDERS OF THE NERVOUS SYSTEM,1,Minor,Minor,Medical,Self-Pay,,,,,true,27127.35,18028.84
New York City,Manhattan,7002001,001438,Bellevue Hospital Center,18 to 29,104,M,Black/African American,Not Span/Hispanic,1,Trauma,Home or Self Care,2019,NVS015,POLYNEUROPATHIES,ADM021,"ADMINISTRATION OF THERAPEUTIC SUBSTANCES, NEC",048,"PERIPHERAL, CRANIAL & AUTONOMIC NERVE DISORDERS",01,DISEASES AND DISORDERS OF THE NERVOUS SYSTEM,2,Moderate,Minor,Medical,Medicaid,,,,,false,6214.07,4129.87
New York City,Manhattan,7002001,001438,Bellevue Hospital Center,30 to 49,104,F,Other Race,Spanish/Hispanic,1,Emergency,Home or Self Care,2019,MUS011,SPONDYLOPATHIES/SPONDYLOARTHROPATHY (INCLUDING INFECTIVE),ADM020,"ADMINISTRATION OF DIAGNOSTIC SUBSTANCES, NEC",048,"PERIPHERAL, CRANIAL & AUTONOMIC NERVE DISORDERS",01,DISEASES AND DISORDERS OF THE NERVOUS SYSTEM,1,Minor,Minor,Medical,Medicaid,,,,,true,20034.62,13315.01
New York City,Manhattan,7002001,001438,Bellevue Hospital Center,70 or Older,112,M,White,Not Span/Hispanic,1,Urgent,Home or Self Care,2019,EYE006,NEURO-OPHTHALMOLOGY,ADM017,ADMINISTRATION OF NUTRITIONAL AND ELECTROLYTIC SUBSTANCES,048,"PERIPHERAL, CRANIAL & AUTONOMIC NERVE DISORDERS",01,DISEASES AND DISORDERS OF THE NERVOUS SYSTEM,2,Moderate,Minor,Medical,Medicaid,,,,,false,13165.73,8749.94
New York City,Manhattan,7002001,001438,Bellevue Hospital Center,30 to 49,113,M,Other Race,Unknown,2,Elective,Court/Law Enforcement,2019,NVS017,NERVE AND NERVE ROOT DISORDERS,IMG008,ULTRASONOGRAPHY,048,"PERIPHERAL, CRANIAL & AUTONOMIC NERVE DISORDERS",01,DISEASES AND DISORDERS OF THE NERVOUS SYSTEM,2,Moderate,Minor,Medical,Medicaid,,,,,false,16347.32,10864.43
New York City,Manhattan,7002001,001438,Bellevue Hospital Center,18 to 29,104,F,Black/African American,Not Span/Hispanic,2,Emergency,Home or Self Care,2019,NVS017,NERVE AND NERVE ROOT DISORDERS,IMG005,MAGNETIC RESONANCE IMAGING (MRI),048,"PERIPHERAL, CRANIAL & AUTONOMIC NERVE DISORDERS",01,DISEASES AND DISORDERS OF THE NERVOUS SYSTEM,1,Minor,Minor,Medical,Medicaid,,,,,true,23840.41,15844.34
