Hospital Service Area,Hospital County,Operating Certificate Number,Permanent Facility Id,Facility Name,Age Group,Zip Code - 3 digits,Gender,Race,Ethnicity,Length of Stay,Type of Admission,Patient Disposition,Discharge Year,CCS Diagnosis Code,CCS Diagnosis Description,CCS Procedure Code,CCS Procedure Description,APR DRG Code,APR DRG Description,APR MDC Code,APR MDC Description,APR Severity of Illness Code,APR Severity of Illness Description,APR Risk of Mortality,APR Medical Surgical Description,Payment Typology 1,Payment Typology 2,Payment Typology 3,Birth Weight,Abortion Edit Indicator,Emergency Department Indicator,Total Charges,Total Costs
Long Island,Nassau,2908000,000511,NYU Langone Hospital-Long Island,30 to 49,115,M,White,Not Span/Hispanic,2,Emergency,Home or Self Care,2020,EYE006,NEURO-OPHTHALMOLOGY,ENT002,ENT DIAGNOSTIC ENDOSCOPY (EXCLUDING LARYNGOSCOPY),048,"PERIPHERAL, CRANIAL & AUTONOMIC NERVE DISORDERS",01,DISEASES AND DISORDERS OF THE NERVOUS SYSTEM,2,Moderate,Minor,Medical,Private Health Insurance,,,,,Y,61335.24,8933.74
Long Island,Nassau,2908000,000511,NYU Langone Hospital-Long Island,30 to 49,119,F,White,Not Span/Hispanic,6,Emergency,Home or Self Care,2020,END003,DIABETES MELLITUS WITH COMPLICATION,CAR024,VENOUS AND ARTERIAL CATHETER PLACEMENT,048,"PERIPHERAL, CRANIAL & AUTONOMIC NERVE DISORDERS",01,DISEASES AND DISORDERS OF THE NERVOUS SYSTEM,2,Moderate,Moderate,Medical,Blue Cross/Blue Shield,Medicare,,,,Y,112828.81,24528.55
Long Island,Nassau,2908000,000511,NYU Langone Hospital-Long Island,50 to 69,115,F,White,Not Span/Hispanic,1,Emergency,Home or Self Care,2020,END003,DIABETES MELLITUS WITH COMPLICATION,GIS001,ESOPHAGOGASTRODUODENOSCOPY (EGD) WITH BIOPSY,048,"PERIPHERAL, CRANIAL & AUTONOMIC NERVE DISORDERS",01,DISEASES AND DISORDERS OF THE NERVOUS SYSTEM,1,Minor,Minor,Medical,Private Health Insurance,,,,,Y,40178.17,7115.01
Long Island,Nassau,2908000,000511,NYU Langone Hospital-Long Island,30 to 49,115,F,White,Not Span/Hispanic,1,Emergency,Home or Self Care,2020,END003,DIABETES MELLITUS WITH COMPLICATION,,,048,"PERIPHERAL, CRANIAL & AUTONOMIC NERVE DISORDERS",01,DISEASES AND DISORDERS OF THE NERVOUS SYSTEM,1,Minor,Minor,Medical,Blue Cross/Blue Shield,Medicare,,,,Y,15800.9,4311.64
Long Island,Nassau,2908000,000511,NYU Langone Hospital-Long Island,70 or Older,114,M,Black/African American,Not Span/Hispanic,1,Emergency,Home w/ Home Health Services,2020,NVS017,NERVE AND NERVE ROOT DISORDERS,,,048,"PERIPHERAL, CRANIAL & AUTONOMIC NERVE DISORDERS",01,DISEASES AND DISORDERS OF THE NERVOUS SYSTEM,1,Minor,Major,Medical,Medicaid,,,,,Y,24966.36,5204.04
Long Island,Nassau,2908000,000511,NYU Langone Hospital-Long Island,50 to 69,109,F,Black/African American,Not Span/Hispanic,6,Emergency,Home or Self Care,2020,NVS017,NERVE AND NERVE ROOT DISORDERS,ENT002,ENT DIAGNOSTIC ENDOSCOPY (EXCLUDING LARYNGOSCOPY),048,"PERIPHERAL, CRANIAL & AUTONOMIC NERVE DISORDERS",01,DISEASES AND DISORDERS OF THE NERVOUS SYSTEM,1,Minor,Major,Medical,Private Health Insurance,,,,,Y,65896.44,20772.5
Long Island,Nassau,2908000,000511,NYU Langone Hospital-Long Island,18 to 29,113,M,White,Not Span/Hispanic,1,Emergency,Home or Self Care,2020,NVS017,NERVE AND NERVE ROOT DISORDERS,CNS007,CNS EXCISION PROCEDURES,048,"PERIPHERAL, CRANIAL & AUTONOMIC NERVE DISORDERS",01,DISEASES AND DISORDERS OF THE NERVOUS SYSTEM,1,Minor,Minor,Medical,Blue Cross/Blue Shield,,,,,Y,49812.33,8255.04
Long Island,Nassau,2908000,000511,NYU Langone Hospital-Long Island,30 to 49,115,M,Black/African American,Not Span/Hispanic,1,Emergency,Left Against Medical Advice,2020,END003,DIABETES MELLITUS WITH COMPLICATION,,,048,"PERIPHERAL, CRANIAL & AUTONOMIC NERVE DISORDERS",01,DISEASES AND DISORDERS OF THE NERVOUS SYSTEM,2,Moderate,Major,Medical,Blue Cross/Blue Shield,,,,,Y,22755.03,4761.47
Long Island,Nassau,2908000,000511,NYU Langone Hospital-Long Island,30 to 49,114,F,Black/African American,Not Span/Hispanic,3,Emergency,Home or Self Care,2020,END003,DIABETES MELLITUS WITH COMPLICATION,GIS027,"UPPER GI THERAPEUTIC PROCEDURES, NEC (ENDOSCOPIC)",048,"PERIPHERAL, CRANIAL & AUTONOMIC NERVE DISORDERS",01,DISEASES AND DISORDERS OF THE NERVOUS SYSTEM,2,Moderate,Minor,Medical,Blue Cross/Blue Shield,,,,,Y,61210.81,14344.24
Long Island,Nassau,2908000,000511,NYU Langone Hospital-Long Island,70 or Older,115,M,White,Not Span/Hispanic,1,Emergency,Home or Self Care,2020,NVS017,NERVE AND NERVE ROOT DISORDERS,,,048,"PERIPHERAL, CRANIAL & AUTONOMIC NERVE DISORDERS",01,DISEASES AND DISORDERS OF THE NERVOUS SYSTEM,2,Moderate,Major,Medical,Medicare,,,,,Y,47743.02,6693.26
Long Island,Nassau,2908000,000511,NYU Langone Hospital-Long Island,70 or Older,117,F,White,Not Span/Hispanic,1,Emergency,Home or Self Care,2020,NVS015,POLYNEUROPATHIES,MAM011,ELECTROENCEPHALOGRAM (EEG),048,"PERIPHERAL, CRANIAL & AUTONOMIC NERVE DISORDERS",01,DISEASES AND DISORDERS OF THE NERVOUS SYSTEM,2,Moderate,Minor,Medical,Medicare,Private Health Insurance,,,,Y,28961.63,4797.47
Long Island,Nassau,2908000,000511,NYU Langone Hospital-Long Island,70 or Older,115,F,White,Not Span/Hispanic,10,Emergency,Hospice - Home,2020,END003,DIABETES MELLITUS WITH COMPLICATION,GIS001,ESOPHAGOGASTRODUODENOSCOPY (EGD) WITH BIOPSY,048,"PERIPHERAL, CRANIAL & AUTONOMIC NERVE DISORDERS",01,DISEASES AND DISORDERS OF THE NERVOUS SYSTEM,3,Major,Major,Medical,Medicare,Blue Cross/Blue Shield,,,,Y,119187.41,37205.33
Long Island,Nassau,2908000,000511,NYU Langone Hospital-Long Island,30 to 49,115,M,Black/African American,Not Span/Hispanic,2,Emergency,Home or Self Care,2020,END003,DIABETES MELLITUS WITH COMPLICATION,GIS001,ESOPHAGOGASTRODUODENOSCOPY (EGD) WITH BIOPSY,048,"PERIPHERAL, CRANIAL & AUTONOMIC NERVE DISORDERS",01,DISEASES AND DISORDERS OF THE NERVOUS SYSTEM,2,Moderate,Moderate,Medical,Blue Cross/Blue Shield,,,,,Y,51579.55,10440.18
Long Island,Nassau,2908000,000511,NYU Langone Hospital-Long Island,30 to 49,114,F,Black/African American,Not Span/Hispanic,1,Emergency,Home or Self Care,2020,END003,DIABETES MELLITUS WITH COMPLICATION,,,048,"PERIPHERAL, CRANIAL & AUTONOMIC NERVE DISORDERS",01,DISEASES AND DISORDERS OF THE NERVOUS SYSTEM,2,Moderate,Moderate,Medical,Blue Cross/Blue Shield,,,,,Y,16362.88,4348.03
Long Island,Nassau,2908000,000511,NYU Langone Hospital-Long Island,30 to 49,115,F,Other Race,Spanish/Hispanic,2,Emergency,Home or Self Care,2020,EYE006,NEURO-OPHTHALMOLOGY,,,048,"PERIPHERAL, CRANIAL & AUTONOMIC NERVE DISORDERS",01,DISEASES AND DISORDERS OF THE NERVOUS SYSTEM,2,Moderate,Moderate,Medical,Medicaid,,,,,Y,80022.98,10025.36
Long Island,Nassau,2908000,000511,NYU Langone Hospital-Long Island,18 to 29,115,F,White,Spanish/Hispanic,2,Emergency,Home or Self Care,2020,NVS017,NERVE AND NERVE ROOT DISORDERS,ADM005,ADMINISTRATION OF THROMBOLYTICS AND PLATELET INHIBITORS,048,"PERIPHERAL, CRANIAL & AUTONOMIC NERVE DISORDERS",01,DISEASES AND DISORDERS OF THE NERVOUS SYSTEM,1,Minor,Minor,Medical,Medicaid,,,,,Y,161120.47,20403.63
Long Island,Nassau,2908000,000511,NYU Langone Hospital-Long Island,30 to 49,115,M,White,Spanish/Hispanic,1,Emergency,Home or Self Care,2020,NVS017,NERVE AND NERVE ROOT DISORDERS,,,048,"PERIPHERAL, CRANIAL & AUTONOMIC NERVE DISORDERS",01,DISEASES AND DISORDERS OF THE NERVOUS SYSTEM,1,Minor,Minor,Medical,Blue Cross/Blue Shield,,,,,Y,55565.9,8323.55
Long Island,Nassau,2908000,000511,NYU Langone Hospital-Long Island,30 to 49,110,M,White,Unknown,2,Emergency,Home or Self Care,2020,END003,DIABETES MELLITUS WITH COMPLICATION,,,048,"PERIPHERAL, CRANIAL & AUTONOMIC NERVE DISORDERS",01,DISEASES AND DISORDERS OF THE NERVOUS SYSTEM,2,Moderate,Moderate,Medical,Medicaid,,,,,Y,39520.04,8876.06
Long Island,Nassau,2908000,000511,NYU Langone Hospital-Long Island,50 to 69,117,F,White,Not Span/Hispanic,1,Emergency,Home or Self Care,2020,NVS017,NERVE AND NERVE ROOT DISORDERS,,,048,"PERIPHERAL, CRANIAL & AUTONOMIC NERVE DISORDERS",01,DISEASES AND DISORDERS OF THE NERVOUS SYSTEM,1,Minor,Minor,Medical,Blue Cross/Blue Shield,Medicare,,,,Y,18356.78,4419.26
Long Island,Nassau,2908000,000511,NYU Langone Hospital-Long Island,0 to 17,115,F,Other Race,Spanish/Hispanic,7,Emergency,Home or Self Care,2020,NVS019,NERVOUS SYSTEM PAIN AND PAIN SYNDROMES,,,048,"PERIPHERAL, CRANIAL & AUTONOMIC NERVE DISORDERS",01,DISEASES AND DISORDERS OF THE NERVOUS SYSTEM,2,Moderate,Minor,Medical,Medicaid,,,,,Y,98883.8,18401.08
Long Island,Nassau,2908000,000511,NYU Langone Hospital-Long Island,70 or Older,115,M,Black/African American,Not Span/Hispanic,2,Emergency,Home w/ Home Health Services,2020,END003,DIABETES MELLITUS WITH COMPLICATION,,,048,"PERIPHERAL, CRANIAL & AUTONOMIC NERVE DISORDERS",01,DISEASES AND DISORDERS OF THE NERVOUS SYSTEM,2,Moderate,Minor,Medical,Medicare,,,,,Y,49184.63,9389.07
Long Island,Nassau,2908000,000511,NYU Langone Hospital-Long Island,50 to 69,115,F,White,Not Span/Hispanic,2,Emergency,Skilled Nursing Home,2020,END003,DIABETES MELLITUS WITH COMPLICATION,,,048,"PERIPHERAL, CRANIAL & AUTONOMIC NERVE DISORDERS",01,DISEASES AND DISORDERS OF THE NERVOUS SYSTEM,1,Minor,Minor,Medical,Medicare,Blue Cross/Blue Shield,,,,Y,33232.28,7827.32
Long Island,Nassau,2908000,000511,NYU Langone Hospital-Long Island,50 to 69,115,F,Multi-racial,Not Span/Hispanic,16,Emergency,Home w/ Home Health Services,2020,END003,DIABETES MELLITUS WITH COMPLICATION,OTR004,ISOLATION PROCEDURES,048,"PERIPHERAL, CRANIAL & AUTONOMIC NERVE DISORDERS",01,DISEASES AND DISORDERS OF THE NERVOUS SYSTEM,3,Major,Major,Medical,Medicaid,,,,,Y,236027.78,78817.94
Long Island,Nassau,2908000,000511,NYU Langone Hospital-Long Island,30 to 49,114,F,White,Spanish/Hispanic,2,Emergency,Home or Self Care,2020,END003,DIABETES MELLITUS WITH COMPLICATION,,,048,"PERIPHERAL, CRANIAL & AUTONOMIC NERVE DISORDERS",01,DISEASES AND DISORDERS OF THE NERVOUS SYSTEM,1,Minor,Minor,Medical,Medicaid,,,,,Y,57888.74,9479.03
Long Island,Nassau,2908000,000511,NYU Langone Hospital-Long Island,70 or Older,115,M,Black/African American,Not Span/Hispanic,2,Emergency,Inpatient Rehabilitation Facility,2020,END003,DIABETES MELLITUS WITH COMPLICATION,,,048,"PERIPHERAL, CRANIAL & AUTONOMIC NERVE DISORDERS",01,DISEASES AND DISORDERS OF THE NERVOUS SYSTEM,2,Moderate,Moderate,Medical,Medicare,Medicare,,,,Y,60783.11,10908.65
Long Island,Nassau,2908000,000511,NYU Langone Hospital-Long Island,50 to 69,117,F,Other Race,Spanish/Hispanic,1,Emergency,Home or Self Care,2020,END003,DIABETES MELLITUS WITH COMPLICATION,,,048,"PERIPHERAL, CRANIAL & AUTONOMIC NERVE DISORDERS",01,DISEASES AND DISORDERS OF THE NERVOUS SYSTEM,2,Moderate,Moderate,Medical,Private Health Insurance,,,,,Y,41533.51,6966.11
Long Island,Nassau,2908000,000511,NYU Langone Hospital-Long Island,18 to 29,110,M,Black/African American,Not Span/Hispanic,2,Emergency,Home or Self Care,2020,END003,DIABETES MELLITUS WITH COMPLICATION,OTR004,ISOLATION PROCEDURES,048,"PERIPHERAL, CRANIAL & AUTONOMIC NERVE DISORDERS",01,DISEASES AND DISORDERS OF THE NERVOUS SYSTEM,3,Major,Moderate,Medical,Medicaid,,,,,Y,37035.33,8700.32
Long Island,Nassau,2908000,000511,NYU Langone Hospital-Long Island,70 or Older,115,M,White,Not Span/Hispanic,4,Emergency,Skilled Nursing Home,2020,NVS008,PARALYSIS (OTHER THAN CEREBRAL PALSY),RAD001,BEAM RADIATION,048,"PERIPHERAL, CRANIAL & AUTONOMIC NERVE DISORDERS",01,DISEASES AND DISORDERS OF THE NERVOUS SYSTEM,3,Major,Major,Medical,Medicare,Medicare,,,,Y,124584.59,28258.32
Long Island,Nassau,2908000,000511,NYU Langone Hospital-Long Island,70 or Older,115,M,Other Race,Spanish/Hispanic,1,Emergency,Home w/ Home Health Services,2020,END003,DIABETES MELLITUS WITH COMPLICATION,,,048,"PERIPHERAL, CRANIAL & AUTONOMIC NERVE DISORDERS",01,DISEASES AND DISORDERS OF THE NERVOUS SYSTEM,2,Moderate,Moderate,Medical,Medicare,Medicaid,,,,Y,24822.21,6363.82
Long Island,Nassau,2908000,000511,NYU Langone Hospital-Long Island,50 to 69,115,F,Other Race,Not Span/Hispanic,2,Emergency,Home or Self Care,2020,NVS020,OTHER SPECIFIED NERVOUS SYSTEM DISORDERS,MST028,"SUBCUTANEOUS TISSUE AND FASCIA PROCEDURES, NEC",048,"PERIPHERAL, CRANIAL & AUTONOMIC NERVE DISORDERS",01,DISEASES AND DISORDERS OF THE NERVOUS SYSTEM,2,Moderate,Major,Medical,Medicare,Medicaid,,,,Y,185111.3,32785.24
Long Island,Nassau,2908000,000511,NYU Langone Hospital-Long Island,30 to 49,116,F,Black/African American,Not Span/Hispanic,11,Emergency,Skilled Nursing Home,2020,END003,DIABETES MELLITUS WITH COMPLICATION,GIS001,ESOPHAGOGASTRODUODENOSCOPY (EGD) WITH BIOPSY,048,"PERIPHERAL, CRANIAL & AUTONOMIC NERVE DISORDERS",01,DISEASES AND DISORDERS OF THE NERVOUS SYSTEM,3,Major,Major,Medical,Blue Cross/Blue Shield,,,,,Y,238362.89,59873.42
Long Island,Nassau,2908000,000511,NYU Langone Hospital-Long Island,18 to 29,115,M,Other Race,Spanish/Hispanic,6,Emergency,Home or Self Care,2020,END003,DIABETES MELLITUS WITH COMPLICATION,,,048,"PERIPHERAL, CRANIAL & AUTONOMIC NERVE DISORDERS",01,DISEASES AND DISORDERS OF THE NERVOUS SYSTEM,2,Moderate,Moderate,Medical,Medicaid,,,,,Y,98448.6,29918.21
Long Island,Nassau,2908000,000511,NYU Langone Hospital-Long Island,50 to 69,115,F,Black/African American,Not Span/Hispanic,5,Emergency,Skilled Nursing Home,2020,END003,DIABETES MELLITUS WITH COMPLICATION,ESA001,HEMODIALYSIS,048,"PERIPHERAL, CRANIAL & AUTONOMIC NERVE DISORDERS",01,DISEASES AND DISORDERS OF THE NERVOUS SYSTEM,3,Major,Major,Medical,Medicare,Private Health Insurance,,,,Y,77453.9,28387.12
Long Island,Nassau,2908000,000511,NYU Langone Hospital-Long Island,30 to 49,115,F,Black/African American,Not Span/Hispanic,1,Emergency,Home or Self Care,2020,END003,DIABETES MELLITUS WITH COMPLICATION,,,048,"PERIPHERAL, CRANIAL & AUTONOMIC NERVE DISORDERS",01,DISEASES AND DISORDERS OF THE NERVOUS SYSTEM,2,Moderate,Moderate,Medical,Medicaid,,,,,Y,25812.06,6104.53
Long Island,Nassau,2908000,000511,NYU Langone Hospital-Long Island,50 to 69,114,F,Other Race,Not Span/Hispanic,6,Emergency,Home or Self Care,2020,NVS015,POLYNEUROPATHIES,OTR004,ISOLATION PROCEDURES,048,"PERIPHERAL, CRANIAL & AUTONOMIC NERVE DISORDERS",01,DISEASES AND DISORDERS OF THE NERVOUS SYSTEM,3,Major,Moderate,Medical,Private Health Insurance,,,,,Y,132277.71,33213.15
Long Island,Nassau,2908000,000511,NYU Langone Hospital-Long Island,30 to 49,115,F,Black/African American,Not Span/Hispanic,4,Emergency,Home or Self Care,2020,END003,DIABETES MELLITUS WITH COMPLICATION,GIS001,ESOPHAGOGASTRODUODENOSCOPY (EGD) WITH BIOPSY,048,"PERIPHERAL, CRANIAL & AUTONOMIC NERVE DISORDERS",01,DISEASES AND DISORDERS OF THE NERVOUS SYSTEM,3,Major,Moderate,Medical,Medicaid,,,,,Y,96894.1,29087.07
Long Island,Nassau,2908000,000511,NYU Langone Hospital-Long Island,70 or Older,115,M,Other Race,Not Span/Hispanic,2,Emergency,Home w/ Home Health Services,2020,MUS011,SPONDYLOPATHIES/SPONDYLOARTHROPATHY (INCLUDING INFECTIVE),,,048,"PERIPHERAL, CRANIAL & AUTONOMIC NERVE DISORDERS",01,DISEASES AND DISORDERS OF THE NERVOUS SYSTEM,3,Major,Moderate,Medical,Medicaid,,,,,Y,70465.24,16283.39
Long Island,Nassau,2908000,000511,NYU Langone Hospital-Long Island,70 or Older,115,M,Black/African American,Not Span/Hispanic,1,Emergency,Home w/ Home Health Services,2020,MUS011,SPONDYLOPATHIES/SPONDYLOARTHROPATHY (INCLUDING INFECTIVE),,,048,"PERIPHERAL, CRANIAL & AUTONOMIC NERVE DISORDERS",01,DISEASES AND DISORDERS OF THE NERVOUS SYSTEM,2,Moderate,Moderate,Medical,Medicare,,,,,Y,56305.18,8514.14
Long Island,Nassau,2908000,000511,NYU Langone Hospital-Long Island,30 to 49,110,M,White,Unknown,3,Emergency,Home or Self Care,2020,NVS015,POLYNEUROPATHIES,GIS001,ESOPHAGOGASTRODUODENOSCOPY (EGD) WITH BIOPSY,048,"PERIPHERAL, CRANIAL & AUTONOMIC NERVE DISORDERS",01,DISEASES AND DISORDERS OF THE NERVOUS SYSTEM,3,Major,Moderate,Medical,Medicaid,,,,,Y,95546.55,21440.63
Long Island,Nassau,2908000,000511,NYU Langone Hospital-Long Island,50 to 69,110,M,White,Not Span/Hispanic,11,Emergency,Home w/ Home Health Services,2020,NVS015,POLYNEUROPATHIES,,,048,"PERIPHERAL, CRANIAL & AUTONOMIC NERVE DISORDERS",01,DISEASES AND DISORDERS OF THE NERVOUS SYSTEM,3,Major,Moderate,Medical,Medicare,,,,,Y,311873.17,60931.85
Long Island,Nassau,2908000,000511,NYU Langone Hospital-Long Island,70 or Older,115,F,Black/African American,Not Span/Hispanic,9,Emergency,Home or Self Care,2020,NVS015,POLYNEUROPATHIES,,,048,"PERIPHERAL, CRANIAL & AUTONOMIC NERVE DISORDERS",01,DISEASES AND DISORDERS OF THE NERVOUS SYSTEM,3,Major,Minor,Medical,Medicare,Private Health Insurance,,,,Y,117110.48,43638.32
Long Island,Nassau,2908000,000511,NYU Langone Hospital-Long Island,18 to 29,115,M,White,Not Span/Hispanic,2,Emergency,Home or Self Care,2020,NVS020,OTHER SPECIFIED NERVOUS SYSTEM DISORDERS,,,048,"PERIPHERAL, CRANIAL & AUTONOMIC NERVE DISORDERS",01,DISEASES AND DISORDERS OF THE NERVOUS SYSTEM,1,Minor,Minor,Medical,Blue Cross/Blue Shield,,,,,Y,51888.3,8371.09
Long Island,Nassau,2908000,000511,NYU Langone Hospital-Long Island,50 to 69,115,M,Other Race,Spanish/Hispanic,6,Emergency,Home or Self Care,2020,END003,DIABETES MELLITUS WITH COMPLICATION,GIS001,ESOPHAGOGASTRODUODENOSCOPY (EGD) WITH BIOPSY,048,"PERIPHERAL, CRANIAL & AUTONOMIC NERVE DISORDERS",01,DISEASES AND DISORDERS OF THE NERVOUS SYSTEM,2,Moderate,Moderate,Medical,Medicare,Medicaid,,,,Y,173066.98,40018.42
Long Island,Nassau,2908000,000511,NYU Langone Hospital-Long Island,50 to 69,115,M,White,Not Span/Hispanic,1,Emergency,Home or Self Care,2020,END003,DIABETES MELLITUS WITH COMPLICATION,,,048,"PERIPHERAL, CRANIAL & AUTONOMIC NERVE DISORDERS",01,DISEASES AND DISORDERS OF THE NERVOUS SYSTEM,1,Minor,Minor,Medical,Private Health Insurance,,,,,Y,45791.47,7336.96
Long Island,Nassau,2908000,000511,NYU Langone Hospital-Long Island,50 to 69,113,M,Other Race,Spanish/Hispanic,3,Emergency,Home w/ Home Health Services,2020,MUS011,SPONDYLOPATHIES/SPONDYLOARTHROPATHY (INCLUDING INFECTIVE),,,048,"PERIPHERAL, CRANIAL & AUTONOMIC NERVE DISORDERS",01,DISEASES AND DISORDERS OF THE NERVOUS SYSTEM,1,Minor,Minor,Medical,Medicare,,,,,Y,88745.03,17336.82
Long Island,Nassau,2908000,000511,NYU Langone Hospital-Long Island,70 or Older,115,M,Other Race,Spanish/Hispanic,3,Emergency,Home w/ Home Health Services,2020,NVS008,PARALYSIS (OTHER THAN CEREBRAL PALSY),MAM004,CARDIAC STRESS TESTS,048,"PERIPHERAL, CRANIAL & AUTONOMIC NERVE DISORDERS",01,DISEASES AND DISORDERS OF THE NERVOUS SYSTEM,2,Moderate,Moderate,Medical,Medicare,,,,,Y,56094.74,16870.49
Long Island,Nassau,2908000,000511,NYU Langone Hospital-Long Island,70 or Older,113,M,White,Not Span/Hispanic,3,Emergency,Home w/ Home Health Services,2020,END003,DIABETES MELLITUS WITH COMPLICATION,,,048,"PERIPHERAL, CRANIAL & AUTONOMIC NERVE DISORDERS",01,DISEASES AND DISORDERS OF THE NERVOUS SYSTEM,2,Moderate,Moderate,Medical,Medicare,,,,,Y,43369.69,15493
Long Island,Nassau,2908000,000511,NYU Langone Hospital-Long Island,18 to 29,115,M,Other Race,Spanish/Hispanic,1,Emergency,Left Against Medical Advice,2020,END003,DIABETES MELLITUS WITH COMPLICATION,GIS001,ESOPHAGOGASTRODUODENOSCOPY (EGD) WITH BIOPSY,048,"PERIPHERAL, CRANIAL & AUTONOMIC NERVE DISORDERS",01,DISEASES AND DISORDERS OF THE NERVOUS SYSTEM,1,Minor,Minor,Medical,Medicaid,,,,,Y,58977.89,9179.28
Long Island,Nassau,2908000,000511,NYU Langone Hospital-Long Island,30 to 49,115,F,Black/African American,Not Span/Hispanic,8,Emergency,Left Against Medical Advice,2020,END003,DIABETES MELLITUS WITH COMPLICATION,ADM013,PERITONEAL DIALYSIS,048,"PERIPHERAL, CRANIAL & AUTONOMIC NERVE DISORDERS",01,DISEASES AND DISORDERS OF THE NERVOUS SYSTEM,3,Major,Major,Medical,Medicare,Medicaid,,,,Y,157708.22,54992
Long Island,Nassau,2908000,000511,NYU Langone Hospital-Long Island,30 to 49,115,F,Black/African American,Not Span/Hispanic,3,Emergency,Home or Self Care,2020,NVS017,NERVE AND NERVE ROOT DISORDERS,ADM005,ADMINISTRATION OF THROMBOLYTICS AND PLATELET INHIBITORS,048,"PERIPHERAL, CRANIAL & AUTONOMIC NERVE DISORDERS",01,DISEASES AND DISORDERS OF THE NERVOUS SYSTEM,1,Minor,Moderate,Medical,Private Health Insurance,,,,,Y,213208.99,24731.39
Long Island,Nassau,2908000,000511,NYU Langone Hospital-Long Island,70 or Older,115,M,White,Not Span/Hispanic,6,Emergency,Inpatient Rehabilitation Facility,2020,NVS017,NERVE AND NERVE ROOT DISORDERS,OTR004,ISOLATION PROCEDURES,048,"PERIPHERAL, CRANIAL & AUTONOMIC NERVE DISORDERS",01,DISEASES AND DISORDERS OF THE NERVOUS SYSTEM,3,Major,Moderate,Medical,Medicare,Blue Cross/Blue Shield,,,,Y,114832.33,33070.44
Long Island,Nassau,2908000,000511,NYU Langone Hospital-Long Island,30 to 49,115,F,Black/African American,Not Span/Hispanic,2,Emergency,Home or Self Care,2020,NVS019,NERVOUS SYSTEM PAIN AND PAIN SYNDROMES,,,048,"PERIPHERAL, CRANIAL & AUTONOMIC NERVE DISORDERS",01,DISEASES AND DISORDERS OF THE NERVOUS SYSTEM,1,Minor,Minor,Medical,Medicare,Blue Cross/Blue Shield,,,,Y,32283.22,10633.84
Long Island,Nassau,2908000,000511,NYU Langone Hospital-Long Island,18 to 29,115,M,Other Race,Spanish/Hispanic,4,Emergency,Home or Self Care,2020,END003,DIABETES MELLITUS WITH COMPLICATION,ADM010,VACCINATIONS,048,"PERIPHERAL, CRANIAL & AUTONOMIC NERVE DISORDERS",01,DISEASES AND DISORDERS OF THE NERVOUS SYSTEM,3,Major,Major,Medical,Medicaid,,,,,Y,90629.21,21460.66
Long Island,Nassau,2908000,000511,NYU Langone Hospital-Long Island,70 or Older,115,M,White,Not Span/Hispanic,1,Emergency,Home or Self Care,2020,NVS017,NERVE AND NERVE ROOT DISORDERS,,,048,"PERIPHERAL, CRANIAL & AUTONOMIC NERVE DISORDERS",01,DISEASES AND DISORDERS OF THE NERVOUS SYSTEM,1,Minor,Minor,Medical,Medicare,Medicare,,,,Y,51169.8,8091.24
Long Island,Nassau,2908000,000511,NYU Langone Hospital-Long Island,70 or Older,115,F,White,Not Span/Hispanic,2,Trauma,Home w/ Home Health Services,2020,END003,DIABETES MELLITUS WITH COMPLICATION,,,048,"PERIPHERAL, CRANIAL & AUTONOMIC NERVE DISORDERS",01,DISEASES AND DISORDERS OF THE NERVOUS SYSTEM,3,Major,Major,Medical,Medicare,Blue Cross/Blue Shield,,,,Y,51386.42,13229.37
Long Island,Nassau,2908000,000511,NYU Langone Hospital-Long Island,30 to 49,115,F,Black/African American,Not Span/Hispanic,4,Emergency,Home or Self Care,2020,NVS015,POLYNEUROPATHIES,,,048,"PERIPHERAL, CRANIAL & AUTONOMIC NERVE DISORDERS",01,DISEASES AND DISORDERS OF THE NERVOUS SYSTEM,2,Moderate,Minor,Medical,Medicaid,,,,,Y,66775.13,20508.22
Long Island,Nassau,2908000,000511,NYU Langone Hospital-Long Island,50 to 69,117,M,White,Not Span/Hispanic,9,Emergency,Home or Self Care,2020,END003,DIABETES MELLITUS WITH COMPLICATION,,,048,"PERIPHERAL, CRANIAL & AUTONOMIC NERVE DISORDERS",01,DISEASES AND DISORDERS OF THE NERVOUS SYSTEM,3,Major,Major,Medical,Medicaid,,,,,Y,139503.16,46154.64
Long Island,Nassau,2908000,000511,NYU Langone Hospital-Long Island,70 or Older,117,F,White,Not Span/Hispanic,6,Emergency,Home w/ Home Health Services,2020,END003,DIABETES MELLITUS WITH COMPLICATION,,,048,"PERIPHERAL, CRANIAL & AUTONOMIC NERVE DISORDERS",01,DISEASES AND DISORDERS OF THE NERVOUS SYSTEM,1,Minor,Moderate,Medical,Medicare,Blue Cross/Blue Shield,,,,Y,98029.39,29495.3
Long Island,Nassau,2908000,000511,NYU Langone Hospital-Long Island,30 to 49,115,F,Black/African American,Not Span/Hispanic,7,Emergency,Home or Self Care,2020,END003,DIABETES MELLITUS WITH COMPLICATION,ADM013,PERITONEAL DIALYSIS,048,"PERIPHERAL, CRANIAL & AUTONOMIC NERVE DISORDERS",01,DISEASES AND DISORDERS OF THE NERVOUS SYSTEM,3,Major,Major,Medical,Medicare,Medicaid,,,,Y,147305.16,36877.57
Long Island,Nassau,2908000,000511,NYU Langone Hospital-Long Island,50 to 69,118,M,Other Race,Not Span/Hispanic,2,Emergency,Home or Self Care,2020,EYE006,NEURO-OPHTHALMOLOGY,,,048,"PERIPHERAL, CRANIAL & AUTONOMIC NERVE DISORDERS",01,DISEASES AND DISORDERS OF THE NERVOUS SYSTEM,1,Minor,Minor,Medical,Medicare,Private Health Insurance,,,,Y,80261.29,14984.49
Long Island,Nassau,2908000,000511,NYU Langone Hospital-Long Island,70 or Older,115,M,White,Not Span/Hispanic,2,Emergency,Home or Self Care,2020,NVS017,NERVE AND NERVE ROOT DISORDERS,,,048,"PERIPHERAL, CRANIAL & AUTONOMIC NERVE DISORDERS",01,DISEASES AND DISORDERS OF THE NERVOUS SYSTEM,2,Moderate,Major,Medical,Medicare,Blue Cross/Blue Shield,,,,Y,74683.76,15424.25