Hospital Service Area,Hospital County,Operating Certificate Number,Permanent Facility Id,Facility Name,Age Group,Zip Code - 3 digits,Gender,Race,Ethnicity,Length of Stay,Type of Admission,Patient Disposition,Discharge Year,CCS Diagnosis Code,CCS Diagnosis Description,CCS Procedure Code,CCS Procedure Description,APR DRG Code,APR DRG Description,APR MDC Code,APR MDC Description,APR Severity of Illness Code,APR Severity of Illness Description,APR Risk of Mortality,APR Medical Surgical Description,Payment Typology 1,Payment Typology 2,Payment Typology 3,Birth Weight,Abortion Edit Indicator,Emergency Department Indicator,Total Charges,Total Costs
New York City,Manhattan,7002001,001438,Bellevue Hospital Center,50 to 69,114,M,Other Race,Not Span/Hispanic,5,Emergency,Home or Self Care,2019,GEN012,HYPERPLASIA OF PROSTATE,MRS003,PROSTATECTOMY,482,TRANSURETHRAL PROSTATECTOMY,12,DISEASES AND DISORDERS OF THE MALE REPRODUCTIVE SYSTEM,1,Minor,Minor,Surgical,Medicaid,,,,,false,26788.64,17803.73
New York City,Manhattan,7002001,001438,Bellevue Hospital Center,50 to 69,100,M,Black/African American,Not Span/Hispanic,4,Emergency,Home or Self Care,2019,GEN012,HYPERPLASIA OF PROSTATE,MRS004,PROSTATE AND SEMINAL VESICLE PROCEDURES (EXCLUDING PROSTATECTOMY),482,TRANSURETHRAL PROSTATECTOMY,12,DISEASES AND DISORDERS OF THE MALE REPRODUCTIVE SYSTEM,1,Minor,Minor,Surgical,Medicaid,Medicaid,,,,true,23099.14,15351.69
New York City,Manhattan,7002001,001438,Bellevue Hospital Center,70 or Older,100,M,Other Race,Not Span/Hispanic,2,Emergency,Home or Self Care,2019,NEO073,BENIGN NEOPLASMS,MRS003,PROSTATECTOMY,482,TRANSURETHRAL PROSTATECTOMY,12,DISEASES AND DISORDERS OF THE MALE REPRODUCTIVE SYSTEM,1,Minor,Moderate,Surgical,Medicare,Medicare,,,,false,12220,8121.41
New York City,Manhattan,7002001,001438,Bellevue Hospital Center,50 to 69,100,M,White,Unknown,1,Elective,Home or Self Care,2019,GEN012,HYPERPLASIA OF PROSTATE,MRS004,PROSTATE AND SEMINAL VESICLE PROCEDURES (EXCLUDING PROSTATECTOMY),482,TRANSURETHRAL PROSTATECTOMY,12,DISEASES AND DISORDERS OF THE MALE REPRODUCTIVE SYSTEM,1,Minor,Minor,Surgical,Medicaid,,,,,false,16639,11058.28
New York City,Manhattan,7002001,001438,Bellevue Hospital Center,50 to 69,112,M,Black/African American,Unknown,2,Elective,Home or Self Care,2019,GEN012,HYPERPLASIA OF PROSTATE,MRS003,PROSTATECTOMY,482,TRANSURETHRAL PROSTATECTOMY,12,DISEASES AND DISORDERS OF THE MALE REPRODUCTIVE SYSTEM,2,Moderate,Minor,Surgical,Medicaid,,,,,false,25922.52,17228.11
New York City,Manhattan,7002001,001438,Bellevue Hospital Center,50 to 69,100,M,White,Not Span/Hispanic,1,Elective,Home or Self Care,2019,GEN012,HYPERPLASIA OF PROSTATE,MRS004,PROSTATE AND SEMINAL VESICLE PROCEDURES (EXCLUDING PROSTATECTOMY),482,TRANSURETHRAL PROSTATECTOMY,12,DISEASES AND DISORDERS OF THE MALE REPRODUCTIVE SYSTEM,2,Moderate,Minor,Surgical,Medicare,Medicaid,,,,false,21483.86,14278.17
New York City,Manhattan,7002001,001438,Bellevue Hospital Center,50 to 69,112,M,White,Not Span/Hispanic,2,Emergency,Home or Self Care,2019,GEN012,HYPERPLASIA OF PROSTATE,MRS004,PROSTATE AND SEMINAL VESICLE PROCEDURES (EXCLUDING PROSTATECTOMY),482,TRANSURETHRAL PROSTATECTOMY,12,DISEASES AND DISORDERS OF THE MALE REPRODUCTIVE SYSTEM,2,Moderate,Minor,Surgical,Medicare,Medicaid,,,,true,28043.58,18637.76
New York City,Manhattan,7002001,001438,Bellevue Hospital Center,50 to 69,100,M,Other Race,Spanish/Hispanic,1,Elective,Home or Self Care,2019,GEN012,HYPERPLASIA OF PROSTATE,MRS004,PROSTATE AND SEMINAL VESICLE PROCEDURES (EXCLUDING PROSTATECTOMY),482,TRANSURETHRAL PROSTATECTOMY,12,DISEASES AND DISORDERS OF THE MALE REPRODUCTIVE SYSTEM,2,Moderate,Minor,Surgical,Medicare,Medicaid,,,,false,17360.07,11537.5
New York City,Manhattan,7002001,001438,Bellevue Hospital Center,50 to 69,113,M,Other Race,Spanish/Hispanic,1,Elective,Home or Self Care,2019,GEN012,HYPERPLASIA OF PROSTATE,MRS004,PROSTATE AND SEMINAL VESICLE PROCEDURES (EXCLUDING PROSTATECTOMY),482,TRANSURETHRAL PROSTATECTOMY,12,DISEASES AND DISORDERS OF THE MALE REPRODUCTIVE SYSTEM,2,Moderate,Minor,Surgical,Medicaid,,,,,false,19316.01,12837.42
New York City,Manhattan,7002001,001438,Bellevue Hospital Center,70 or Older,114,M,Other Race,Spanish/Hispanic,4,Elective,Home or Self Care,2019,GEN012,HYPERPLASIA OF PROSTATE,MRS003,PROSTATECTOMY,482,TRANSURETHRAL PROSTATECTOMY,12,DISEASES AND DISORDERS OF THE MALE REPRODUCTIVE SYSTEM,2,Moderate,Minor,Surgical,Medicare,,,,,false,38275.42,25437.84
New York City,Manhattan,7002001,001438,Bellevue Hospital Center,50 to 69,112,M,Black/African American,Not Span/Hispanic,1,Elective,Home or Self Care,2019,GEN012,HYPERPLASIA OF PROSTATE,MRS003,PROSTATECTOMY,482,TRANSURETHRAL PROSTATECTOMY,12,DISEASES AND DISORDERS OF THE MALE REPRODUCTIVE SYSTEM,2,Moderate,Minor,Surgical,Self-Pay,,,,,false,21586.89,14346.65
New York City,Manhattan,7002001,001438,Bellevue Hospital Center,70 or Older,112,M,White,Not Span/Hispanic,1,Elective,Home or Self Care,2019,GEN012,HYPERPLASIA OF PROSTATE,MRS004,PROSTATE AND SEMINAL VESICLE PROCEDURES (EXCLUDING PROSTATECTOMY),482,TRANSURETHRAL PROSTATECTOMY,12,DISEASES AND DISORDERS OF THE MALE REPRODUCTIVE SYSTEM,2,Moderate,Minor,Surgical,Medicaid,,,,,false,19450.7,12926.94
New York City,Manhattan,7002001,001438,Bellevue Hospital Center,50 to 69,100,M,Other Race,Not Span/Hispanic,1,Elective,Home or Self Care,2019,GEN012,HYPERPLASIA OF PROSTATE,MRS004,PROSTATE AND SEMINAL VESICLE PROCEDURES (EXCLUDING PROSTATECTOMY),482,TRANSURETHRAL PROSTATECTOMY,12,DISEASES AND DISORDERS OF THE MALE REPRODUCTIVE SYSTEM,2,Moderate,Minor,Surgical,Medicaid,,,,,false,20427.19,13575.91
New York City,Manhattan,7002001,001438,Bellevue Hospital Center,70 or Older,100,M,Other Race,Spanish/Hispanic,2,Elective,Home or Self Care,2019,GEN012,HYPERPLASIA OF PROSTATE,MRS003,PROSTATECTOMY,482,TRANSURETHRAL PROSTATECTOMY,12,DISEASES AND DISORDERS OF THE MALE REPRODUCTIVE SYSTEM,2,Moderate,Minor,Surgical,Medicare,Medicaid,,,,false,21070.79,14003.65
New York City,Manhattan,7002001,001438,Bellevue Hospital Center,50 to 69,112,M,Other Race,Spanish/Hispanic,1,Elective,Home or Self Care,2019,GEN012,HYPERPLASIA OF PROSTATE,MRS004,PROSTATE AND SEMINAL VESICLE PROCEDURES (EXCLUDING PROSTATECTOMY),482,TRANSURETHRAL PROSTATECTOMY,12,DISEASES AND DISORDERS OF THE MALE REPRODUCTIVE SYSTEM,2,Moderate,Minor,Surgical,Self-Pay,,,,,false,20764.53,13800.11
