Hospital Service Area,Hospital County,Operating Certificate Number,Permanent Facility Id,Facility Name,Age Group,Zip Code - 3 digits,Gender,Race,Ethnicity,Length of Stay,Type of Admission,Patient Disposition,Discharge Year,CCS Diagnosis Code,CCS Diagnosis Description,CCS Procedure Code,CCS Procedure Description,APR DRG Code,APR DRG Description,APR MDC Code,APR MDC Description,APR Severity of Illness Code,APR Severity of Illness Description,APR Risk of Mortality,APR Medical Surgical Description,Payment Typology 1,Payment Typology 2,Payment Typology 3,Birth Weight,Abortion Edit Indicator,Emergency Department Indicator,Total Charges,Total Costs
Long Island,Nassau,2908000,000511,NYU Langone Hospital-Long Island,50 to 69,117,M,White,Not Span/Hispanic,1,Elective,Home or Self Care,2020,NEO039,MALE REPRODUCTIVE SYSTEM CANCERS - PROSTATE,MRS003,PROSTATECTOMY,483,"PENIS, TESTES & SCROTAL PROCEDURES",12,DISEASES AND DISORDERS OF THE MALE REPRODUCTIVE SYSTEM,1,Minor,Minor,Surgical,Blue Cross/Blue Shield,,,,,N,207816.41,29914.46
Long Island,Nassau,2908000,000511,NYU Langone Hospital-Long Island,50 to 69,117,M,White,Not Span/Hispanic,1,Elective,Home or Self Care,2020,NEO039,MALE REPRODUCTIVE SYSTEM CANCERS - PROSTATE,MRS003,PROSTATECTOMY,483,"PENIS, TESTES & SCROTAL PROCEDURES",12,DISEASES AND DISORDERS OF THE MALE REPRODUCTIVE SYSTEM,1,Minor,Minor,Surgical,Private Health Insurance,,,,,N,192339.14,27543.8
Long Island,Nassau,2908000,000511,NYU Langone Hospital-Long Island,50 to 69,115,M,Other Race,Not Span/Hispanic,1,Elective,Home or Self Care,2020,NEO039,MALE REPRODUCTIVE SYSTEM CANCERS - PROSTATE,MRS003,PROSTATECTOMY,483,"PENIS, TESTES & SCROTAL PROCEDURES",12,DISEASES AND DISORDERS OF THE MALE REPRODUCTIVE SYSTEM,1,Minor,Minor,Surgical,Blue Cross/Blue Shield,Medicare,,,,N,197204.02,26059.47
Long Island,Nassau,2908000,000511,NYU Langone Hospital-Long Island,0 to 17,115,M,White,Spanish/Hispanic,1,Emergency,Home or Self Care,2020,GEN016,OTHER SPECIFIED MALE GENITAL DISORDERS,MRS007,"MALE REPRODUCTIVE SYSTEM PROCEDURES, NEC",483,"PENIS, TESTES & SCROTAL PROCEDURES",12,DISEASES AND DISORDERS OF THE MALE REPRODUCTIVE SYSTEM,3,Major,Minor,Surgical,Medicaid,,,,,Y,42438.79,7810.2
Long Island,Nassau,2908000,000511,NYU Langone Hospital-Long Island,50 to 69,117,M,White,Not Span/Hispanic,1,Elective,Home or Self Care,2020,NEO039,MALE REPRODUCTIVE SYSTEM CANCERS - PROSTATE,MRS003,PROSTATECTOMY,483,"PENIS, TESTES & SCROTAL PROCEDURES",12,DISEASES AND DISORDERS OF THE MALE REPRODUCTIVE SYSTEM,1,Minor,Minor,Surgical,Medicare,Blue Cross/Blue Shield,,,,N,214528.33,31373.19
Long Island,Nassau,2908000,000511,NYU Langone Hospital-Long Island,50 to 69,117,M,White,Not Span/Hispanic,1,Elective,Home or Self Care,2020,NEO039,MALE REPRODUCTIVE SYSTEM CANCERS - PROSTATE,MRS003,PROSTATECTOMY,483,"PENIS, TESTES & SCROTAL PROCEDURES",12,DISEASES AND DISORDERS OF THE MALE REPRODUCTIVE SYSTEM,1,Minor,Moderate,Surgical,Blue Cross/Blue Shield,,,,,N,183534.02,26874.09
Long Island,Nassau,2908000,000511,NYU Langone Hospital-Long Island,50 to 69,118,M,White,Not Span/Hispanic,1,Elective,Home or Self Care,2020,NEO039,MALE REPRODUCTIVE SYSTEM CANCERS - PROSTATE,MRS003,PROSTATECTOMY,483,"PENIS, TESTES & SCROTAL PROCEDURES",12,DISEASES AND DISORDERS OF THE MALE REPRODUCTIVE SYSTEM,2,Moderate,Minor,Surgical,Medicare,,,,,N,166906.68,24318.85
Long Island,Nassau,2908000,000511,NYU Langone Hospital-Long Island,0 to 17,117,M,White,Not Span/Hispanic,1,Emergency,Home or Self Care,2020,GEN016,OTHER SPECIFIED MALE GENITAL DISORDERS,MRS007,"MALE REPRODUCTIVE SYSTEM PROCEDURES, NEC",483,"PENIS, TESTES & SCROTAL PROCEDURES",12,DISEASES AND DISORDERS OF THE MALE REPRODUCTIVE SYSTEM,1,Minor,Minor,Surgical,Blue Cross/Blue Shield,,,,,Y,47698.39,8375.34
Long Island,Nassau,2908000,000511,NYU Langone Hospital-Long Island,0 to 17,110,M,White,Not Span/Hispanic,1,Emergency,Home or Self Care,2020,GEN016,OTHER SPECIFIED MALE GENITAL DISORDERS,MRS007,"MALE REPRODUCTIVE SYSTEM PROCEDURES, NEC",483,"PENIS, TESTES & SCROTAL PROCEDURES",12,DISEASES AND DISORDERS OF THE MALE REPRODUCTIVE SYSTEM,1,Minor,Minor,Surgical,Blue Cross/Blue Shield,,,,,Y,39150.46,7537.85
Long Island,Nassau,2908000,000511,NYU Langone Hospital-Long Island,18 to 29,115,M,White,Not Span/Hispanic,1,Emergency,Home or Self Care,2020,GEN016,OTHER SPECIFIED MALE GENITAL DISORDERS,MRS007,"MALE REPRODUCTIVE SYSTEM PROCEDURES, NEC",483,"PENIS, TESTES & SCROTAL PROCEDURES",12,DISEASES AND DISORDERS OF THE MALE REPRODUCTIVE SYSTEM,1,Minor,Minor,Surgical,Blue Cross/Blue Shield,,,,,Y,50497.7,9817.38
Long Island,Nassau,2908000,000511,NYU Langone Hospital-Long Island,50 to 69,OOS,M,White,Not Span/Hispanic,1,Elective,Home or Self Care,2020,NEO039,MALE REPRODUCTIVE SYSTEM CANCERS - PROSTATE,MRS003,PROSTATECTOMY,483,"PENIS, TESTES & SCROTAL PROCEDURES",12,DISEASES AND DISORDERS OF THE MALE REPRODUCTIVE SYSTEM,1,Minor,Minor,Surgical,Blue Cross/Blue Shield,,,,,N,195730.81,29005.8
Long Island,Nassau,2908000,000511,NYU Langone Hospital-Long Island,50 to 69,117,M,White,Not Span/Hispanic,1,Elective,Home or Self Care,2020,NEO039,MALE REPRODUCTIVE SYSTEM CANCERS - PROSTATE,MRS003,PROSTATECTOMY,483,"PENIS, TESTES & SCROTAL PROCEDURES",12,DISEASES AND DISORDERS OF THE MALE REPRODUCTIVE SYSTEM,1,Minor,Minor,Surgical,Private Health Insurance,,,,,N,178070.41,26819.22
Long Island,Nassau,2908000,000511,NYU Langone Hospital-Long Island,50 to 69,115,M,White,Not Span/Hispanic,1,Elective,Home or Self Care,2020,NEO039,MALE REPRODUCTIVE SYSTEM CANCERS - PROSTATE,MRS003,PROSTATECTOMY,483,"PENIS, TESTES & SCROTAL PROCEDURES",12,DISEASES AND DISORDERS OF THE MALE REPRODUCTIVE SYSTEM,1,Minor,Minor,Surgical,Blue Cross/Blue Shield,,,,,N,171029.74,26245.59
Long Island,Nassau,2908000,000511,NYU Langone Hospital-Long Island,0 to 17,115,M,White,Spanish/Hispanic,1,Emergency,Home or Self Care,2020,MAL003,GENITOURINARY CONGENITAL ANOMALIES,MRS007,"MALE REPRODUCTIVE SYSTEM PROCEDURES, NEC",483,"PENIS, TESTES & SCROTAL PROCEDURES",12,DISEASES AND DISORDERS OF THE MALE REPRODUCTIVE SYSTEM,1,Minor,Minor,Surgical,Medicaid,,,,,Y,46190.45,9486.16
Long Island,Nassau,2908000,000511,NYU Langone Hospital-Long Island,0 to 17,,M,Other Race,Not Span/Hispanic,1,Elective,Home or Self Care,2020,MAL003,GENITOURINARY CONGENITAL ANOMALIES,MRS002,PENIS PROCEDURES (EXCLUDING CIRCUMCISION),483,"PENIS, TESTES & SCROTAL PROCEDURES",12,DISEASES AND DISORDERS OF THE MALE REPRODUCTIVE SYSTEM,1,Minor,Minor,Surgical,Medicaid,,,,,N,63209.29,10311.89
Long Island,Nassau,2908000,000511,NYU Langone Hospital-Long Island,30 to 49,115,M,Black/African American,Not Span/Hispanic,3,Emergency,Home or Self Care,2020,GEN016,OTHER SPECIFIED MALE GENITAL DISORDERS,MRS002,PENIS PROCEDURES (EXCLUDING CIRCUMCISION),483,"PENIS, TESTES & SCROTAL PROCEDURES",12,DISEASES AND DISORDERS OF THE MALE REPRODUCTIVE SYSTEM,1,Minor,Minor,Surgical,Medicaid,,,,,Y,89514.76,19402.82
Long Island,Nassau,2908000,000511,NYU Langone Hospital-Long Island,50 to 69,114,M,Black/African American,Not Span/Hispanic,1,Elective,Home or Self Care,2020,NEO039,MALE REPRODUCTIVE SYSTEM CANCERS - PROSTATE,MRS003,PROSTATECTOMY,483,"PENIS, TESTES & SCROTAL PROCEDURES",12,DISEASES AND DISORDERS OF THE MALE REPRODUCTIVE SYSTEM,1,Minor,Minor,Surgical,Blue Cross/Blue Shield,,,,,N,175469.47,26513.18
Long Island,Nassau,2908000,000511,NYU Langone Hospital-Long Island,0 to 17,115,M,White,Not Span/Hispanic,1,Elective,Home or Self Care,2020,MAL003,GENITOURINARY CONGENITAL ANOMALIES,MRS002,PENIS PROCEDURES (EXCLUDING CIRCUMCISION),483,"PENIS, TESTES & SCROTAL PROCEDURES",12,DISEASES AND DISORDERS OF THE MALE REPRODUCTIVE SYSTEM,1,Minor,Minor,Surgical,Medicaid,,,,,N,71441.34,13005.39
Long Island,Nassau,2908000,000511,NYU Langone Hospital-Long Island,30 to 49,117,M,White,Not Span/Hispanic,1,Elective,Home or Self Care,2020,NEO039,MALE REPRODUCTIVE SYSTEM CANCERS - PROSTATE,OTR001,ROBOTIC-ASSISTED PROCEDURES,483,"PENIS, TESTES & SCROTAL PROCEDURES",12,DISEASES AND DISORDERS OF THE MALE REPRODUCTIVE SYSTEM,1,Minor,Minor,Surgical,Blue Cross/Blue Shield,,,,,N,170387.35,26094.99
Long Island,Nassau,2908000,000511,NYU Langone Hospital-Long Island,70 or Older,115,M,White,Not Span/Hispanic,9,Elective,Home w/ Home Health Services,2020,INJ034,"COMPLICATION OF GENITOURINARY DEVICE, IMPLANT OR GRAFT, INITIAL ENCOUNTER",MRS002,PENIS PROCEDURES (EXCLUDING CIRCUMCISION),483,"PENIS, TESTES & SCROTAL PROCEDURES",12,DISEASES AND DISORDERS OF THE MALE REPRODUCTIVE SYSTEM,3,Major,Moderate,Surgical,Medicare,,,,,N,218062.5,64194.7
Long Island,Nassau,2908000,000511,NYU Langone Hospital-Long Island,50 to 69,117,M,White,Not Span/Hispanic,1,Elective,Home or Self Care,2020,NEO039,MALE REPRODUCTIVE SYSTEM CANCERS - PROSTATE,MRS003,PROSTATECTOMY,483,"PENIS, TESTES & SCROTAL PROCEDURES",12,DISEASES AND DISORDERS OF THE MALE REPRODUCTIVE SYSTEM,1,Minor,Minor,Surgical,Private Health Insurance,,,,,N,203680.12,27605.5
Long Island,Nassau,2908000,000511,NYU Langone Hospital-Long Island,70 or Older,115,M,White,Not Span/Hispanic,23,Emergency,Skilled Nursing Home,2020,INJ034,"COMPLICATION OF GENITOURINARY DEVICE, IMPLANT OR GRAFT, INITIAL ENCOUNTER",MRS002,PENIS PROCEDURES (EXCLUDING CIRCUMCISION),483,"PENIS, TESTES & SCROTAL PROCEDURES",12,DISEASES AND DISORDERS OF THE MALE REPRODUCTIVE SYSTEM,4,Extreme,Moderate,Surgical,Medicare,,,,,Y,451194.25,134062.07
Long Island,Nassau,2908000,000511,NYU Langone Hospital-Long Island,50 to 69,115,M,Other Race,Spanish/Hispanic,2,Elective,Home or Self Care,2020,NEO039,MALE REPRODUCTIVE SYSTEM CANCERS - PROSTATE,MRS003,PROSTATECTOMY,483,"PENIS, TESTES & SCROTAL PROCEDURES",12,DISEASES AND DISORDERS OF THE MALE REPRODUCTIVE SYSTEM,2,Moderate,Moderate,Surgical,Medicare,,,,,N,157848.44,27159.06
Long Island,Nassau,2908000,000511,NYU Langone Hospital-Long Island,18 to 29,115,M,White,Not Span/Hispanic,1,Emergency,Home or Self Care,2020,GEN016,OTHER SPECIFIED MALE GENITAL DISORDERS,MRS007,"MALE REPRODUCTIVE SYSTEM PROCEDURES, NEC",483,"PENIS, TESTES & SCROTAL PROCEDURES",12,DISEASES AND DISORDERS OF THE MALE REPRODUCTIVE SYSTEM,1,Minor,Minor,Surgical,Self-Pay,,,,,Y,45599.56,9339.57
Long Island,Nassau,2908000,000511,NYU Langone Hospital-Long Island,50 to 69,117,M,White,Not Span/Hispanic,2,Elective,Home w/ Home Health Services,2020,NEO039,MALE REPRODUCTIVE SYSTEM CANCERS - PROSTATE,MRS003,PROSTATECTOMY,483,"PENIS, TESTES & SCROTAL PROCEDURES",12,DISEASES AND DISORDERS OF THE MALE REPRODUCTIVE SYSTEM,1,Minor,Minor,Surgical,Private Health Insurance,,,,,N,162909.24,27777.75
Long Island,Nassau,2908000,000511,NYU Langone Hospital-Long Island,50 to 69,117,M,White,Not Span/Hispanic,2,Elective,Home or Self Care,2020,NEO039,MALE REPRODUCTIVE SYSTEM CANCERS - PROSTATE,MRS003,PROSTATECTOMY,483,"PENIS, TESTES & SCROTAL PROCEDURES",12,DISEASES AND DISORDERS OF THE MALE REPRODUCTIVE SYSTEM,2,Moderate,Minor,Surgical,Private Health Insurance,,,,,N,166196.8,28455.02
Long Island,Nassau,2908000,000511,NYU Langone Hospital-Long Island,50 to 69,117,M,White,Not Span/Hispanic,3,Elective,Home or Self Care,2020,NEO039,MALE REPRODUCTIVE SYSTEM CANCERS - PROSTATE,MRS003,PROSTATECTOMY,483,"PENIS, TESTES & SCROTAL PROCEDURES",12,DISEASES AND DISORDERS OF THE MALE REPRODUCTIVE SYSTEM,2,Moderate,Minor,Surgical,Private Health Insurance,,,,,N,197608.05,35668.23
Long Island,Nassau,2908000,000511,NYU Langone Hospital-Long Island,30 to 49,112,M,White,Not Span/Hispanic,1,Emergency,Home or Self Care,2020,INJ030,DRUG INDUCED OR TOXIC RELATED CONDITION,MRS002,PENIS PROCEDURES (EXCLUDING CIRCUMCISION),483,"PENIS, TESTES & SCROTAL PROCEDURES",12,DISEASES AND DISORDERS OF THE MALE REPRODUCTIVE SYSTEM,1,Minor,Minor,Surgical,Medicaid,,,,,Y,42773.54,8781.17
