Hospital Service Area,Hospital County,Operating Certificate Number,Permanent Facility Id,Facility Name,Age Group,Zip Code - 3 digits,Gender,Race,Ethnicity,Length of Stay,Type of Admission,Patient Disposition,Discharge Year,CCS Diagnosis Code,CCS Diagnosis Description,CCS Procedure Code,CCS Procedure Description,APR DRG Code,APR DRG Description,APR MDC Code,APR MDC Description,APR Severity of Illness Code,APR Severity of Illness Description,APR Risk of Mortality,APR Medical Surgical Description,Payment Typology 1,Payment Typology 2,Payment Typology 3,Birth Weight,Abortion Edit Indicator,Emergency Department Indicator,Total Charges,Total Costs
New York City,Manhattan,7002001,001438,Bellevue Hospital Center,50 to 69,104,M,Other Race,Not Span/Hispanic,1,Emergency,Home or Self Care,2017,029,Cancer of prostate,114,OPEN PROSTATECTOMY,484,Other male reproductive system & related procedures,12,Diseases and Disorders of the Male Reproductive System,3,Major,Moderate,Surgical,Self-Pay,,,,N,N,7098.66,4576.85
New York City,Manhattan,7002001,001438,Bellevue Hospital Center,50 to 69,100,M,Black/African American,Not Span/Hispanic,2,Elective,Home or Self Care,2017,029,Cancer of prostate,114,OPEN PROSTATECTOMY,484,Other male reproductive system & related procedures,12,Diseases and Disorders of the Male Reproductive System,2,Moderate,Minor,Surgical,Blue Cross/Blue Shield,,,,N,N,10215.20,6586.23
New York City,Manhattan,7002001,001438,Bellevue Hospital Center,50 to 69,100,M,Other Race,Not Span/Hispanic,2,Emergency,Home or Self Care,2017,029,Cancer of prostate,114,OPEN PROSTATECTOMY,484,Other male reproductive system & related procedures,12,Diseases and Disorders of the Male Reproductive System,2,Moderate,Minor,Surgical,Medicaid,Medicaid,,,N,N,13489.90,8697.59
New York City,Manhattan,7002001,001438,Bellevue Hospital Center,50 to 69,113,M,Other Race,Spanish/Hispanic,3,Emergency,Home or Self Care,2017,164,Hyperplasia of prostate,114,OPEN PROSTATECTOMY,484,Other male reproductive system & related procedures,12,Diseases and Disorders of the Male Reproductive System,1,Minor,Minor,Surgical,Self-Pay,,,,N,N,18195.03,11731.21
New York City,Manhattan,7002001,001438,Bellevue Hospital Center,70 or Older,100,M,White,Not Span/Hispanic,2,Emergency,Home or Self Care,2017,164,Hyperplasia of prostate,101,TRANSURETHRAL EXCISION,484,Other male reproductive system & related procedures,12,Diseases and Disorders of the Male Reproductive System,2,Moderate,Minor,Surgical,Medicare,Private Health Insurance,,,N,N,12743.44,8216.31
New York City,Manhattan,7002001,001438,Bellevue Hospital Center,50 to 69,111,M,Other Race,Not Span/Hispanic,1,Emergency,Home or Self Care,2017,164,Hyperplasia of prostate,114,OPEN PROSTATECTOMY,484,Other male reproductive system & related procedures,12,Diseases and Disorders of the Male Reproductive System,1,Minor,Minor,Surgical,Medicaid,Medicaid,,,N,N,7209.23,4648.14
New York City,Manhattan,7002001,001438,Bellevue Hospital Center,50 to 69,112,M,Other Race,Not Span/Hispanic,1,Emergency,Home or Self Care,2017,029,Cancer of prostate,114,OPEN PROSTATECTOMY,484,Other male reproductive system & related procedures,12,Diseases and Disorders of the Male Reproductive System,2,Moderate,Minor,Surgical,Medicaid,,,,N,N,6478.39,4176.93
New York City,Manhattan,7002001,001438,Bellevue Hospital Center,50 to 69,104,M,Black/African American,Not Span/Hispanic,1,Elective,Home or Self Care,2017,029,Cancer of prostate,114,OPEN PROSTATECTOMY,484,Other male reproductive system & related procedures,12,Diseases and Disorders of the Male Reproductive System,2,Moderate,Minor,Surgical,Medicaid,Medicaid,,,N,N,7050.54,4545.82
New York City,Manhattan,7002001,001438,Bellevue Hospital Center,50 to 69,104,M,Black/African American,Not Span/Hispanic,13,Emergency,Home or Self Care,2017,029,Cancer of prostate,114,OPEN PROSTATECTOMY,484,Other male reproductive system & related procedures,12,Diseases and Disorders of the Male Reproductive System,3,Major,Minor,Surgical,Medicaid,Medicaid,,,N,N,88358.83,56969.18
