Hospital Service Area,Hospital County,Operating Certificate Number,Permanent Facility Id,Facility Name,Age Group,Zip Code - 3 digits,Gender,Race,Ethnicity,Length of Stay,Type of Admission,Patient Disposition,Discharge Year,CCS Diagnosis Code,CCS Diagnosis Description,CCS Procedure Code,CCS Procedure Description,APR DRG Code,APR DRG Description,APR MDC Code,APR MDC Description,APR Severity of Illness Code,APR Severity of Illness Description,APR Risk of Mortality,APR Medical Surgical Description,Payment Typology 1,Payment Typology 2,Payment Typology 3,Birth Weight,Abortion Edit Indicator,Emergency Department Indicator,Total Charges,Total Costs
Hudson Valley,Westchester,5902001,001045,White Plains Hospital Center,50 to 69,105,M,Other Race,Not Span/Hispanic,2,Elective,Home or Self Care,2019,NEO039,MALE REPRODUCTIVE SYSTEM CANCERS - PROSTATE,MRS003,PROSTATECTOMY,484,OTHER MALE REPRODUCTIVE SYSTEM & RELATED PROCEDURES,12,DISEASES AND DISORDERS OF THE MALE REPRODUCTIVE SYSTEM,2,Moderate,Minor,Surgical,Private Health Insurance,,,,,false,90662,20994.66
New York City,Manhattan,7002017,001450,Lenox Hill Hospital,50 to 69,115,M,White,Not Span/Hispanic,1,Elective,Home or Self Care,2019,NEO039,MALE REPRODUCTIVE SYSTEM CANCERS - PROSTATE,MRS003,PROSTATECTOMY,484,OTHER MALE REPRODUCTIVE SYSTEM & RELATED PROCEDURES,12,DISEASES AND DISORDERS OF THE MALE REPRODUCTIVE SYSTEM,2,Moderate,Minor,Surgical,Private Health Insurance,,,,,false,50033.6,16159.64
New York City,Manhattan,7002017,001450,Lenox Hill Hospital,50 to 69,OOS,M,Black/African American,Not Span/Hispanic,2,Elective,Home or Self Care,2019,NEO039,MALE REPRODUCTIVE SYSTEM CANCERS - PROSTATE,MRS003,PROSTATECTOMY,484,OTHER MALE REPRODUCTIVE SYSTEM & RELATED PROCEDURES,12,DISEASES AND DISORDERS OF THE MALE REPRODUCTIVE SYSTEM,2,Moderate,Minor,Surgical,Blue Cross/Blue Shield,,,,,false,57579.16,17322.86
Long Island,Suffolk,5151001,000245,Stony Brook University Hospital,70 or Older,117,M,White,Not Span/Hispanic,2,Elective,Home or Self Care,2019,GEN012,HYPERPLASIA OF PROSTATE,MRS004,PROSTATE AND SEMINAL VESICLE PROCEDURES (EXCLUDING PROSTATECTOMY),484,OTHER MALE REPRODUCTIVE SYSTEM & RELATED PROCEDURES,12,DISEASES AND DISORDERS OF THE MALE REPRODUCTIVE SYSTEM,2,Moderate,Major,Surgical,Medicare,Private Health Insurance,,,,false,45676.2,17479.26
Finger Lakes,Monroe,2701003,000411,Rochester General Hospital,70 or Older,146,M,Black/African American,Not Span/Hispanic,6,Elective,Home or Self Care,2019,GEN012,HYPERPLASIA OF PROSTATE,MRS003,PROSTATECTOMY,484,OTHER MALE REPRODUCTIVE SYSTEM & RELATED PROCEDURES,12,DISEASES AND DISORDERS OF THE MALE REPRODUCTIVE SYSTEM,2,Moderate,Major,Surgical,Medicare,Medicare,,,,false,44037.99,18026.24
New York City,Manhattan,7002054,001458,New York-Presbyterian Hospital - New York Weill Cornell Center,70 or Older,105,M,White,Not Span/Hispanic,1,Elective,Home or Self Care,2019,NEO039,MALE REPRODUCTIVE SYSTEM CANCERS - PROSTATE,MRS003,PROSTATECTOMY,484,OTHER MALE REPRODUCTIVE SYSTEM & RELATED PROCEDURES,12,DISEASES AND DISORDERS OF THE MALE REPRODUCTIVE SYSTEM,3,Major,Minor,Surgical,Medicare,Private Health Insurance,Self-Pay,,,false,50798.08,14284.53
New York City,Manhattan,7002054,001458,New York-Presbyterian Hospital - New York Weill Cornell Center,50 to 69,107,M,White,Not Span/Hispanic,1,Elective,Home or Self Care,2019,NEO039,MALE REPRODUCTIVE SYSTEM CANCERS - PROSTATE,MRS003,PROSTATECTOMY,484,OTHER MALE REPRODUCTIVE SYSTEM & RELATED PROCEDURES,12,DISEASES AND DISORDERS OF THE MALE REPRODUCTIVE SYSTEM,2,Moderate,Minor,Surgical,Private Health Insurance,Self-Pay,,,,false,11759.71,2568.41
Western NY,Erie,1401014,003067,Millard Fillmore Suburban Hospital,50 to 69,140,M,Black/African American,Not Span/Hispanic,1,Elective,Home or Self Care,2019,NEO039,MALE REPRODUCTIVE SYSTEM CANCERS - PROSTATE,MRS003,PROSTATECTOMY,484,OTHER MALE REPRODUCTIVE SYSTEM & RELATED PROCEDURES,12,DISEASES AND DISORDERS OF THE MALE REPRODUCTIVE SYSTEM,2,Moderate,Minor,Surgical,Blue Cross/Blue Shield,Self-Pay,,,,false,46929.27,12637.57
Western NY,Erie,1401014,003067,Millard Fillmore Suburban Hospital,50 to 69,142,M,Other Race,Spanish/Hispanic,1,Elective,Home or Self Care,2019,NEO039,MALE REPRODUCTIVE SYSTEM CANCERS - PROSTATE,MRS003,PROSTATECTOMY,484,OTHER MALE REPRODUCTIVE SYSTEM & RELATED PROCEDURES,12,DISEASES AND DISORDERS OF THE MALE REPRODUCTIVE SYSTEM,3,Major,Minor,Surgical,Medicare,Self-Pay,,,,false,42284.91,11586.05
Finger Lakes,Monroe,2701003,000411,Rochester General Hospital,50 to 69,145,M,White,Not Span/Hispanic,2,Elective,Home w/ Home Health Services,2019,NEO039,MALE REPRODUCTIVE SYSTEM CANCERS - PROSTATE,MRS003,PROSTATECTOMY,484,OTHER MALE REPRODUCTIVE SYSTEM & RELATED PROCEDURES,12,DISEASES AND DISORDERS OF THE MALE REPRODUCTIVE SYSTEM,3,Major,Moderate,Surgical,Medicare,,,,,false,35936.84,13242.35
Western NY,Erie,1401014,003067,Millard Fillmore Suburban Hospital,50 to 69,142,M,White,Not Span/Hispanic,1,Elective,Home or Self Care,2019,NEO039,MALE REPRODUCTIVE SYSTEM CANCERS - PROSTATE,MRS003,PROSTATECTOMY,484,OTHER MALE REPRODUCTIVE SYSTEM & RELATED PROCEDURES,12,DISEASES AND DISORDERS OF THE MALE REPRODUCTIVE SYSTEM,2,Moderate,Minor,Surgical,Private Health Insurance,Self-Pay,,,,false,41370.13,11394.81
New York City,Manhattan,7002054,001464,New York-Presbyterian Hospital - Columbia Presbyterian Center,50 to 69,107,M,White,Not Span/Hispanic,2,Elective,Home w/ Home Health Services,2019,NEO039,MALE REPRODUCTIVE SYSTEM CANCERS - PROSTATE,MRS003,PROSTATECTOMY,484,OTHER MALE REPRODUCTIVE SYSTEM & RELATED PROCEDURES,12,DISEASES AND DISORDERS OF THE MALE REPRODUCTIVE SYSTEM,2,Moderate,Minor,Surgical,Private Health Insurance,Medicare,Self-Pay,,,false,75561.44,20170.96
New York City,Manhattan,7002054,001464,New York-Presbyterian Hospital - Columbia Presbyterian Center,50 to 69,OOS,M,White,Spanish/Hispanic,2,Elective,Home or Self Care,2019,NEO039,MALE REPRODUCTIVE SYSTEM CANCERS - PROSTATE,MRS003,PROSTATECTOMY,484,OTHER MALE REPRODUCTIVE SYSTEM & RELATED PROCEDURES,12,DISEASES AND DISORDERS OF THE MALE REPRODUCTIVE SYSTEM,2,Moderate,Minor,Surgical,Private Health Insurance,Self-Pay,,,,false,60543.28,16050.04
Finger Lakes,Monroe,2701003,000411,Rochester General Hospital,50 to 69,144,M,White,Not Span/Hispanic,2,Elective,Home or Self Care,2019,NEO039,MALE REPRODUCTIVE SYSTEM CANCERS - PROSTATE,MRS003,PROSTATECTOMY,484,OTHER MALE REPRODUCTIVE SYSTEM & RELATED PROCEDURES,12,DISEASES AND DISORDERS OF THE MALE REPRODUCTIVE SYSTEM,2,Moderate,Minor,Surgical,Private Health Insurance,,,,,false,36227.78,13316.05
Capital/Adirond,Albany,0101004,000005,St. Peter's Hospital,50 to 69,123,M,White,Not Span/Hispanic,1,Elective,Home or Self Care,2019,NEO039,MALE REPRODUCTIVE SYSTEM CANCERS - PROSTATE,MRS003,PROSTATECTOMY,484,OTHER MALE REPRODUCTIVE SYSTEM & RELATED PROCEDURES,12,DISEASES AND DISORDERS OF THE MALE REPRODUCTIVE SYSTEM,2,Moderate,Minor,Surgical,Medicare,Medicare,,,,false,39427.2,15227.42
Long Island,Suffolk,5149001,000896,St. Charles Hospital,50 to 69,117,M,White,Not Span/Hispanic,2,Elective,Home w/ Home Health Services,2019,NEO039,MALE REPRODUCTIVE SYSTEM CANCERS - PROSTATE,MRS003,PROSTATECTOMY,484,OTHER MALE REPRODUCTIVE SYSTEM & RELATED PROCEDURES,12,DISEASES AND DISORDERS OF THE MALE REPRODUCTIVE SYSTEM,2,Moderate,Minor,Surgical,Medicare,,,,,false,77380.18,14273.11
New York City,Queens,7003010,001637,New York - Presbyterian/Queens,50 to 69,113,M,Other Race,Spanish/Hispanic,2,Urgent,Home or Self Care,2019,GEN012,HYPERPLASIA OF PROSTATE,MRS004,PROSTATE AND SEMINAL VESICLE PROCEDURES (EXCLUDING PROSTATECTOMY),484,OTHER MALE REPRODUCTIVE SYSTEM & RELATED PROCEDURES,12,DISEASES AND DISORDERS OF THE MALE REPRODUCTIVE SYSTEM,2,Moderate,Minor,Surgical,Blue Cross/Blue Shield,Self-Pay,,,,false,36497.85,14625.11
Long Island,Nassau,2952006,000551,St. Joseph Hospital,70 or Older,117,M,Other Race,Spanish/Hispanic,7,Elective,Home or Self Care,2019,GEN012,HYPERPLASIA OF PROSTATE,MRS004,PROSTATE AND SEMINAL VESICLE PROCEDURES (EXCLUDING PROSTATECTOMY),484,OTHER MALE REPRODUCTIVE SYSTEM & RELATED PROCEDURES,12,DISEASES AND DISORDERS OF THE MALE REPRODUCTIVE SYSTEM,3,Major,Major,Surgical,Medicare,Private Health Insurance,,,,false,82476.19,21683.98
New York City,Queens,7003010,001637,New York - Presbyterian/Queens,50 to 69,113,M,White,Not Span/Hispanic,3,Emergency,Home or Self Care,2019,GEN012,HYPERPLASIA OF PROSTATE,URN001,CYSTOSCOPY AND URETEROSCOPY (INCLUDING BIOPSY),484,OTHER MALE REPRODUCTIVE SYSTEM & RELATED PROCEDURES,12,DISEASES AND DISORDERS OF THE MALE REPRODUCTIVE SYSTEM,2,Moderate,Minor,Surgical,Medicare,Self-Pay,,,,true,32724.72,10072.2
Finger Lakes,Monroe,2701005,000413,Strong Memorial Hospital,30 to 49,147,M,White,Not Span/Hispanic,1,Elective,Home or Self Care,2019,NEO039,MALE REPRODUCTIVE SYSTEM CANCERS - PROSTATE,MRS003,PROSTATECTOMY,484,OTHER MALE REPRODUCTIVE SYSTEM & RELATED PROCEDURES,12,DISEASES AND DISORDERS OF THE MALE REPRODUCTIVE SYSTEM,3,Major,Minor,Surgical,Medicaid,,,,,false,32354.99,17077.13
Hudson Valley,Westchester,5902001,001045,White Plains Hospital Center,50 to 69,106,M,Other Race,Not Span/Hispanic,2,Elective,Home or Self Care,2019,NEO039,MALE REPRODUCTIVE SYSTEM CANCERS - PROSTATE,MRS003,PROSTATECTOMY,484,OTHER MALE REPRODUCTIVE SYSTEM & RELATED PROCEDURES,12,DISEASES AND DISORDERS OF THE MALE REPRODUCTIVE SYSTEM,2,Moderate,Minor,Surgical,Medicare,Blue Cross/Blue Shield,,,,false,85108,18959.75
Central NY,Jefferson,2201000,000367,Samaritan Medical Center,50 to 69,136,M,White,Not Span/Hispanic,2,Elective,Home or Self Care,2019,NEO039,MALE REPRODUCTIVE SYSTEM CANCERS - PROSTATE,MRS003,PROSTATECTOMY,484,OTHER MALE REPRODUCTIVE SYSTEM & RELATED PROCEDURES,12,DISEASES AND DISORDERS OF THE MALE REPRODUCTIVE SYSTEM,2,Moderate,Minor,Surgical,Federal/State/Local/VA,,,,,false,33150.5,18081.43
Finger Lakes,Monroe,2701001,000409,Highland Hospital,70 or Older,144,M,White,Not Span/Hispanic,3,Elective,Home or Self Care,2019,GEN012,HYPERPLASIA OF PROSTATE,MRS003,PROSTATECTOMY,484,OTHER MALE REPRODUCTIVE SYSTEM & RELATED PROCEDURES,12,DISEASES AND DISORDERS OF THE MALE REPRODUCTIVE SYSTEM,2,Moderate,Moderate,Surgical,Self-Pay,,,,,false,42241.9,14567.6
New York City,Manhattan,7002054,001464,New York-Presbyterian Hospital - Columbia Presbyterian Center,50 to 69,OOS,M,Other Race,Not Span/Hispanic,1,Elective,Home w/ Home Health Services,2019,NEO039,MALE REPRODUCTIVE SYSTEM CANCERS - PROSTATE,MRS003,PROSTATECTOMY,484,OTHER MALE REPRODUCTIVE SYSTEM & RELATED PROCEDURES,12,DISEASES AND DISORDERS OF THE MALE REPRODUCTIVE SYSTEM,3,Major,Minor,Surgical,Medicare,Private Health Insurance,Self-Pay,,,false,18283.23,3978.75
New York City,Manhattan,7002054,001458,New York-Presbyterian Hospital - New York Weill Cornell Center,70 or Older,100,M,White,Not Span/Hispanic,1,Elective,Home or Self Care,2019,NEO039,MALE REPRODUCTIVE SYSTEM CANCERS - PROSTATE,MRS003,PROSTATECTOMY,484,OTHER MALE REPRODUCTIVE SYSTEM & RELATED PROCEDURES,12,DISEASES AND DISORDERS OF THE MALE REPRODUCTIVE SYSTEM,3,Major,Minor,Surgical,Medicare,Medicare,Federal/State/Local/VA,,,false,67398.24,20372
Finger Lakes,Monroe,2754001,000471,The Unity Hospital of Rochester,70 or Older,145,M,White,Not Span/Hispanic,1,Elective,Home or Self Care,2019,NEO039,MALE REPRODUCTIVE SYSTEM CANCERS - PROSTATE,MRS003,PROSTATECTOMY,484,OTHER MALE REPRODUCTIVE SYSTEM & RELATED PROCEDURES,12,DISEASES AND DISORDERS OF THE MALE REPRODUCTIVE SYSTEM,2,Moderate,Minor,Surgical,Medicare,,,,,false,29120.42,13513.86
New York City,Kings,7001020,001305,Maimonides Medical Center,70 or Older,112,M,White,Not Span/Hispanic,1,Elective,Home or Self Care,2019,NEO039,MALE REPRODUCTIVE SYSTEM CANCERS - PROSTATE,MRS003,PROSTATECTOMY,484,OTHER MALE REPRODUCTIVE SYSTEM & RELATED PROCEDURES,12,DISEASES AND DISORDERS OF THE MALE REPRODUCTIVE SYSTEM,3,Major,Minor,Surgical,Medicare,Private Health Insurance,Self-Pay,,,false,52923.02,17054.61
New York City,Queens,7003010,001637,New York - Presbyterian/Queens,70 or Older,114,M,Other Race,Not Span/Hispanic,2,Elective,Home or Self Care,2019,GEN012,HYPERPLASIA OF PROSTATE,MRS003,PROSTATECTOMY,484,OTHER MALE REPRODUCTIVE SYSTEM & RELATED PROCEDURES,12,DISEASES AND DISORDERS OF THE MALE REPRODUCTIVE SYSTEM,1,Minor,Minor,Surgical,Medicaid,Self-Pay,,,,false,39377.94,16502.18
New York City,Manhattan,7002002,001439,Mount Sinai Beth Israel,50 to 69,113,M,Other Race,Spanish/Hispanic,6,Elective,Home or Self Care,2019,NEO039,MALE REPRODUCTIVE SYSTEM CANCERS - PROSTATE,MRS003,PROSTATECTOMY,484,OTHER MALE REPRODUCTIVE SYSTEM & RELATED PROCEDURES,12,DISEASES AND DISORDERS OF THE MALE REPRODUCTIVE SYSTEM,3,Major,Minor,Surgical,Medicaid,Medicaid,Self-Pay,,,false,90294.14,19406.73
Capital/Adirond,Albany,0101000,000001,Albany Medical Center Hospital,50 to 69,120,M,White,Not Span/Hispanic,1,Elective,Home or Self Care,2019,NEO039,MALE REPRODUCTIVE SYSTEM CANCERS - PROSTATE,MRS003,PROSTATECTOMY,484,OTHER MALE REPRODUCTIVE SYSTEM & RELATED PROCEDURES,12,DISEASES AND DISORDERS OF THE MALE REPRODUCTIVE SYSTEM,2,Moderate,Minor,Surgical,"Managed Care, Unspecified",,,,,false,40799.52,16089.05
Finger Lakes,Wayne,5820000,001028,Newark-Wayne Community Hospital,70 or Older,131,M,White,Not Span/Hispanic,3,Elective,Home w/ Home Health Services,2019,NEO039,MALE REPRODUCTIVE SYSTEM CANCERS - PROSTATE,MRS003,PROSTATECTOMY,484,OTHER MALE REPRODUCTIVE SYSTEM & RELATED PROCEDURES,12,DISEASES AND DISORDERS OF THE MALE REPRODUCTIVE SYSTEM,3,Major,Moderate,Surgical,Medicare,,,,,false,34837.52,11638.18
Finger Lakes,Monroe,2701001,000409,Highland Hospital,50 to 69,145,M,White,Unknown,1,Elective,Home or Self Care,2019,NEO039,MALE REPRODUCTIVE SYSTEM CANCERS - PROSTATE,MRS003,PROSTATECTOMY,484,OTHER MALE REPRODUCTIVE SYSTEM & RELATED PROCEDURES,12,DISEASES AND DISORDERS OF THE MALE REPRODUCTIVE SYSTEM,3,Major,Minor,Surgical,Self-Pay,,,,,false,40493.24,15103.54
Finger Lakes,Monroe,2701003,000411,Rochester General Hospital,50 to 69,146,M,White,Not Span/Hispanic,1,Elective,Home or Self Care,2019,NEO039,MALE REPRODUCTIVE SYSTEM CANCERS - PROSTATE,MRS003,PROSTATECTOMY,484,OTHER MALE REPRODUCTIVE SYSTEM & RELATED PROCEDURES,12,DISEASES AND DISORDERS OF THE MALE REPRODUCTIVE SYSTEM,2,Moderate,Minor,Surgical,Blue Cross/Blue Shield,,,,,false,31834.69,11119.86
Finger Lakes,Monroe,2701003,000411,Rochester General Hospital,70 or Older,146,M,White,Not Span/Hispanic,2,Emergency,Home w/ Home Health Services,2019,GEN012,HYPERPLASIA OF PROSTATE,URN009,CYSTECTOMY (INCLUDING FULGURATION) AND URETHRECTOMY,484,OTHER MALE REPRODUCTIVE SYSTEM & RELATED PROCEDURES,12,DISEASES AND DISORDERS OF THE MALE REPRODUCTIVE SYSTEM,2,Moderate,Moderate,Surgical,Medicare,,,,,true,15748.51,5356.92
New York City,Richmond,7004003,001740,Staten Island University Hosp-North,70 or Older,103,M,Black/African American,Not Span/Hispanic,1,Elective,Home or Self Care,2019,GEN012,HYPERPLASIA OF PROSTATE,MRS004,PROSTATE AND SEMINAL VESICLE PROCEDURES (EXCLUDING PROSTATECTOMY),484,OTHER MALE REPRODUCTIVE SYSTEM & RELATED PROCEDURES,12,DISEASES AND DISORDERS OF THE MALE REPRODUCTIVE SYSTEM,1,Minor,Minor,Surgical,Blue Cross/Blue Shield,Medicare,,,,false,43555.71,12750.57
Hudson Valley,Dutchess,5957001,000180,Mid-Hudson Valley Division of Westchester Medical Center,70 or Older,125,M,White,Not Span/Hispanic,1,Elective,Home or Self Care,2019,NEO039,MALE REPRODUCTIVE SYSTEM CANCERS - PROSTATE,MRS003,PROSTATECTOMY,484,OTHER MALE REPRODUCTIVE SYSTEM & RELATED PROCEDURES,12,DISEASES AND DISORDERS OF THE MALE REPRODUCTIVE SYSTEM,2,Moderate,Minor,Surgical,Medicare,Blue Cross/Blue Shield,,,,false,55286.79,10870.63
Hudson Valley,Westchester,5920000,001117,Northern Westchester Hospital,50 to 69,125,M,Black/African American,Not Span/Hispanic,1,Elective,Home or Self Care,2019,NEO039,MALE REPRODUCTIVE SYSTEM CANCERS - PROSTATE,MRS003,PROSTATECTOMY,484,OTHER MALE REPRODUCTIVE SYSTEM & RELATED PROCEDURES,12,DISEASES AND DISORDERS OF THE MALE REPRODUCTIVE SYSTEM,2,Moderate,Minor,Surgical,Private Health Insurance,,,,,false,50535.5,24943.37
New York City,Kings,7002002,001324,Mount Sinai Brooklyn,70 or Older,112,M,Black/African American,Unknown,1,Elective,Home or Self Care,2019,NEO039,MALE REPRODUCTIVE SYSTEM CANCERS - PROSTATE,MRS003,PROSTATECTOMY,484,OTHER MALE REPRODUCTIVE SYSTEM & RELATED PROCEDURES,12,DISEASES AND DISORDERS OF THE MALE REPRODUCTIVE SYSTEM,2,Moderate,Minor,Surgical,Blue Cross/Blue Shield,Medicare,Self-Pay,,,false,54537.85,11536.25
Finger Lakes,Monroe,2701005,000413,Strong Memorial Hospital,50 to 69,144,M,White,Not Span/Hispanic,2,Elective,Home or Self Care,2019,GEN012,HYPERPLASIA OF PROSTATE,MRS003,PROSTATECTOMY,484,OTHER MALE REPRODUCTIVE SYSTEM & RELATED PROCEDURES,12,DISEASES AND DISORDERS OF THE MALE REPRODUCTIVE SYSTEM,1,Minor,Minor,Surgical,Medicare,,,,,false,29412.33,15778.43
Finger Lakes,Monroe,2701005,000413,Strong Memorial Hospital,50 to 69,144,M,White,Not Span/Hispanic,1,Elective,Home or Self Care,2019,NEO039,MALE REPRODUCTIVE SYSTEM CANCERS - PROSTATE,MRS003,PROSTATECTOMY,484,OTHER MALE REPRODUCTIVE SYSTEM & RELATED PROCEDURES,12,DISEASES AND DISORDERS OF THE MALE REPRODUCTIVE SYSTEM,2,Moderate,Minor,Surgical,Medicare,,,,,false,53241.64,28091.2
Long Island,Suffolk,5151001,000245,Stony Brook University Hospital,50 to 69,119,M,White,Not Span/Hispanic,2,Elective,Home w/ Home Health Services,2019,NEO039,MALE REPRODUCTIVE SYSTEM CANCERS - PROSTATE,GIS022,GI SYSTEM LYSIS OF ADHESIONS,484,OTHER MALE REPRODUCTIVE SYSTEM & RELATED PROCEDURES,12,DISEASES AND DISORDERS OF THE MALE REPRODUCTIVE SYSTEM,3,Major,Minor,Surgical,Medicaid,Medicaid,,,,false,42031.94,19079.51
New York City,Kings,7001020,001305,Maimonides Medical Center,50 to 69,115,M,Black/African American,Unknown,1,Elective,Home or Self Care,2019,NEO039,MALE REPRODUCTIVE SYSTEM CANCERS - PROSTATE,MRS003,PROSTATECTOMY,484,OTHER MALE REPRODUCTIVE SYSTEM & RELATED PROCEDURES,12,DISEASES AND DISORDERS OF THE MALE REPRODUCTIVE SYSTEM,2,Moderate,Minor,Surgical,Private Health Insurance,Self-Pay,,,,false,47322.01,15749.16
Capital/Adirond,Albany,0101000,000001,Albany Medical Center Hospital,50 to 69,133,M,White,Not Span/Hispanic,1,Elective,Home or Self Care,2019,NEO039,MALE REPRODUCTIVE SYSTEM CANCERS - PROSTATE,MRS003,PROSTATECTOMY,484,OTHER MALE REPRODUCTIVE SYSTEM & RELATED PROCEDURES,12,DISEASES AND DISORDERS OF THE MALE REPRODUCTIVE SYSTEM,2,Moderate,Minor,Surgical,Private Health Insurance,,,,,false,45598.44,21959.18
New York City,Manhattan,7002054,001458,New York-Presbyterian Hospital - New York Weill Cornell Center,50 to 69,116,M,Other Race,Not Span/Hispanic,1,Elective,Home or Self Care,2019,NEO039,MALE REPRODUCTIVE SYSTEM CANCERS - PROSTATE,MRS003,PROSTATECTOMY,484,OTHER MALE REPRODUCTIVE SYSTEM & RELATED PROCEDURES,12,DISEASES AND DISORDERS OF THE MALE REPRODUCTIVE SYSTEM,3,Major,Minor,Surgical,Blue Cross/Blue Shield,Self-Pay,,,,false,43097.32,11892.53
Finger Lakes,Monroe,2701005,000413,Strong Memorial Hospital,50 to 69,145,M,White,Not Span/Hispanic,1,Elective,Home or Self Care,2019,NEO039,MALE REPRODUCTIVE SYSTEM CANCERS - PROSTATE,MRS003,PROSTATECTOMY,484,OTHER MALE REPRODUCTIVE SYSTEM & RELATED PROCEDURES,12,DISEASES AND DISORDERS OF THE MALE REPRODUCTIVE SYSTEM,2,Moderate,Minor,Surgical,Blue Cross/Blue Shield,,,,,false,42103.95,20170.13
Finger Lakes,Monroe,2701005,000413,Strong Memorial Hospital,70 or Older,144,M,White,Not Span/Hispanic,1,Elective,Home or Self Care,2019,NEO039,MALE REPRODUCTIVE SYSTEM CANCERS - PROSTATE,MRS003,PROSTATECTOMY,484,OTHER MALE REPRODUCTIVE SYSTEM & RELATED PROCEDURES,12,DISEASES AND DISORDERS OF THE MALE REPRODUCTIVE SYSTEM,2,Moderate,Moderate,Surgical,Federal/State/Local/VA,,,,,false,34712.99,18125.61
Hudson Valley,Dutchess,1302001,000181,Vassar Brothers Medical Center,50 to 69,125,M,White,Not Span/Hispanic,2,Elective,Home or Self Care,2019,NEO039,MALE REPRODUCTIVE SYSTEM CANCERS - PROSTATE,MRS003,PROSTATECTOMY,484,OTHER MALE REPRODUCTIVE SYSTEM & RELATED PROCEDURES,12,DISEASES AND DISORDERS OF THE MALE REPRODUCTIVE SYSTEM,2,Moderate,Minor,Surgical,Blue Cross/Blue Shield,,,,,false,27090.48,11106.41
New York City,Richmond,7004003,001740,Staten Island University Hosp-North,50 to 69,103,M,White,Not Span/Hispanic,2,Elective,Home or Self Care,2019,NEO039,MALE REPRODUCTIVE SYSTEM CANCERS - PROSTATE,MRS003,PROSTATECTOMY,484,OTHER MALE REPRODUCTIVE SYSTEM & RELATED PROCEDURES,12,DISEASES AND DISORDERS OF THE MALE REPRODUCTIVE SYSTEM,2,Moderate,Minor,Surgical,Blue Cross/Blue Shield,,,,,false,52687.79,15357.41
Central NY,Onondaga,3301007,000628,UPSTATE University Hospital at Community General,50 to 69,134,M,White,Not Span/Hispanic,1,Elective,Home or Self Care,2019,NEO039,MALE REPRODUCTIVE SYSTEM CANCERS - PROSTATE,MRS003,PROSTATECTOMY,484,OTHER MALE REPRODUCTIVE SYSTEM & RELATED PROCEDURES,12,DISEASES AND DISORDERS OF THE MALE REPRODUCTIVE SYSTEM,2,Moderate,Minor,Surgical,Blue Cross/Blue Shield,,,,,false,33049.1,9376.5
New York City,Manhattan,7002054,001458,New York-Presbyterian Hospital - New York Weill Cornell Center,50 to 69,117,M,Other Race,Not Span/Hispanic,1,Elective,Home or Self Care,2019,NEO039,MALE REPRODUCTIVE SYSTEM CANCERS - PROSTATE,MRS003,PROSTATECTOMY,484,OTHER MALE REPRODUCTIVE SYSTEM & RELATED PROCEDURES,12,DISEASES AND DISORDERS OF THE MALE REPRODUCTIVE SYSTEM,2,Moderate,Minor,Surgical,Medicare,Private Health Insurance,Self-Pay,,,false,45419.5,12210.75
Finger Lakes,Monroe,2701005,000413,Strong Memorial Hospital,50 to 69,145,M,White,Not Span/Hispanic,1,Elective,Home or Self Care,2019,NEO039,MALE REPRODUCTIVE SYSTEM CANCERS - PROSTATE,MRS003,PROSTATECTOMY,484,OTHER MALE REPRODUCTIVE SYSTEM & RELATED PROCEDURES,12,DISEASES AND DISORDERS OF THE MALE REPRODUCTIVE SYSTEM,2,Moderate,Minor,Surgical,Medicare,,,,,false,33068.38,16777.36
Finger Lakes,Monroe,2701005,000413,Strong Memorial Hospital,70 or Older,148,M,White,Not Span/Hispanic,1,Elective,Home or Self Care,2019,NEO039,MALE REPRODUCTIVE SYSTEM CANCERS - PROSTATE,MRS003,PROSTATECTOMY,484,OTHER MALE REPRODUCTIVE SYSTEM & RELATED PROCEDURES,12,DISEASES AND DISORDERS OF THE MALE REPRODUCTIVE SYSTEM,2,Moderate,Minor,Surgical,Medicare,,,,,false,37054.43,19496.47
Finger Lakes,Monroe,2701005,000413,Strong Memorial Hospital,50 to 69,148,M,White,Not Span/Hispanic,1,Elective,Home or Self Care,2019,NEO039,MALE REPRODUCTIVE SYSTEM CANCERS - PROSTATE,MRS003,PROSTATECTOMY,484,OTHER MALE REPRODUCTIVE SYSTEM & RELATED PROCEDURES,12,DISEASES AND DISORDERS OF THE MALE REPRODUCTIVE SYSTEM,3,Major,Moderate,Surgical,Medicare,Blue Cross/Blue Shield,,,,false,37331.49,19766.68
New York City,Manhattan,7002053,001463,NYU Langone Hospitals,30 to 49,103,M,White,Not Span/Hispanic,7,Elective,Home or Self Care,2019,NEO040,MALE REPRODUCTIVE SYSTEM CANCERS - TESTIS,GNR009,"RETROPERITONEAL PROCEDURES, NEC",484,OTHER MALE REPRODUCTIVE SYSTEM & RELATED PROCEDURES,12,DISEASES AND DISORDERS OF THE MALE REPRODUCTIVE SYSTEM,3,Major,Major,Surgical,Blue Cross/Blue Shield,,,,,false,306967.33,60224.1
New York City,Queens,7003010,001637,New York - Presbyterian/Queens,50 to 69,113,M,Other Race,Spanish/Hispanic,3,Elective,Home or Self Care,2019,GEN012,HYPERPLASIA OF PROSTATE,MRS004,PROSTATE AND SEMINAL VESICLE PROCEDURES (EXCLUDING PROSTATECTOMY),484,OTHER MALE REPRODUCTIVE SYSTEM & RELATED PROCEDURES,12,DISEASES AND DISORDERS OF THE MALE REPRODUCTIVE SYSTEM,3,Major,Major,Surgical,Private Health Insurance,Self-Pay,,,,false,51622.78,18252.62
Finger Lakes,Monroe,2701001,000409,Highland Hospital,50 to 69,145,M,White,Not Span/Hispanic,1,Elective,Home or Self Care,2019,NEO039,MALE REPRODUCTIVE SYSTEM CANCERS - PROSTATE,MRS003,PROSTATECTOMY,484,OTHER MALE REPRODUCTIVE SYSTEM & RELATED PROCEDURES,12,DISEASES AND DISORDERS OF THE MALE REPRODUCTIVE SYSTEM,2,Moderate,Minor,Surgical,Self-Pay,,,,,false,29160.55,11064.91