Hospital Service Area,Hospital County,Operating Certificate Number,Permanent Facility Id,Facility Name,Age Group,Zip Code - 3 digits,Gender,Race,Ethnicity,Length of Stay,Type of Admission,Patient Disposition,Discharge Year,CCS Diagnosis Code,CCS Diagnosis Description,CCS Procedure Code,CCS Procedure Description,APR DRG Code,APR DRG Description,APR MDC Code,APR MDC Description,APR Severity of Illness Code,APR Severity of Illness Description,APR Risk of Mortality,APR Medical Surgical Description,Payment Typology 1,Payment Typology 2,Payment Typology 3,Birth Weight,Abortion Edit Indicator,Emergency Department Indicator,Total Charges,Total Costs
New York City,Manhattan,7002032,001466,Mount Sinai West,50 to 69,100,M,White,Not Span/Hispanic,1,Elective,Home or Self Care,2020,NEO039,MALE REPRODUCTIVE SYSTEM CANCERS - PROSTATE,MRS003,PROSTATECTOMY,484,OTHER MALE REPRODUCTIVE SYSTEM & RELATED PROCEDURES,12,DISEASES AND DISORDERS OF THE MALE REPRODUCTIVE SYSTEM,3,Major,Minor,Surgical,Private Health Insurance,Self-Pay,,,,N,40030.51,9563.35
New York City,Manhattan,7002002,001439,Mount Sinai Beth Israel,70 or Older,100,M,White,Not Span/Hispanic,1,Elective,Home or Self Care,2020,GEN012,HYPERPLASIA OF PROSTATE,MRS004,PROSTATE AND SEMINAL VESICLE PROCEDURES (EXCLUDING PROSTATECTOMY),484,OTHER MALE REPRODUCTIVE SYSTEM & RELATED PROCEDURES,12,DISEASES AND DISORDERS OF THE MALE REPRODUCTIVE SYSTEM,1,Minor,Minor,Surgical,Medicare,Private Health Insurance,Self-Pay,,,N,40887.52,7814.09
New York City,Manhattan,7002024,001456,Mount Sinai Hospital,70 or Older,103,M,White,Not Span/Hispanic,1,Elective,Home or Self Care,2020,GEN012,HYPERPLASIA OF PROSTATE,MRS004,PROSTATE AND SEMINAL VESICLE PROCEDURES (EXCLUDING PROSTATECTOMY),484,OTHER MALE REPRODUCTIVE SYSTEM & RELATED PROCEDURES,12,DISEASES AND DISORDERS OF THE MALE REPRODUCTIVE SYSTEM,2,Moderate,Moderate,Surgical,Blue Cross/Blue Shield,Medicare,Self-Pay,,,N,41078.15,12765.19
New York City,Bronx,7000006,001169,Montefiore Medical Center - Henry & Lucy Moses Div,50 to 69,104,M,Other Race,Spanish/Hispanic,1,Elective,Home or Self Care,2020,NEO039,MALE REPRODUCTIVE SYSTEM CANCERS - PROSTATE,MRS003,PROSTATECTOMY,484,OTHER MALE REPRODUCTIVE SYSTEM & RELATED PROCEDURES,12,DISEASES AND DISORDERS OF THE MALE REPRODUCTIVE SYSTEM,2,Moderate,Minor,Surgical,Blue Cross/Blue Shield,,,,,N,64837.74,11930.65
New York City,Manhattan,7002054,001464,New York-Presbyterian Hospital - Columbia Presbyterian Center,50 to 69,100,M,Black/African American,Spanish/Hispanic,1,Elective,Home or Self Care,2020,NEO039,MALE REPRODUCTIVE SYSTEM CANCERS - PROSTATE,MRS003,PROSTATECTOMY,484,OTHER MALE REPRODUCTIVE SYSTEM & RELATED PROCEDURES,12,DISEASES AND DISORDERS OF THE MALE REPRODUCTIVE SYSTEM,2,Moderate,Minor,Surgical,Medicaid,Medicaid,Self-Pay,,,N,38043.53,11444.39
New York City,Manhattan,7002054,001464,New York-Presbyterian Hospital - Columbia Presbyterian Center,70 or Older,100,M,White,Spanish/Hispanic,1,Elective,Home w/ Home Health Services,2020,NEO039,MALE REPRODUCTIVE SYSTEM CANCERS - PROSTATE,MRS003,PROSTATECTOMY,484,OTHER MALE REPRODUCTIVE SYSTEM & RELATED PROCEDURES,12,DISEASES AND DISORDERS OF THE MALE REPRODUCTIVE SYSTEM,2,Moderate,Minor,Surgical,Medicaid,Medicaid,Self-Pay,,,N,52266.88,14463.67
New York City,Manhattan,7002054,001464,New York-Presbyterian Hospital - Columbia Presbyterian Center,50 to 69,100,M,White,Not Span/Hispanic,2,Elective,Home or Self Care,2020,NEO039,MALE REPRODUCTIVE SYSTEM CANCERS - PROSTATE,MRS003,PROSTATECTOMY,484,OTHER MALE REPRODUCTIVE SYSTEM & RELATED PROCEDURES,12,DISEASES AND DISORDERS OF THE MALE REPRODUCTIVE SYSTEM,2,Moderate,Minor,Surgical,Private Health Insurance,Self-Pay,,,,N,60281.23,17460.74
New York City,Queens,7003010,001637,New York - Presbyterian/Queens,70 or Older,113,M,White,Not Span/Hispanic,1,Elective,Home or Self Care,2020,NEO073,BENIGN NEOPLASMS,MRS004,PROSTATE AND SEMINAL VESICLE PROCEDURES (EXCLUDING PROSTATECTOMY),484,OTHER MALE REPRODUCTIVE SYSTEM & RELATED PROCEDURES,12,DISEASES AND DISORDERS OF THE MALE REPRODUCTIVE SYSTEM,2,Moderate,Minor,Surgical,Blue Cross/Blue Shield,Medicare,Self-Pay,,,N,29056.98,11890.3
New York City,Queens,7003010,001637,New York - Presbyterian/Queens,50 to 69,113,M,Other Race,Spanish/Hispanic,1,Elective,Home or Self Care,2020,NEO039,MALE REPRODUCTIVE SYSTEM CANCERS - PROSTATE,MRS004,PROSTATE AND SEMINAL VESICLE PROCEDURES (EXCLUDING PROSTATECTOMY),484,OTHER MALE REPRODUCTIVE SYSTEM & RELATED PROCEDURES,12,DISEASES AND DISORDERS OF THE MALE REPRODUCTIVE SYSTEM,2,Moderate,Minor,Surgical,"Managed Care, Unspecified",Medicaid,Self-Pay,,,N,36891.09,14613.16
New York City,Queens,7003010,001637,New York - Presbyterian/Queens,50 to 69,113,M,Other Race,Spanish/Hispanic,2,Elective,Home or Self Care,2020,NEO073,BENIGN NEOPLASMS,MRS004,PROSTATE AND SEMINAL VESICLE PROCEDURES (EXCLUDING PROSTATECTOMY),484,OTHER MALE REPRODUCTIVE SYSTEM & RELATED PROCEDURES,12,DISEASES AND DISORDERS OF THE MALE REPRODUCTIVE SYSTEM,1,Minor,Minor,Surgical,Medicare,Private Health Insurance,Self-Pay,,,N,39544.79,15100.84
New York City,Queens,7003010,001637,New York - Presbyterian/Queens,50 to 69,114,M,Black/African American,Not Span/Hispanic,1,Elective,Home w/ Home Health Services,2020,NEO039,MALE REPRODUCTIVE SYSTEM CANCERS - PROSTATE,MRS003,PROSTATECTOMY,484,OTHER MALE REPRODUCTIVE SYSTEM & RELATED PROCEDURES,12,DISEASES AND DISORDERS OF THE MALE REPRODUCTIVE SYSTEM,2,Moderate,Minor,Surgical,Medicaid,Self-Pay,,,,N,39791.82,15550.73
New York City,Manhattan,7002054,001458,New York-Presbyterian Hospital - New York Weill Cornell Center,50 to 69,100,M,Other Race,Not Span/Hispanic,16,Emergency,Skilled Nursing Home,2020,NEO039,MALE REPRODUCTIVE SYSTEM CANCERS - PROSTATE,CAR024,VENOUS AND ARTERIAL CATHETER PLACEMENT,484,OTHER MALE REPRODUCTIVE SYSTEM & RELATED PROCEDURES,12,DISEASES AND DISORDERS OF THE MALE REPRODUCTIVE SYSTEM,3,Major,Major,Surgical,"Managed Care, Unspecified",Medicaid,Self-Pay,,,Y,264051.49,62369.19
New York City,Manhattan,7002054,001458,New York-Presbyterian Hospital - New York Weill Cornell Center,70 or Older,100,M,Other Race,Not Span/Hispanic,1,Elective,Home or Self Care,2020,NEO039,MALE REPRODUCTIVE SYSTEM CANCERS - PROSTATE,MRS003,PROSTATECTOMY,484,OTHER MALE REPRODUCTIVE SYSTEM & RELATED PROCEDURES,12,DISEASES AND DISORDERS OF THE MALE REPRODUCTIVE SYSTEM,2,Moderate,Minor,Surgical,Medicare,Medicare,Self-Pay,,,N,51820.6,14138.74
New York City,Manhattan,7002054,001458,New York-Presbyterian Hospital - New York Weill Cornell Center,50 to 69,OOS,M,Black/African American,Not Span/Hispanic,1,Elective,Home or Self Care,2020,NEO039,MALE REPRODUCTIVE SYSTEM CANCERS - PROSTATE,MRS003,PROSTATECTOMY,484,OTHER MALE REPRODUCTIVE SYSTEM & RELATED PROCEDURES,12,DISEASES AND DISORDERS OF THE MALE REPRODUCTIVE SYSTEM,2,Moderate,Minor,Surgical,Miscellaneous/Other,Self-Pay,,,,N,56181.15,16076.79
New York City,Manhattan,7002054,001458,New York-Presbyterian Hospital - New York Weill Cornell Center,50 to 69,,M,Multi-racial,Multi-ethnic,1,Elective,Home or Self Care,2020,NEO039,MALE REPRODUCTIVE SYSTEM CANCERS - PROSTATE,MRS003,PROSTATECTOMY,484,OTHER MALE REPRODUCTIVE SYSTEM & RELATED PROCEDURES,12,DISEASES AND DISORDERS OF THE MALE REPRODUCTIVE SYSTEM,2,Moderate,Minor,Surgical,Medicare,Medicare,Self-Pay,,,N,56684.41,16342.89
New York City,Manhattan,7002054,001458,New York-Presbyterian Hospital - New York Weill Cornell Center,50 to 69,128,M,Other Race,Not Span/Hispanic,1,Elective,Home or Self Care,2020,NEO039,MALE REPRODUCTIVE SYSTEM CANCERS - PROSTATE,MRS003,PROSTATECTOMY,484,OTHER MALE REPRODUCTIVE SYSTEM & RELATED PROCEDURES,12,DISEASES AND DISORDERS OF THE MALE REPRODUCTIVE SYSTEM,2,Moderate,Minor,Surgical,Medicare,Blue Cross/Blue Shield,Self-Pay,,,N,51516.44,14490.9
New York City,Manhattan,7002024,001456,Mount Sinai Hospital,50 to 69,100,M,Other Race,Spanish/Hispanic,1,Elective,Home or Self Care,2020,NEO039,MALE REPRODUCTIVE SYSTEM CANCERS - PROSTATE,MRS003,PROSTATECTOMY,484,OTHER MALE REPRODUCTIVE SYSTEM & RELATED PROCEDURES,12,DISEASES AND DISORDERS OF THE MALE REPRODUCTIVE SYSTEM,2,Moderate,Minor,Surgical,Private Health Insurance,Self-Pay,,,,N,43977.1,13341.02
New York City,Bronx,7000006,001169,Montefiore Medical Center - Henry & Lucy Moses Div,50 to 69,107,M,Other Race,Unknown,1,Elective,Home or Self Care,2020,NEO039,MALE REPRODUCTIVE SYSTEM CANCERS - PROSTATE,MRS003,PROSTATECTOMY,484,OTHER MALE REPRODUCTIVE SYSTEM & RELATED PROCEDURES,12,DISEASES AND DISORDERS OF THE MALE REPRODUCTIVE SYSTEM,2,Moderate,Minor,Surgical,Medicaid,,,,,N,65413,12009.78
New York City,Manhattan,7002032,001466,Mount Sinai West,70 or Older,100,M,White,Not Span/Hispanic,2,Elective,Home or Self Care,2020,GEN012,HYPERPLASIA OF PROSTATE,MRS003,PROSTATECTOMY,484,OTHER MALE REPRODUCTIVE SYSTEM & RELATED PROCEDURES,12,DISEASES AND DISORDERS OF THE MALE REPRODUCTIVE SYSTEM,2,Moderate,Minor,Surgical,Medicare,Private Health Insurance,Self-Pay,,,N,54869.64,13586.99
New York City,Bronx,7000006,001169,Montefiore Medical Center - Henry & Lucy Moses Div,50 to 69,104,M,Other Race,Spanish/Hispanic,2,Elective,Home or Self Care,2020,GEN012,HYPERPLASIA OF PROSTATE,MRS004,PROSTATE AND SEMINAL VESICLE PROCEDURES (EXCLUDING PROSTATECTOMY),484,OTHER MALE REPRODUCTIVE SYSTEM & RELATED PROCEDURES,12,DISEASES AND DISORDERS OF THE MALE REPRODUCTIVE SYSTEM,2,Moderate,Minor,Surgical,Medicaid,,,,,N,61124.67,11599.72
New York City,Manhattan,7002032,001466,Mount Sinai West,70 or Older,100,M,White,Not Span/Hispanic,2,Elective,Home w/ Home Health Services,2020,NEO039,MALE REPRODUCTIVE SYSTEM CANCERS - PROSTATE,MRS003,PROSTATECTOMY,484,OTHER MALE REPRODUCTIVE SYSTEM & RELATED PROCEDURES,12,DISEASES AND DISORDERS OF THE MALE REPRODUCTIVE SYSTEM,3,Major,Minor,Surgical,Medicare,Private Health Insurance,Self-Pay,,,N,68350.6,16951.16
New York City,Manhattan,7002024,001456,Mount Sinai Hospital,50 to 69,OOS,M,White,Not Span/Hispanic,1,Elective,Home or Self Care,2020,NEO039,MALE REPRODUCTIVE SYSTEM CANCERS - PROSTATE,MRS004,PROSTATE AND SEMINAL VESICLE PROCEDURES (EXCLUDING PROSTATECTOMY),484,OTHER MALE REPRODUCTIVE SYSTEM & RELATED PROCEDURES,12,DISEASES AND DISORDERS OF THE MALE REPRODUCTIVE SYSTEM,2,Moderate,Minor,Surgical,Blue Cross/Blue Shield,Self-Pay,,,,N,39044.89,12429.07
New York City,Manhattan,7002024,001456,Mount Sinai Hospital,70 or Older,113,M,White,Not Span/Hispanic,4,Elective,Home w/ Home Health Services,2020,GEN012,HYPERPLASIA OF PROSTATE,MRS004,PROSTATE AND SEMINAL VESICLE PROCEDURES (EXCLUDING PROSTATECTOMY),484,OTHER MALE REPRODUCTIVE SYSTEM & RELATED PROCEDURES,12,DISEASES AND DISORDERS OF THE MALE REPRODUCTIVE SYSTEM,2,Moderate,Minor,Surgical,Medicare,Private Health Insurance,Self-Pay,,,N,67094.96,18033.53
New York City,Manhattan,7002053,001463,NYU Langone Hospitals,50 to 69,OOS,M,White,Not Span/Hispanic,1,Elective,Home or Self Care,2020,NEO039,MALE REPRODUCTIVE SYSTEM CANCERS - PROSTATE,MRS003,PROSTATECTOMY,484,OTHER MALE REPRODUCTIVE SYSTEM & RELATED PROCEDURES,12,DISEASES AND DISORDERS OF THE MALE REPRODUCTIVE SYSTEM,3,Major,Moderate,Surgical,Blue Cross/Blue Shield,,,,,N,155671.82,22933.82
New York City,Manhattan,7002053,001463,NYU Langone Hospitals,50 to 69,112,M,White,Not Span/Hispanic,1,Elective,Home or Self Care,2020,NEO039,MALE REPRODUCTIVE SYSTEM CANCERS - PROSTATE,MRS003,PROSTATECTOMY,484,OTHER MALE REPRODUCTIVE SYSTEM & RELATED PROCEDURES,12,DISEASES AND DISORDERS OF THE MALE REPRODUCTIVE SYSTEM,3,Major,Moderate,Surgical,Private Health Insurance,,,,,N,148753.97,22071.54
New York City,Manhattan,7002024,001456,Mount Sinai Hospital,70 or Older,OOS,M,Other Race,Not Span/Hispanic,5,Emergency,Home w/ Home Health Services,2020,NEO039,MALE REPRODUCTIVE SYSTEM CANCERS - PROSTATE,URN009,CYSTECTOMY (INCLUDING FULGURATION) AND URETHRECTOMY,484,OTHER MALE REPRODUCTIVE SYSTEM & RELATED PROCEDURES,12,DISEASES AND DISORDERS OF THE MALE REPRODUCTIVE SYSTEM,3,Major,Major,Surgical,Private Health Insurance,Self-Pay,,,,Y,92010.64,22073.11
New York City,Manhattan,7002053,001463,NYU Langone Hospitals,70 or Older,100,M,White,Not Span/Hispanic,1,Elective,Home or Self Care,2020,NEO039,MALE REPRODUCTIVE SYSTEM CANCERS - PROSTATE,MRS003,PROSTATECTOMY,484,OTHER MALE REPRODUCTIVE SYSTEM & RELATED PROCEDURES,12,DISEASES AND DISORDERS OF THE MALE REPRODUCTIVE SYSTEM,2,Moderate,Minor,Surgical,Medicare,,,,,N,185749.55,26330.58
New York City,Manhattan,7002024,001456,Mount Sinai Hospital,50 to 69,OOS,M,White,Not Span/Hispanic,1,Elective,Home or Self Care,2020,GEN012,HYPERPLASIA OF PROSTATE,MRS004,PROSTATE AND SEMINAL VESICLE PROCEDURES (EXCLUDING PROSTATECTOMY),484,OTHER MALE REPRODUCTIVE SYSTEM & RELATED PROCEDURES,12,DISEASES AND DISORDERS OF THE MALE REPRODUCTIVE SYSTEM,2,Moderate,Minor,Surgical,Blue Cross/Blue Shield,Self-Pay,,,,N,38743.26,12194.35
New York City,Manhattan,7002053,001463,NYU Langone Hospitals,50 to 69,109,M,White,Unknown,1,Elective,Home or Self Care,2020,NEO039,MALE REPRODUCTIVE SYSTEM CANCERS - PROSTATE,MRS003,PROSTATECTOMY,484,OTHER MALE REPRODUCTIVE SYSTEM & RELATED PROCEDURES,12,DISEASES AND DISORDERS OF THE MALE REPRODUCTIVE SYSTEM,3,Major,Moderate,Surgical,Blue Cross/Blue Shield,,,,,N,150427.36,22203.76
New York City,Manhattan,7002053,001463,NYU Langone Hospitals,50 to 69,112,M,White,Not Span/Hispanic,1,Elective,Home or Self Care,2020,GEN012,HYPERPLASIA OF PROSTATE,MRS004,PROSTATE AND SEMINAL VESICLE PROCEDURES (EXCLUDING PROSTATECTOMY),484,OTHER MALE REPRODUCTIVE SYSTEM & RELATED PROCEDURES,12,DISEASES AND DISORDERS OF THE MALE REPRODUCTIVE SYSTEM,2,Moderate,Minor,Surgical,Medicare,Blue Cross/Blue Shield,,,,N,156532.53,23599.32
New York City,Bronx,7000006,001169,Montefiore Medical Center - Henry & Lucy Moses Div,50 to 69,104,M,Other Race,Spanish/Hispanic,3,Elective,Home or Self Care,2020,NEO039,MALE REPRODUCTIVE SYSTEM CANCERS - PROSTATE,MRS003,PROSTATECTOMY,484,OTHER MALE REPRODUCTIVE SYSTEM & RELATED PROCEDURES,12,DISEASES AND DISORDERS OF THE MALE REPRODUCTIVE SYSTEM,2,Moderate,Minor,Surgical,Private Health Insurance,,,,,N,82934.06,15533.21
New York City,Bronx,7000006,001169,Montefiore Medical Center - Henry & Lucy Moses Div,50 to 69,107,M,Black/African American,Not Span/Hispanic,1,Elective,Home or Self Care,2020,NEO039,MALE REPRODUCTIVE SYSTEM CANCERS - PROSTATE,MRS003,PROSTATECTOMY,484,OTHER MALE REPRODUCTIVE SYSTEM & RELATED PROCEDURES,12,DISEASES AND DISORDERS OF THE MALE REPRODUCTIVE SYSTEM,2,Moderate,Minor,Surgical,Private Health Insurance,,,,,N,67845.11,13043.24
New York City,Bronx,7000006,001169,Montefiore Medical Center - Henry & Lucy Moses Div,50 to 69,104,M,Black/African American,Unknown,1,Elective,Home or Self Care,2020,NEO039,MALE REPRODUCTIVE SYSTEM CANCERS - PROSTATE,MRS003,PROSTATECTOMY,484,OTHER MALE REPRODUCTIVE SYSTEM & RELATED PROCEDURES,12,DISEASES AND DISORDERS OF THE MALE REPRODUCTIVE SYSTEM,2,Moderate,Minor,Surgical,Private Health Insurance,,,,,N,67139.78,12561.46
Finger Lakes,Monroe,2701005,000413,Strong Memorial Hospital,50 to 69,144,M,Black/African American,Not Span/Hispanic,1,Elective,Home or Self Care,2020,NEO039,MALE REPRODUCTIVE SYSTEM CANCERS - PROSTATE,MRS003,PROSTATECTOMY,484,OTHER MALE REPRODUCTIVE SYSTEM & RELATED PROCEDURES,12,DISEASES AND DISORDERS OF THE MALE REPRODUCTIVE SYSTEM,2,Moderate,Minor,Surgical,Federal/State/Local/VA,,,,,N,35227.18,17765.09
New York City,Bronx,7000006,003058,Montefiore Med Center - Jack D Weiler Hosp of A Einstein College Div,50 to 69,104,M,Other Race,Not Span/Hispanic,1,Elective,Home or Self Care,2020,NEO039,MALE REPRODUCTIVE SYSTEM CANCERS - PROSTATE,MRS003,PROSTATECTOMY,484,OTHER MALE REPRODUCTIVE SYSTEM & RELATED PROCEDURES,12,DISEASES AND DISORDERS OF THE MALE REPRODUCTIVE SYSTEM,2,Moderate,Minor,Surgical,Private Health Insurance,,,,,N,66238.96,12617.5
Finger Lakes,Monroe,2701005,000413,Strong Memorial Hospital,50 to 69,145,M,White,Not Span/Hispanic,1,Elective,Home or Self Care,2020,NEO039,MALE REPRODUCTIVE SYSTEM CANCERS - PROSTATE,MRS003,PROSTATECTOMY,484,OTHER MALE REPRODUCTIVE SYSTEM & RELATED PROCEDURES,12,DISEASES AND DISORDERS OF THE MALE REPRODUCTIVE SYSTEM,2,Moderate,Minor,Surgical,Blue Cross/Blue Shield,,,,,N,37701.26,18143.48
Finger Lakes,Monroe,2701005,000413,Strong Memorial Hospital,50 to 69,146,M,White,Not Span/Hispanic,2,Elective,Home or Self Care,2020,GEN012,HYPERPLASIA OF PROSTATE,MRS004,PROSTATE AND SEMINAL VESICLE PROCEDURES (EXCLUDING PROSTATECTOMY),484,OTHER MALE REPRODUCTIVE SYSTEM & RELATED PROCEDURES,12,DISEASES AND DISORDERS OF THE MALE REPRODUCTIVE SYSTEM,2,Moderate,Minor,Surgical,Blue Cross/Blue Shield,Medicare,,,,N,48623.59,23913.01
Finger Lakes,Monroe,2701005,000413,Strong Memorial Hospital,50 to 69,145,M,Other Race,Spanish/Hispanic,3,Elective,Home w/ Home Health Services,2020,NEO039,MALE REPRODUCTIVE SYSTEM CANCERS - PROSTATE,MRS003,PROSTATECTOMY,484,OTHER MALE REPRODUCTIVE SYSTEM & RELATED PROCEDURES,12,DISEASES AND DISORDERS OF THE MALE REPRODUCTIVE SYSTEM,2,Moderate,Minor,Surgical,Private Health Insurance,,,,,N,51798.19,24478.54
Finger Lakes,Monroe,2701005,000413,Strong Memorial Hospital,50 to 69,148,M,White,Not Span/Hispanic,1,Elective,Home or Self Care,2020,NEO039,MALE REPRODUCTIVE SYSTEM CANCERS - PROSTATE,MRS003,PROSTATECTOMY,484,OTHER MALE REPRODUCTIVE SYSTEM & RELATED PROCEDURES,12,DISEASES AND DISORDERS OF THE MALE REPRODUCTIVE SYSTEM,2,Moderate,Minor,Surgical,Blue Cross/Blue Shield,,,,,N,44826.84,21018.2
Finger Lakes,Monroe,2701001,000409,Highland Hospital,70 or Older,146,M,White,Not Span/Hispanic,3,Elective,Home or Self Care,2020,NEO039,MALE REPRODUCTIVE SYSTEM CANCERS - PROSTATE,MRS003,PROSTATECTOMY,484,OTHER MALE REPRODUCTIVE SYSTEM & RELATED PROCEDURES,12,DISEASES AND DISORDERS OF THE MALE REPRODUCTIVE SYSTEM,3,Major,Minor,Surgical,Medicare,,,,,N,43994.54,16487.23
Finger Lakes,Monroe,2701001,000409,Highland Hospital,70 or Older,145,M,White,Not Span/Hispanic,2,Elective,Home or Self Care,2020,NEO039,MALE REPRODUCTIVE SYSTEM CANCERS - PROSTATE,MRS003,PROSTATECTOMY,484,OTHER MALE REPRODUCTIVE SYSTEM & RELATED PROCEDURES,12,DISEASES AND DISORDERS OF THE MALE REPRODUCTIVE SYSTEM,2,Moderate,Minor,Surgical,Medicare,,,,,N,40856.28,14982.69
Finger Lakes,Monroe,2701001,000409,Highland Hospital,70 or Older,146,M,White,Not Span/Hispanic,2,Elective,Home or Self Care,2020,GEN012,HYPERPLASIA OF PROSTATE,MRS004,PROSTATE AND SEMINAL VESICLE PROCEDURES (EXCLUDING PROSTATECTOMY),484,OTHER MALE REPRODUCTIVE SYSTEM & RELATED PROCEDURES,12,DISEASES AND DISORDERS OF THE MALE REPRODUCTIVE SYSTEM,1,Minor,Minor,Surgical,Medicare,,,,,N,40916.45,15266.32
Finger Lakes,Monroe,2701001,000409,Highland Hospital,50 to 69,145,M,White,Not Span/Hispanic,3,Elective,Home or Self Care,2020,NEO039,MALE REPRODUCTIVE SYSTEM CANCERS - PROSTATE,MRS003,PROSTATECTOMY,484,OTHER MALE REPRODUCTIVE SYSTEM & RELATED PROCEDURES,12,DISEASES AND DISORDERS OF THE MALE REPRODUCTIVE SYSTEM,2,Moderate,Minor,Surgical,Medicare,,,,,N,38912.54,14314.26
Finger Lakes,Monroe,2701005,000413,Strong Memorial Hospital,50 to 69,144,M,White,Not Span/Hispanic,1,Elective,Home or Self Care,2020,NEO039,MALE REPRODUCTIVE SYSTEM CANCERS - PROSTATE,MRS003,PROSTATECTOMY,484,OTHER MALE REPRODUCTIVE SYSTEM & RELATED PROCEDURES,12,DISEASES AND DISORDERS OF THE MALE REPRODUCTIVE SYSTEM,2,Moderate,Minor,Surgical,Blue Cross/Blue Shield,,,,,N,42050.55,19519
Finger Lakes,Monroe,2701005,000413,Strong Memorial Hospital,50 to 69,146,M,White,Not Span/Hispanic,1,Elective,Home or Self Care,2020,NEO039,MALE REPRODUCTIVE SYSTEM CANCERS - PROSTATE,MRS003,PROSTATECTOMY,484,OTHER MALE REPRODUCTIVE SYSTEM & RELATED PROCEDURES,12,DISEASES AND DISORDERS OF THE MALE REPRODUCTIVE SYSTEM,2,Moderate,Minor,Surgical,Blue Cross/Blue Shield,,,,,N,43314.14,20970.13
Finger Lakes,Monroe,2701005,000413,Strong Memorial Hospital,50 to 69,148,M,White,Not Span/Hispanic,1,Elective,Home or Self Care,2020,NEO039,MALE REPRODUCTIVE SYSTEM CANCERS - PROSTATE,MRS003,PROSTATECTOMY,484,OTHER MALE REPRODUCTIVE SYSTEM & RELATED PROCEDURES,12,DISEASES AND DISORDERS OF THE MALE REPRODUCTIVE SYSTEM,2,Moderate,Minor,Surgical,Blue Cross/Blue Shield,Blue Cross/Blue Shield,,,,N,44539.58,20363
Finger Lakes,Monroe,2701005,000413,Strong Memorial Hospital,50 to 69,146,M,Black/African American,Not Span/Hispanic,1,Elective,Home or Self Care,2020,NEO039,MALE REPRODUCTIVE SYSTEM CANCERS - PROSTATE,MRS003,PROSTATECTOMY,484,OTHER MALE REPRODUCTIVE SYSTEM & RELATED PROCEDURES,12,DISEASES AND DISORDERS OF THE MALE REPRODUCTIVE SYSTEM,2,Moderate,Minor,Surgical,Private Health Insurance,Medicare,,,,N,44748.56,21832.67
Finger Lakes,Monroe,2701005,000413,Strong Memorial Hospital,50 to 69,145,M,White,Not Span/Hispanic,2,Elective,Home or Self Care,2020,NEO041,MALE REPRODUCTIVE SYSTEM CANCERS - PENIS,LYM001,LYMPH NODE BIOPSY,484,OTHER MALE REPRODUCTIVE SYSTEM & RELATED PROCEDURES,12,DISEASES AND DISORDERS OF THE MALE REPRODUCTIVE SYSTEM,2,Moderate,Minor,Surgical,Medicare,Blue Cross/Blue Shield,,,,N,21761.74,10967.17
Finger Lakes,Monroe,2701005,000413,Strong Memorial Hospital,50 to 69,146,M,White,Not Span/Hispanic,5,Elective,Home or Self Care,2020,NEO039,MALE REPRODUCTIVE SYSTEM CANCERS - PROSTATE,MRS003,PROSTATECTOMY,484,OTHER MALE REPRODUCTIVE SYSTEM & RELATED PROCEDURES,12,DISEASES AND DISORDERS OF THE MALE REPRODUCTIVE SYSTEM,3,Major,Minor,Surgical,Blue Cross/Blue Shield,,,,,N,43746.82,22642.95
Finger Lakes,Monroe,2701005,000413,Strong Memorial Hospital,50 to 69,146,M,White,Not Span/Hispanic,2,Elective,Home or Self Care,2020,NEO039,MALE REPRODUCTIVE SYSTEM CANCERS - PROSTATE,MRS003,PROSTATECTOMY,484,OTHER MALE REPRODUCTIVE SYSTEM & RELATED PROCEDURES,12,DISEASES AND DISORDERS OF THE MALE REPRODUCTIVE SYSTEM,3,Major,Moderate,Surgical,Medicare,,,,,N,38988.44,19459.37
Capital/Adirond,Albany,0101000,000001,Albany Medical Center Hospital,50 to 69,123,M,Black/African American,Not Span/Hispanic,5,Emergency,Home w/ Home Health Services,2020,NEO039,MALE REPRODUCTIVE SYSTEM CANCERS - PROSTATE,URN009,CYSTECTOMY (INCLUDING FULGURATION) AND URETHRECTOMY,484,OTHER MALE REPRODUCTIVE SYSTEM & RELATED PROCEDURES,12,DISEASES AND DISORDERS OF THE MALE REPRODUCTIVE SYSTEM,3,Major,Minor,Surgical,Medicare,,,,,Y,36747.34,9824.05
Capital/Adirond,Albany,0101000,000001,Albany Medical Center Hospital,50 to 69,121,M,White,Not Span/Hispanic,1,Elective,Home or Self Care,2020,NEO039,MALE REPRODUCTIVE SYSTEM CANCERS - PROSTATE,MRS003,PROSTATECTOMY,484,OTHER MALE REPRODUCTIVE SYSTEM & RELATED PROCEDURES,12,DISEASES AND DISORDERS OF THE MALE REPRODUCTIVE SYSTEM,2,Moderate,Minor,Surgical,Blue Cross/Blue Shield,,,,,N,31001.77,11196.78
Finger Lakes,Monroe,2754001,000471,The Unity Hospital of Rochester,50 to 69,145,M,White,Not Span/Hispanic,1,Elective,Home w/ Home Health Services,2020,NEO039,MALE REPRODUCTIVE SYSTEM CANCERS - PROSTATE,MRS003,PROSTATECTOMY,484,OTHER MALE REPRODUCTIVE SYSTEM & RELATED PROCEDURES,12,DISEASES AND DISORDERS OF THE MALE REPRODUCTIVE SYSTEM,2,Moderate,Minor,Surgical,Blue Cross/Blue Shield,,,,,N,28759.86,12565.86
New York City,Bronx,7000006,001169,Montefiore Medical Center - Henry & Lucy Moses Div,50 to 69,104,M,Other Race,Unknown,1,Elective,Home or Self Care,2020,NEO039,MALE REPRODUCTIVE SYSTEM CANCERS - PROSTATE,MRS003,PROSTATECTOMY,484,OTHER MALE REPRODUCTIVE SYSTEM & RELATED PROCEDURES,12,DISEASES AND DISORDERS OF THE MALE REPRODUCTIVE SYSTEM,2,Moderate,Minor,Surgical,Medicaid,,,,,N,73711.87,13010.85
New York City,Manhattan,7002002,001439,Mount Sinai Beth Israel,50 to 69,112,M,Black/African American,Not Span/Hispanic,1,Elective,Home or Self Care,2020,GEN012,HYPERPLASIA OF PROSTATE,MRS004,PROSTATE AND SEMINAL VESICLE PROCEDURES (EXCLUDING PROSTATECTOMY),484,OTHER MALE REPRODUCTIVE SYSTEM & RELATED PROCEDURES,12,DISEASES AND DISORDERS OF THE MALE REPRODUCTIVE SYSTEM,2,Moderate,Moderate,Surgical,Private Health Insurance,Self-Pay,,,,N,42249.66,7974.33