Hospital Service Area,Hospital County,Operating Certificate Number,Permanent Facility Id,Facility Name,Age Group,Zip Code - 3 digits,Gender,Race,Ethnicity,Length of Stay,Type of Admission,Patient Disposition,Discharge Year,CCS Diagnosis Code,CCS Diagnosis Description,CCS Procedure Code,CCS Procedure Description,APR DRG Code,APR DRG Description,APR MDC Code,APR MDC Description,APR Severity of Illness Code,APR Severity of Illness Description,APR Risk of Mortality,APR Medical Surgical Description,Payment Typology 1,Payment Typology 2,Payment Typology 3,Birth Weight,Abortion Edit Indicator,Emergency Department Indicator,Total Charges,Total Costs
New York City,Manhattan,7002053,001463,NYU Langone Hospitals,50 to 69,100,F,Other Race,Unknown,14,Emergency,Inpatient Rehabilitation Facility,2020,NVS001,MENINGITIS,CNS002,LUMBAR PUNCTURE,049,BACTERIAL & TUBERCULOUS INFECTIONS OF NERVOUS SYSTEM,01,DISEASES AND DISORDERS OF THE NERVOUS SYSTEM,3,Major,Major,Medical,Blue Cross/Blue Shield,,,,,Y,203011.62,59977.91
New York City,Manhattan,7002053,001463,NYU Langone Hospitals,0 to 17,100,M,White,Not Span/Hispanic,4,Emergency,Home or Self Care,2020,NVS015,POLYNEUROPATHIES,CNS002,LUMBAR PUNCTURE,049,BACTERIAL & TUBERCULOUS INFECTIONS OF NERVOUS SYSTEM,01,DISEASES AND DISORDERS OF THE NERVOUS SYSTEM,2,Moderate,Minor,Medical,Private Health Insurance,,,,,Y,106092.37,17003.67
New York City,Manhattan,7002053,001463,NYU Langone Hospitals,30 to 49,112,M,Other Race,Spanish/Hispanic,5,Emergency,Inpatient Rehabilitation Facility,2020,NVS015,POLYNEUROPATHIES,CNS002,LUMBAR PUNCTURE,049,BACTERIAL & TUBERCULOUS INFECTIONS OF NERVOUS SYSTEM,01,DISEASES AND DISORDERS OF THE NERVOUS SYSTEM,2,Moderate,Minor,Medical,Private Health Insurance,,,,,Y,203029.74,25901.77
New York City,Manhattan,7002053,001463,NYU Langone Hospitals,50 to 69,112,M,Other Race,Spanish/Hispanic,15,Emergency,Expired,2020,NVS015,POLYNEUROPATHIES,MST003,"SUBCUTANEOUS TISSUE, FASCIA, AND MUSCLE BIOPSY",049,BACTERIAL & TUBERCULOUS INFECTIONS OF NERVOUS SYSTEM,01,DISEASES AND DISORDERS OF THE NERVOUS SYSTEM,4,Extreme,Extreme,Medical,Medicare,,,,,Y,809724.57,136867.7
New York City,Manhattan,7002053,001463,NYU Langone Hospitals,0 to 17,100,M,Other Race,Not Span/Hispanic,20,Emergency,Home or Self Care,2020,NVS001,MENINGITIS,CNS002,LUMBAR PUNCTURE,049,BACTERIAL & TUBERCULOUS INFECTIONS OF NERVOUS SYSTEM,01,DISEASES AND DISORDERS OF THE NERVOUS SYSTEM,3,Major,Minor,Medical,Private Health Insurance,,,,,Y,175636.96,47240.57
New York City,Manhattan,7002053,001463,NYU Langone Hospitals,50 to 69,100,M,White,Not Span/Hispanic,10,Emergency,Inpatient Rehabilitation Facility,2020,NVS015,POLYNEUROPATHIES,CNS002,LUMBAR PUNCTURE,049,BACTERIAL & TUBERCULOUS INFECTIONS OF NERVOUS SYSTEM,01,DISEASES AND DISORDERS OF THE NERVOUS SYSTEM,4,Extreme,Minor,Medical,Private Health Insurance,,,,,Y,181045.48,41881.43
New York City,Manhattan,7002053,001463,NYU Langone Hospitals,0 to 17,100,M,White,Not Span/Hispanic,3,Urgent,Home or Self Care,2020,NVS001,MENINGITIS,ADM017,ADMINISTRATION OF NUTRITIONAL AND ELECTROLYTIC SUBSTANCES,049,BACTERIAL & TUBERCULOUS INFECTIONS OF NERVOUS SYSTEM,01,DISEASES AND DISORDERS OF THE NERVOUS SYSTEM,2,Moderate,Moderate,Medical,Private Health Insurance,,,,,N,26611.9,10360.38
New York City,Manhattan,7002053,001463,NYU Langone Hospitals,0 to 17,117,M,White,Not Span/Hispanic,15,Emergency,Home or Self Care,2020,NVS001,MENINGITIS,CNS002,LUMBAR PUNCTURE,049,BACTERIAL & TUBERCULOUS INFECTIONS OF NERVOUS SYSTEM,01,DISEASES AND DISORDERS OF THE NERVOUS SYSTEM,3,Major,Moderate,Medical,Private Health Insurance,,,,,Y,150780.61,53148.64
New York City,Manhattan,7002053,001463,NYU Langone Hospitals,50 to 69,100,F,White,Not Span/Hispanic,12,Emergency,Inpatient Rehabilitation Facility,2020,NVS015,POLYNEUROPATHIES,ADM003,ADMINISTRATION OF ALBUMIN AND GLOBULIN,049,BACTERIAL & TUBERCULOUS INFECTIONS OF NERVOUS SYSTEM,01,DISEASES AND DISORDERS OF THE NERVOUS SYSTEM,2,Moderate,Minor,Medical,Private Health Insurance,,,,,Y,405122.69,70362.11
New York City,Manhattan,7002053,001463,NYU Langone Hospitals,70 or Older,111,M,White,Not Span/Hispanic,2,Emergency,Home w/ Home Health Services,2020,NVS015,POLYNEUROPATHIES,EST001,PHERESIS THERAPY,049,BACTERIAL & TUBERCULOUS INFECTIONS OF NERVOUS SYSTEM,01,DISEASES AND DISORDERS OF THE NERVOUS SYSTEM,3,Major,Minor,Medical,Blue Cross/Blue Shield,,,,,N,196176.03,17582.19
New York City,Manhattan,7002053,001463,NYU Langone Hospitals,30 to 49,113,M,White,Unknown,1,Emergency,Home or Self Care,2020,NVS015,POLYNEUROPATHIES,CNS002,LUMBAR PUNCTURE,049,BACTERIAL & TUBERCULOUS INFECTIONS OF NERVOUS SYSTEM,01,DISEASES AND DISORDERS OF THE NERVOUS SYSTEM,2,Moderate,Minor,Medical,Medicaid,,,,,Y,19931.79,5867.55
New York City,Manhattan,7002053,001463,NYU Langone Hospitals,0 to 17,112,M,White,Not Span/Hispanic,2,Emergency,Home or Self Care,2020,NVS015,POLYNEUROPATHIES,ADM003,ADMINISTRATION OF ALBUMIN AND GLOBULIN,049,BACTERIAL & TUBERCULOUS INFECTIONS OF NERVOUS SYSTEM,01,DISEASES AND DISORDERS OF THE NERVOUS SYSTEM,2,Moderate,Minor,Medical,Medicaid,,,,,Y,190149.19,14728.25
New York City,Manhattan,7002053,001463,NYU Langone Hospitals,50 to 69,115,F,White,Unknown,12,Emergency,Inpatient Rehabilitation Facility,2020,NVS015,POLYNEUROPATHIES,CNS002,LUMBAR PUNCTURE,049,BACTERIAL & TUBERCULOUS INFECTIONS OF NERVOUS SYSTEM,01,DISEASES AND DISORDERS OF THE NERVOUS SYSTEM,2,Moderate,Minor,Medical,Medicaid,,,,,Y,334208.21,67851.83
New York City,Manhattan,7002053,001463,NYU Langone Hospitals,30 to 49,104,F,Other Race,Spanish/Hispanic,5,Emergency,Inpatient Rehabilitation Facility,2020,NVS014,CNS ABSCESS,,,049,BACTERIAL & TUBERCULOUS INFECTIONS OF NERVOUS SYSTEM,01,DISEASES AND DISORDERS OF THE NERVOUS SYSTEM,4,Extreme,Extreme,Medical,Medicaid,,,,,N,91712.43,29899.65
New York City,Manhattan,7002053,001463,NYU Langone Hospitals,30 to 49,111,M,Other Race,Not Span/Hispanic,3,Emergency,Home or Self Care,2020,NVS015,POLYNEUROPATHIES,ADM003,ADMINISTRATION OF ALBUMIN AND GLOBULIN,049,BACTERIAL & TUBERCULOUS INFECTIONS OF NERVOUS SYSTEM,01,DISEASES AND DISORDERS OF THE NERVOUS SYSTEM,3,Major,Minor,Medical,Blue Cross/Blue Shield,,,,,Y,223900.7,23870.14
New York City,Manhattan,7002053,001463,NYU Langone Hospitals,0 to 17,OOS,F,White,Unknown,22,Emergency,Home or Self Care,2020,NVS001,MENINGITIS,CNS002,LUMBAR PUNCTURE,049,BACTERIAL & TUBERCULOUS INFECTIONS OF NERVOUS SYSTEM,01,DISEASES AND DISORDERS OF THE NERVOUS SYSTEM,3,Major,Moderate,Medical,Private Health Insurance,Private Health Insurance,,,,Y,245871.16,71168.63
New York City,Manhattan,7002053,001463,NYU Langone Hospitals,70 or Older,117,M,White,Not Span/Hispanic,76,Emergency,Skilled Nursing Home,2020,NVS014,CNS ABSCESS,RES007,AIRWAY INTUBATION,049,BACTERIAL & TUBERCULOUS INFECTIONS OF NERVOUS SYSTEM,01,DISEASES AND DISORDERS OF THE NERVOUS SYSTEM,4,Extreme,Extreme,Medical,Medicare,Private Health Insurance,,,,N,1940378.96,523568.73
New York City,Manhattan,7002053,001463,NYU Langone Hospitals,0 to 17,103,F,Other Race,Not Span/Hispanic,12,Emergency,Inpatient Rehabilitation Facility,2020,NVS015,POLYNEUROPATHIES,ADM003,ADMINISTRATION OF ALBUMIN AND GLOBULIN,049,BACTERIAL & TUBERCULOUS INFECTIONS OF NERVOUS SYSTEM,01,DISEASES AND DISORDERS OF THE NERVOUS SYSTEM,2,Moderate,Minor,Medical,Blue Cross/Blue Shield,,,,,Y,408289.93,66684.58
New York City,Manhattan,7002053,001463,NYU Langone Hospitals,70 or Older,103,M,White,Not Span/Hispanic,2,Emergency,Home or Self Care,2020,NVS015,POLYNEUROPATHIES,ADM003,ADMINISTRATION OF ALBUMIN AND GLOBULIN,049,BACTERIAL & TUBERCULOUS INFECTIONS OF NERVOUS SYSTEM,01,DISEASES AND DISORDERS OF THE NERVOUS SYSTEM,2,Moderate,Minor,Medical,Medicare,Medicare,,,,Y,201302.04,19537.08
New York City,Manhattan,7002053,001463,NYU Langone Hospitals,18 to 29,,F,Multi-racial,Not Span/Hispanic,25,Emergency,Home or Self Care,2020,NVS015,POLYNEUROPATHIES,ADM003,ADMINISTRATION OF ALBUMIN AND GLOBULIN,049,BACTERIAL & TUBERCULOUS INFECTIONS OF NERVOUS SYSTEM,01,DISEASES AND DISORDERS OF THE NERVOUS SYSTEM,4,Extreme,Extreme,Medical,Medicaid,,,,,Y,810471.93,140880.13
