Hospital Service Area,Hospital County,Operating Certificate Number,Permanent Facility Id,Facility Name,Age Group,Zip Code - 3 digits,Gender,Race,Ethnicity,Length of Stay,Type of Admission,Patient Disposition,Discharge Year,CCS Diagnosis Code,CCS Diagnosis Description,CCS Procedure Code,CCS Procedure Description,APR DRG Code,APR DRG Description,APR MDC Code,APR MDC Description,APR Severity of Illness Code,APR Severity of Illness Description,APR Risk of Mortality,APR Medical Surgical Description,Payment Typology 1,Payment Typology 2,Payment Typology 3,Birth Weight,Abortion Edit Indicator,Emergency Department Indicator,Total Charges,Total Costs
New York City,Manhattan,7002032,001466,Mount Sinai West,50 to 69,OOS,M,Other Race,Not Span/Hispanic,39,Urgent,Skilled Nursing Home,2017,109,Acute cerebrovascular disease,034,TRACHEOSTOMY; TEMP/PERM,005,Tracheostomy w MV 96+ hours w/o extensive procedure,01,Diseases and Disorders of the Nervous System,4,Extreme,Major,Surgical,Medicare,Medicare,Self-Pay,,N,N,424699.60,127535.81
New York City,Bronx,7000006,001168,Montefiore Medical Center-Wakefield Hospital,50 to 69,104,F,Black/African American,Not Span/Hispanic,80,Emergency,Skilled Nursing Home,2017,002,Septicemia (except in labor),034,TRACHEOSTOMY; TEMP/PERM,005,Tracheostomy w MV 96+ hours w/o extensive procedure,18,"Infectious and Parasitic Diseases, Systemic or Unspecified Sites",3,Major,Extreme,Surgical,Self-Pay,,,,N,Y,1185385.13,263350.77
New York City,Bronx,7000006,001168,Montefiore Medical Center-Wakefield Hospital,70 or Older,104,M,White,Spanish/Hispanic,47,Emergency,Home w/ Home Health Services,2017,083,Epilepsy; convulsions,034,TRACHEOSTOMY; TEMP/PERM,005,Tracheostomy w MV 96+ hours w/o extensive procedure,01,Diseases and Disorders of the Nervous System,4,Extreme,Extreme,Surgical,Medicare,Medicaid,,,N,Y,732651.83,170886.26
New York City,Bronx,7000006,001168,Montefiore Medical Center-Wakefield Hospital,30 to 49,104,M,Black/African American,Not Span/Hispanic,11,Emergency,Medicaid Cert Nursing Facility,2017,002,Septicemia (except in labor),034,TRACHEOSTOMY; TEMP/PERM,005,Tracheostomy w MV 96+ hours w/o extensive procedure,18,"Infectious and Parasitic Diseases, Systemic or Unspecified Sites",4,Extreme,Major,Surgical,Medicaid,,,,N,Y,222599.29,56682.87
New York City,Bronx,7000006,001169,Montefiore Medical Center - Henry & Lucy Moses Div,70 or Older,106,F,Black/African American,Not Span/Hispanic,32,Emergency,Medicaid Cert Nursing Facility,2017,109,Acute cerebrovascular disease,034,TRACHEOSTOMY; TEMP/PERM,005,Tracheostomy w MV 96+ hours w/o extensive procedure,01,Diseases and Disorders of the Nervous System,4,Extreme,Extreme,Surgical,Medicare,,,,N,N,471769.27,108872.81
New York City,Bronx,7000006,003058,Montefiore Med Center - Jack D Weiler Hosp of A Einstein College Div,50 to 69,104,F,Black/African American,Not Span/Hispanic,39,Emergency,Skilled Nursing Home,2017,002,Septicemia (except in labor),034,TRACHEOSTOMY; TEMP/PERM,005,Tracheostomy w MV 96+ hours w/o extensive procedure,18,"Infectious and Parasitic Diseases, Systemic or Unspecified Sites",4,Extreme,Extreme,Surgical,Medicare,Medicaid,,,N,Y,622749.41,157294.59
New York City,Kings,7001033,001315,Kingsbrook Jewish Medical Center,70 or Older,112,F,Black/African American,Not Span/Hispanic,32,Emergency,Skilled Nursing Home,2017,099,Hypertension with complications and secondary hypertension,034,TRACHEOSTOMY; TEMP/PERM,005,Tracheostomy w MV 96+ hours w/o extensive procedure,05,Diseases and Disorders of the Circulatory System,4,Extreme,Extreme,Surgical,Medicare,Medicaid,Self-Pay,,N,Y,365276.88,93097.99
New York City,Kings,7002002,001324,Mount Sinai Brooklyn,70 or Older,112,F,Black/African American,Not Span/Hispanic,50,Emergency,Skilled Nursing Home,2017,129,Aspiration pneumonitis; food/vomitus,034,TRACHEOSTOMY; TEMP/PERM,005,Tracheostomy w MV 96+ hours w/o extensive procedure,04,Diseases and Disorders of the Respiratory System,3,Major,Major,Surgical,Medicare,Miscellaneous/Other,Medicaid,,N,Y,414821.36,92830.32
New York City,Manhattan,7002024,001456,Mount Sinai Hospital,70 or Older,116,M,White,Not Span/Hispanic,9,Urgent,Medicare Cert Long Term Care Hospital,2017,129,Aspiration pneumonitis; food/vomitus,034,TRACHEOSTOMY; TEMP/PERM,005,Tracheostomy w MV 96+ hours w/o extensive procedure,04,Diseases and Disorders of the Respiratory System,3,Major,Major,Surgical,Medicare,Medicaid,Self-Pay,,N,N,139900.62,51115.82
New York City,Manhattan,7002032,001466,Mount Sinai West,50 to 69,100,F,White,Not Span/Hispanic,25,Emergency,Psychiatric Hospital or Unit of Hosp,2017,662,Suicide and intentional self-inflicted injury,034,TRACHEOSTOMY; TEMP/PERM,005,Tracheostomy w MV 96+ hours w/o extensive procedure,21,"Poisonings, Toxic Effects, Other Injuries and Other Complications of Treatment",3,Major,Major,Surgical,Medicaid,Medicaid,Self-Pay,,N,Y,249640.82,83686.92
Hudson Valley,Orange,3523000,000699,Orange Regional Medical Center,70 or Older,109,F,White,Not Span/Hispanic,39,Trauma,Home or Self Care,2017,083,Epilepsy; convulsions,216,RESP INTUB/MECH VENTIL,005,Tracheostomy w MV 96+ hours w/o extensive procedure,01,Diseases and Disorders of the Nervous System,4,Extreme,Extreme,Surgical,Medicare,,,,N,Y,438605.40,195922.47
Hudson Valley,Orange,3523000,000699,Orange Regional Medical Center,18 to 29,127,F,Black/African American,Not Span/Hispanic,26,Trauma,Inpatient Rehabilitation Facility,2017,233,Intracranial injury,034,TRACHEOSTOMY; TEMP/PERM,005,Tracheostomy w MV 96+ hours w/o extensive procedure,01,Diseases and Disorders of the Nervous System,3,Major,Moderate,Surgical,Private Health Insurance,Medicaid,,,N,Y,231569.83,101918.17
Hudson Valley,Orange,3523000,000699,Orange Regional Medical Center,70 or Older,109,F,Black/African American,Not Span/Hispanic,31,Emergency,Medicare Cert Long Term Care Hospital,2017,127,Chronic obstructive pulmonary disease and bronchiectasis,034,TRACHEOSTOMY; TEMP/PERM,005,Tracheostomy w MV 96+ hours w/o extensive procedure,04,Diseases and Disorders of the Respiratory System,4,Extreme,Major,Surgical,Medicare,Blue Cross/Blue Shield,,,N,Y,335674.17,148829.84
New York City,Manhattan,7002024,001456,Mount Sinai Hospital,70 or Older,104,F,Black/African American,Not Span/Hispanic,42,Emergency,Medicare Cert Long Term Care Hospital,2017,002,Septicemia (except in labor),231,OTHER THERAPEUTIC PRCS,005,Tracheostomy w MV 96+ hours w/o extensive procedure,18,"Infectious and Parasitic Diseases, Systemic or Unspecified Sites",4,Extreme,Extreme,Surgical,Medicare,Private Health Insurance,Self-Pay,,N,Y,542045.58,195563.18
New York City,Manhattan,7002024,001456,Mount Sinai Hospital,70 or Older,100,M,Other Race,Not Span/Hispanic,38,Emergency,Skilled Nursing Home,2017,134,Other upper respiratory disease,034,TRACHEOSTOMY; TEMP/PERM,005,Tracheostomy w MV 96+ hours w/o extensive procedure,03,"Ear, Nose, Mouth, Throat and Craniofacial Diseases and Disorders",4,Extreme,Extreme,Surgical,Medicare,Medicare,Self-Pay,,N,Y,367582.28,129093.39
New York City,Manhattan,7002032,001469,Mount Sinai St. Luke's,50 to 69,100,M,Black/African American,Not Span/Hispanic,56,Emergency,Expired,2017,002,Septicemia (except in labor),034,TRACHEOSTOMY; TEMP/PERM,005,Tracheostomy w MV 96+ hours w/o extensive procedure,18,"Infectious and Parasitic Diseases, Systemic or Unspecified Sites",4,Extreme,Extreme,Surgical,Medicare,Medicaid,Self-Pay,,N,Y,884449.52,297704.77
New York City,Bronx,7000006,001169,Montefiore Medical Center - Henry & Lucy Moses Div,30 to 49,104,M,Black/African American,Not Span/Hispanic,110,Emergency,Medicaid Cert Nursing Facility,2017,131,Respiratory failure; insufficiency; arrest (adult),034,TRACHEOSTOMY; TEMP/PERM,005,Tracheostomy w MV 96+ hours w/o extensive procedure,04,Diseases and Disorders of the Respiratory System,4,Extreme,Extreme,Surgical,Medicaid,,,,N,Y,1585722.35,349521.14
New York City,Bronx,7000006,001169,Montefiore Medical Center - Henry & Lucy Moses Div,0 to 17,107,M,White,Not Span/Hispanic,29,Emergency,Skilled Nursing Home,2017,131,Respiratory failure; insufficiency; arrest (adult),216,RESP INTUB/MECH VENTIL,005,Tracheostomy w MV 96+ hours w/o extensive procedure,04,Diseases and Disorders of the Respiratory System,3,Major,Moderate,Surgical,Medicaid,,,,N,Y,573503.22,135195.46
New York City,Kings,7001003,001288,Brooklyn Hospital Center - Downtown Campus,70 or Older,112,F,White,Unknown,26,Emergency,Medicare Cert Long Term Care Hospital,2017,131,Respiratory failure; insufficiency; arrest (adult),034,TRACHEOSTOMY; TEMP/PERM,005,Tracheostomy w MV 96+ hours w/o extensive procedure,04,Diseases and Disorders of the Respiratory System,4,Extreme,Extreme,Surgical,Medicare,Medicaid,Self-Pay,,N,Y,337106.84,61172.11
New York City,Kings,7001037,001320,University Hospital of Brooklyn,30 to 49,112,M,Black/African American,Not Span/Hispanic,73,Emergency,Expired,2017,002,Septicemia (except in labor),034,TRACHEOSTOMY; TEMP/PERM,005,Tracheostomy w MV 96+ hours w/o extensive procedure,18,"Infectious and Parasitic Diseases, Systemic or Unspecified Sites",4,Extreme,Major,Surgical,Private Health Insurance,Self-Pay,,,N,Y,713649.40,541797.11
New York City,Manhattan,7002002,001439,Mount Sinai Beth Israel,50 to 69,OOS,F,Other Race,Not Span/Hispanic,43,Emergency,Medicare Cert Long Term Care Hospital,2017,131,Respiratory failure; insufficiency; arrest (adult),034,TRACHEOSTOMY; TEMP/PERM,005,Tracheostomy w MV 96+ hours w/o extensive procedure,04,Diseases and Disorders of the Respiratory System,4,Extreme,Extreme,Surgical,Medicare,Private Health Insurance,Self-Pay,,N,N,550037.57,231381.84
New York City,Manhattan,7002024,001456,Mount Sinai Hospital,50 to 69,100,F,Other Race,Not Span/Hispanic,120 +,Emergency,Expired,2017,002,Septicemia (except in labor),034,TRACHEOSTOMY; TEMP/PERM,005,Tracheostomy w MV 96+ hours w/o extensive procedure,18,"Infectious and Parasitic Diseases, Systemic or Unspecified Sites",4,Extreme,Extreme,Surgical,Medicaid,Medicaid,Self-Pay,,N,Y,2785192.72,1049344.67
New York City,Manhattan,7002024,001456,Mount Sinai Hospital,70 or Older,112,F,White,Not Span/Hispanic,120 +,Emergency,Skilled Nursing Home,2017,042,Secondary malignancies,031,DX PRCS ON NOSE & MOUTH,005,Tracheostomy w MV 96+ hours w/o extensive procedure,04,Diseases and Disorders of the Respiratory System,4,Extreme,Extreme,Surgical,Medicare,Medicaid,Self-Pay,,N,Y,1081138.16,384636.07
Long Island,Nassau,2950002,000528,Nassau University Medical Center,50 to 69,115,F,White,Not Span/Hispanic,17,Emergency,Skilled Nursing Home,2017,002,Septicemia (except in labor),034,TRACHEOSTOMY; TEMP/PERM,005,Tracheostomy w MV 96+ hours w/o extensive procedure,18,"Infectious and Parasitic Diseases, Systemic or Unspecified Sites",3,Major,Major,Surgical,Medicare,Blue Cross/Blue Shield,Private Health Insurance,,N,Y,150182.55,89993.08
New York City,Kings,7001008,001293,"New York Community Hospital of Brooklyn, Inc",30 to 49,112,F,Other Race,Not Span/Hispanic,41,Emergency,Inpatient Rehabilitation Facility,2017,210,Systemic lupus erythematosus and connective tissue disorders,070,UP GASTRO ENDOSC/BIOPSY,005,Tracheostomy w MV 96+ hours w/o extensive procedure,08,Diseases and Disorders of the Musculoskeletal System and Conn Tissue,4,Extreme,Extreme,Surgical,Private Health Insurance,Self-Pay,,,N,Y,258887.11,114324.80
New York City,Kings,7001008,001293,"New York Community Hospital of Brooklyn, Inc",50 to 69,112,M,Black/African American,Not Span/Hispanic,14,Emergency,Skilled Nursing Home,2017,002,Septicemia (except in labor),216,RESP INTUB/MECH VENTIL,005,Tracheostomy w MV 96+ hours w/o extensive procedure,18,"Infectious and Parasitic Diseases, Systemic or Unspecified Sites",3,Major,Major,Surgical,Medicare,Medicaid,Self-Pay,,N,Y,89098.38,39211.86
New York City,Kings,7001021,001306,New York - Presbyterian Brooklyn Methodist Hospital,70 or Older,112,M,White,Spanish/Hispanic,41,Trauma,Skilled Nursing Home,2017,153,Gastrointestinal hemorrhage,034,TRACHEOSTOMY; TEMP/PERM,005,Tracheostomy w MV 96+ hours w/o extensive procedure,06,Diseases and Disorders of the Digestive System,4,Extreme,Extreme,Surgical,Medicare,Blue Cross/Blue Shield,Self-Pay,,N,Y,489326.29,189696.91
New York City,Kings,7001021,001306,New York - Presbyterian Brooklyn Methodist Hospital,50 to 69,112,M,Black/African American,Not Span/Hispanic,17,Emergency,Skilled Nursing Home,2017,002,Septicemia (except in labor),034,TRACHEOSTOMY; TEMP/PERM,005,Tracheostomy w MV 96+ hours w/o extensive procedure,18,"Infectious and Parasitic Diseases, Systemic or Unspecified Sites",4,Extreme,Major,Surgical,Medicare,Medicare,Medicaid,,N,Y,149880.42,55273.66
New York City,Kings,7002002,001324,Mount Sinai Brooklyn,70 or Older,112,F,Black/African American,Not Span/Hispanic,22,Emergency,Skilled Nursing Home,2017,002,Septicemia (except in labor),222,BLOOD TRANSFUSION,005,Tracheostomy w MV 96+ hours w/o extensive procedure,18,"Infectious and Parasitic Diseases, Systemic or Unspecified Sites",4,Extreme,Extreme,Surgical,Medicare,Miscellaneous/Other,Medicaid,,N,Y,281913.07,79867.54
New York City,Manhattan,7002054,001437,New York-Presbyterian/Lower Manhattan Hospital,70 or Older,100,M,Multi-racial,Not Span/Hispanic,27,Emergency,Home w/ Home Health Services,2017,108,Congestive heart failure; nonhypertensive,034,TRACHEOSTOMY; TEMP/PERM,005,Tracheostomy w MV 96+ hours w/o extensive procedure,05,Diseases and Disorders of the Circulatory System,4,Extreme,Extreme,Surgical,Medicare,Medicare,Medicaid,,N,Y,610592.64,334212.98
New York City,Manhattan,7002054,001437,New York-Presbyterian/Lower Manhattan Hospital,70 or Older,100,F,Multi-racial,Spanish/Hispanic,26,Emergency,Skilled Nursing Home,2017,002,Septicemia (except in labor),034,TRACHEOSTOMY; TEMP/PERM,005,Tracheostomy w MV 96+ hours w/o extensive procedure,18,"Infectious and Parasitic Diseases, Systemic or Unspecified Sites",4,Extreme,Extreme,Surgical,Medicare,Self-Pay,,,N,Y,571117.54,315079.32
New York City,Manhattan,7002054,001437,New York-Presbyterian/Lower Manhattan Hospital,70 or Older,100,M,Multi-racial,Not Span/Hispanic,14,Emergency,Expired,2017,019,Cancer of bronchus; lung,034,TRACHEOSTOMY; TEMP/PERM,005,Tracheostomy w MV 96+ hours w/o extensive procedure,04,Diseases and Disorders of the Respiratory System,3,Major,Major,Surgical,Medicare,Medicare,Self-Pay,,N,Y,335407.68,181028.67
New York City,Manhattan,7002002,001439,Mount Sinai Beth Israel,70 or Older,112,F,Other Race,Not Span/Hispanic,36,Emergency,Medicare Cert Long Term Care Hospital,2017,002,Septicemia (except in labor),034,TRACHEOSTOMY; TEMP/PERM,005,Tracheostomy w MV 96+ hours w/o extensive procedure,18,"Infectious and Parasitic Diseases, Systemic or Unspecified Sites",4,Extreme,Extreme,Surgical,Medicare,Medicaid,Self-Pay,,N,Y,361364.90,147911.87
New York City,Manhattan,7002024,001456,Mount Sinai Hospital,70 or Older,100,M,White,Not Span/Hispanic,34,Emergency,Home or Self Care,2017,131,Respiratory failure; insufficiency; arrest (adult),034,TRACHEOSTOMY; TEMP/PERM,005,Tracheostomy w MV 96+ hours w/o extensive procedure,04,Diseases and Disorders of the Respiratory System,4,Extreme,Major,Surgical,Medicare,Medicare,Medicaid,,N,Y,424888.75,156337.70
New York City,Manhattan,7002024,001456,Mount Sinai Hospital,70 or Older,100,F,Other Race,Not Span/Hispanic,16,Emergency,Hospice - Home,2017,002,Septicemia (except in labor),034,TRACHEOSTOMY; TEMP/PERM,005,Tracheostomy w MV 96+ hours w/o extensive procedure,18,"Infectious and Parasitic Diseases, Systemic or Unspecified Sites",4,Extreme,Extreme,Surgical,Medicare,Medicaid,Self-Pay,,N,Y,211775.33,77654.62
New York City,Manhattan,7002054,001464,New York Presbyterian Hospital - Columbia Presbyterian Center,70 or Older,100,M,Other Race,Not Span/Hispanic,57,Urgent,Home or Self Care,2017,002,Septicemia (except in labor),034,TRACHEOSTOMY; TEMP/PERM,005,Tracheostomy w MV 96+ hours w/o extensive procedure,18,"Infectious and Parasitic Diseases, Systemic or Unspecified Sites",4,Extreme,Major,Surgical,Self-Pay,Self-Pay,,,N,N,984875.98,440708.37
New York City,Manhattan,7002054,001464,New York Presbyterian Hospital - Columbia Presbyterian Center,50 to 69,100,M,Multi-racial,Spanish/Hispanic,59,Emergency,Medicare Cert Long Term Care Hospital,2017,085,Coma; stupor; and brain damage,034,TRACHEOSTOMY; TEMP/PERM,005,Tracheostomy w MV 96+ hours w/o extensive procedure,01,Diseases and Disorders of the Nervous System,4,Extreme,Extreme,Surgical,Medicare,Medicare,Medicaid,,N,Y,898403.63,362196.12
New York City,Manhattan,7002054,001464,New York Presbyterian Hospital - Columbia Presbyterian Center,0 to 17,112,F,White,Multi-ethnic,50,Emergency,Short-term Hospital,2017,131,Respiratory failure; insufficiency; arrest (adult),034,TRACHEOSTOMY; TEMP/PERM,005,Tracheostomy w MV 96+ hours w/o extensive procedure,04,Diseases and Disorders of the Respiratory System,4,Extreme,Major,Surgical,Medicaid,Medicaid,Self-Pay,,N,Y,895567.66,517066.75
New York City,Manhattan,7002054,001464,New York Presbyterian Hospital - Columbia Presbyterian Center,70 or Older,100,M,Black/African American,Spanish/Hispanic,45,Emergency,Skilled Nursing Home,2017,109,Acute cerebrovascular disease,034,TRACHEOSTOMY; TEMP/PERM,005,Tracheostomy w MV 96+ hours w/o extensive procedure,01,Diseases and Disorders of the Nervous System,3,Major,Extreme,Surgical,Medicare,Medicare,Medicaid,,N,Y,829963.84,404805.84
New York City,Manhattan,7002054,003975,New York Presbyterian Hospital - Allen Hospital,70 or Older,104,M,Other Race,Not Span/Hispanic,120 +,Emergency,Skilled Nursing Home,2017,002,Septicemia (except in labor),034,TRACHEOSTOMY; TEMP/PERM,005,Tracheostomy w MV 96+ hours w/o extensive procedure,18,"Infectious and Parasitic Diseases, Systemic or Unspecified Sites",4,Extreme,Extreme,Surgical,Medicare,Medicaid,Self-Pay,,N,Y,2032350.68,906495.27
New York City,Manhattan,7002054,003975,New York Presbyterian Hospital - Allen Hospital,70 or Older,104,F,Multi-racial,Spanish/Hispanic,35,Emergency,Skilled Nursing Home,2017,002,Septicemia (except in labor),054,OT VASC CATH; NOT HEART,005,Tracheostomy w MV 96+ hours w/o extensive procedure,18,"Infectious and Parasitic Diseases, Systemic or Unspecified Sites",4,Extreme,Extreme,Surgical,Medicare,Medicaid,Self-Pay,,N,Y,637563.59,317886.09
New York City,Queens,7003010,001637,New York - Presbyterian/Queens,70 or Older,113,M,White,Not Span/Hispanic,29,Emergency,Skilled Nursing Home,2017,127,Chronic obstructive pulmonary disease and bronchiectasis,034,TRACHEOSTOMY; TEMP/PERM,005,Tracheostomy w MV 96+ hours w/o extensive procedure,04,Diseases and Disorders of the Respiratory System,3,Major,Extreme,Surgical,Medicare,Medicaid,Self-Pay,,N,Y,279260.39,104150.07
New York City,Queens,7003010,001637,New York - Presbyterian/Queens,50 to 69,113,F,Other Race,Spanish/Hispanic,38,Emergency,Skilled Nursing Home,2017,002,Septicemia (except in labor),034,TRACHEOSTOMY; TEMP/PERM,005,Tracheostomy w MV 96+ hours w/o extensive procedure,18,"Infectious and Parasitic Diseases, Systemic or Unspecified Sites",4,Extreme,Major,Surgical,Medicaid,Medicaid,Self-Pay,,N,Y,354779.55,108718.56
New York City,Queens,7003010,001637,New York - Presbyterian/Queens,70 or Older,114,M,Other Race,Not Span/Hispanic,26,Emergency,Skilled Nursing Home,2017,002,Septicemia (except in labor),034,TRACHEOSTOMY; TEMP/PERM,005,Tracheostomy w MV 96+ hours w/o extensive procedure,18,"Infectious and Parasitic Diseases, Systemic or Unspecified Sites",4,Extreme,Extreme,Surgical,Medicare,Medicare,Medicaid,,N,Y,264628.60,99081.11
New York City,Queens,7003010,001637,New York - Presbyterian/Queens,70 or Older,113,M,White,Not Span/Hispanic,40,Emergency,Expired,2017,153,Gastrointestinal hemorrhage,216,RESP INTUB/MECH VENTIL,005,Tracheostomy w MV 96+ hours w/o extensive procedure,06,Diseases and Disorders of the Digestive System,4,Extreme,Extreme,Surgical,Medicare,Private Health Insurance,Self-Pay,,N,Y,343968.20,120033.06
New York City,Queens,7003010,001637,New York - Presbyterian/Queens,70 or Older,114,M,White,Not Span/Hispanic,30,Emergency,Skilled Nursing Home,2017,002,Septicemia (except in labor),034,TRACHEOSTOMY; TEMP/PERM,005,Tracheostomy w MV 96+ hours w/o extensive procedure,18,"Infectious and Parasitic Diseases, Systemic or Unspecified Sites",4,Extreme,Major,Surgical,Medicare,Medicare,Medicaid,,N,Y,319144.36,107553.19
Hudson Valley,Orange,3535001,000708,Bon Secours Community Hospital,50 to 69,OOS,F,White,Not Span/Hispanic,22,Emergency,Medicare Cert Long Term Care Hospital,2017,157,Acute and unspecified renal failure,034,TRACHEOSTOMY; TEMP/PERM,005,Tracheostomy w MV 96+ hours w/o extensive procedure,11,Diseases and Disorders of the Kidney and Urinary Tract,4,Extreme,Extreme,Surgical,Medicare,,,,N,Y,461757.04,111084.64
Hudson Valley,Orange,3535001,000708,Bon Secours Community Hospital,30 to 49,127,F,White,Not Span/Hispanic,20,Emergency,Skilled Nursing Home,2017,127,Chronic obstructive pulmonary disease and bronchiectasis,216,RESP INTUB/MECH VENTIL,005,Tracheostomy w MV 96+ hours w/o extensive procedure,04,Diseases and Disorders of the Respiratory System,4,Extreme,Major,Surgical,Medicare,Medicaid,,,N,Y,399146.61,89001.39
Hudson Valley,Rockland,4329000,000779,Good Samaritan Hospital of Suffern,70 or Older,109,F,White,Not Span/Hispanic,11,Emergency,Medicare Cert Long Term Care Hospital,2017,002,Septicemia (except in labor),034,TRACHEOSTOMY; TEMP/PERM,005,Tracheostomy w MV 96+ hours w/o extensive procedure,18,"Infectious and Parasitic Diseases, Systemic or Unspecified Sites",3,Major,Extreme,Surgical,Medicare,Private Health Insurance,,,N,Y,176625.06,46058.84
New York City,Kings,7002053,001304,NYU Langone Hospital-Brooklyn,18 to 29,112,M,Black/African American,Not Span/Hispanic,82,Emergency,Skilled Nursing Home,2017,227,Spinal cord injury,034,TRACHEOSTOMY; TEMP/PERM,005,Tracheostomy w MV 96+ hours w/o extensive procedure,01,Diseases and Disorders of the Nervous System,3,Major,Major,Surgical,Medicaid,,,,N,Y,1418163.62,358521.18
New York City,Kings,7002053,001304,NYU Langone Hospital-Brooklyn,70 or Older,112,F,White,Not Span/Hispanic,25,Emergency,Expired,2017,002,Septicemia (except in labor),034,TRACHEOSTOMY; TEMP/PERM,005,Tracheostomy w MV 96+ hours w/o extensive procedure,18,"Infectious and Parasitic Diseases, Systemic or Unspecified Sites",4,Extreme,Major,Surgical,Private Health Insurance,,,,N,Y,395686.49,118918.77
New York City,Manhattan,7002024,001456,Mount Sinai Hospital,18 to 29,,M,Other Race,Not Span/Hispanic,27,Emergency,Expired,2017,005,HIV infection,034,TRACHEOSTOMY; TEMP/PERM,005,Tracheostomy w MV 96+ hours w/o extensive procedure,24,Human Immunodeficiency Virus Infections,4,Extreme,Extreme,Surgical,Medicaid,Medicaid,Self-Pay,,N,Y,337898.82,119176.95
New York City,Manhattan,7002053,001463,NYU Langone Hospitals,50 to 69,100,F,White,Not Span/Hispanic,43,Emergency,Short-term Hospital,2017,002,Septicemia (except in labor),216,RESP INTUB/MECH VENTIL,005,Tracheostomy w MV 96+ hours w/o extensive procedure,18,"Infectious and Parasitic Diseases, Systemic or Unspecified Sites",4,Extreme,Major,Surgical,Medicare,,,,N,Y,1016022.06,359931.04
Western NY,Erie,1401014,000208,Women And Children's Hospital Of Buffalo,0 to 17,143,M,Black/African American,Not Span/Hispanic,120 +,Emergency,Home or Self Care,2017,217,Other congenital anomalies,216,RESP INTUB/MECH VENTIL,005,Tracheostomy w MV 96+ hours w/o extensive procedure,03,"Ear, Nose, Mouth, Throat and Craniofacial Diseases and Disorders",4,Extreme,Major,Surgical,Medicaid,Self-Pay,,,N,Y,1126212.13,534809.80
Western NY,Erie,1401005,000210,Erie County Medical Center,50 to 69,142,F,White,Not Span/Hispanic,61,Urgent,Psychiatric Hospital or Unit of Hosp,2017,055,Fluid and electrolyte disorders,216,RESP INTUB/MECH VENTIL,005,Tracheostomy w MV 96+ hours w/o extensive procedure,10,"Endocrine, Nutritional and Metabolic Diseases and Disorders",4,Extreme,Extreme,Surgical,Blue Cross/Blue Shield,Medicaid,,,N,N,160356.21,113624.14