Hospital Service Area,Hospital County,Operating Certificate Number,Permanent Facility Id,Facility Name,Age Group,Zip Code - 3 digits,Gender,Race,Ethnicity,Length of Stay,Type of Admission,Patient Disposition,Discharge Year,CCS Diagnosis Code,CCS Diagnosis Description,CCS Procedure Code,CCS Procedure Description,APR DRG Code,APR DRG Description,APR MDC Code,APR MDC Description,APR Severity of Illness Code,APR Severity of Illness Description,APR Risk of Mortality,APR Medical Surgical Description,Payment Typology 1,Payment Typology 2,Payment Typology 3,Birth Weight,Abortion Edit Indicator,Emergency Department Indicator,Total Charges,Total Costs
Long Island,Nassau,2908000,000511,NYU Winthrop Hospital,50 to 69,110,M,White,Not Span/Hispanic,33,Emergency,Short-term Hospital,2017,002,Septicemia (except in labor),034,TRACHEOSTOMY; TEMP/PERM,005,Tracheostomy w MV 96+ hours w/o extensive procedure,18,"Infectious and Parasitic Diseases, Systemic or Unspecified Sites",3,Major,Major,Surgical,Private Health Insurance,,,,N,Y,438215.16,77056.46
Long Island,Nassau,2908000,000511,NYU Winthrop Hospital,50 to 69,115,M,White,Not Span/Hispanic,59,Emergency,Expired,2017,100,Acute myocardial infarction,034,TRACHEOSTOMY; TEMP/PERM,005,Tracheostomy w MV 96+ hours w/o extensive procedure,05,Diseases and Disorders of the Circulatory System,4,Extreme,Extreme,Surgical,Medicare,Medicare,Medicaid,,N,Y,915687.66,159069.40
Long Island,Nassau,2908000,000511,NYU Winthrop Hospital,50 to 69,115,M,Black/African American,Not Span/Hispanic,30,Emergency,Skilled Nursing Home,2017,083,Epilepsy; convulsions,034,TRACHEOSTOMY; TEMP/PERM,005,Tracheostomy w MV 96+ hours w/o extensive procedure,01,Diseases and Disorders of the Nervous System,4,Extreme,Extreme,Surgical,Medicaid,Medicaid,,,N,Y,547119.70,97843.15
Long Island,Nassau,2908000,000511,NYU Winthrop Hospital,50 to 69,115,F,White,Not Span/Hispanic,44,Emergency,Skilled Nursing Home,2017,131,Respiratory failure; insufficiency; arrest (adult),034,TRACHEOSTOMY; TEMP/PERM,005,Tracheostomy w MV 96+ hours w/o extensive procedure,04,Diseases and Disorders of the Respiratory System,3,Major,Major,Surgical,Medicare,Medicare,Private Health Insurance,,N,Y,622427.13,109973.18
Long Island,Nassau,2908000,000511,NYU Winthrop Hospital,50 to 69,115,M,Black/African American,Not Span/Hispanic,37,Emergency,Skilled Nursing Home,2017,105,Conduction disorders,216,RESP INTUB/MECH VENTIL,005,Tracheostomy w MV 96+ hours w/o extensive procedure,05,Diseases and Disorders of the Circulatory System,4,Extreme,Extreme,Surgical,Medicaid,Medicaid,,,N,Y,679778.99,110545.74
Long Island,Nassau,2908000,000511,NYU Winthrop Hospital,50 to 69,115,F,White,Not Span/Hispanic,25,Emergency,Skilled Nursing Home,2017,131,Respiratory failure; insufficiency; arrest (adult),034,TRACHEOSTOMY; TEMP/PERM,005,Tracheostomy w MV 96+ hours w/o extensive procedure,04,Diseases and Disorders of the Respiratory System,3,Major,Major,Surgical,Medicare,Medicare,,,N,Y,414455.71,77221.07
Long Island,Nassau,2908000,000511,NYU Winthrop Hospital,70 or Older,115,M,White,Spanish/Hispanic,74,Emergency,Home w/ Home Health Services,2017,002,Septicemia (except in labor),034,TRACHEOSTOMY; TEMP/PERM,005,Tracheostomy w MV 96+ hours w/o extensive procedure,18,"Infectious and Parasitic Diseases, Systemic or Unspecified Sites",4,Extreme,Extreme,Surgical,Medicaid,,,,N,Y,829804.24,158258.95
Long Island,Nassau,2908000,000511,NYU Winthrop Hospital,50 to 69,115,F,Black/African American,Not Span/Hispanic,39,Emergency,Skilled Nursing Home,2017,157,Acute and unspecified renal failure,034,TRACHEOSTOMY; TEMP/PERM,005,Tracheostomy w MV 96+ hours w/o extensive procedure,11,Diseases and Disorders of the Kidney and Urinary Tract,3,Major,Major,Surgical,Medicare,Medicare,Medicaid,,N,Y,791534.55,133115.95
Long Island,Nassau,2908000,000511,NYU Winthrop Hospital,70 or Older,115,F,White,Not Span/Hispanic,28,Emergency,Skilled Nursing Home,2017,122,Pneumonia (except that caused by tuberculosis or sexually transmitted disease),034,TRACHEOSTOMY; TEMP/PERM,005,Tracheostomy w MV 96+ hours w/o extensive procedure,04,Diseases and Disorders of the Respiratory System,3,Major,Extreme,Surgical,Medicare,Medicare,Blue Cross/Blue Shield,,N,Y,452038.40,79108.57
Long Island,Nassau,2908000,000511,NYU Winthrop Hospital,70 or Older,117,F,White,Not Span/Hispanic,31,Emergency,Skilled Nursing Home,2017,002,Septicemia (except in labor),034,TRACHEOSTOMY; TEMP/PERM,005,Tracheostomy w MV 96+ hours w/o extensive procedure,18,"Infectious and Parasitic Diseases, Systemic or Unspecified Sites",4,Extreme,Major,Surgical,Medicare,Medicare,Private Health Insurance,,N,Y,481686.72,92446.77
Long Island,Nassau,2908000,000511,NYU Winthrop Hospital,70 or Older,115,M,Black/African American,Not Span/Hispanic,34,Emergency,Skilled Nursing Home,2017,109,Acute cerebrovascular disease,034,TRACHEOSTOMY; TEMP/PERM,005,Tracheostomy w MV 96+ hours w/o extensive procedure,01,Diseases and Disorders of the Nervous System,4,Extreme,Extreme,Surgical,Medicare,Medicare,,,N,Y,611894.83,105147.29
Long Island,Nassau,2908000,000511,NYU Winthrop Hospital,50 to 69,118,M,White,Not Span/Hispanic,45,Urgent,Skilled Nursing Home,2017,109,Acute cerebrovascular disease,034,TRACHEOSTOMY; TEMP/PERM,005,Tracheostomy w MV 96+ hours w/o extensive procedure,01,Diseases and Disorders of the Nervous System,4,Extreme,Extreme,Surgical,Private Health Insurance,,,,N,N,634810.45,109819.96
