Hospital Service Area,Hospital County,Operating Certificate Number,Permanent Facility Id,Facility Name,Age Group,Zip Code - 3 digits,Gender,Race,Ethnicity,Length of Stay,Type of Admission,Patient Disposition,Discharge Year,CCS Diagnosis Code,CCS Diagnosis Description,CCS Procedure Code,CCS Procedure Description,APR DRG Code,APR DRG Description,APR MDC Code,APR MDC Description,APR Severity of Illness Code,APR Severity of Illness Description,APR Risk of Mortality,APR Medical Surgical Description,Payment Typology 1,Payment Typology 2,Payment Typology 3,Birth Weight,Abortion Edit Indicator,Emergency Department Indicator,Total Charges,Total Costs
New York City,Manhattan,7002001,001438,Bellevue Hospital Center,70 or Older,OOS,M,White,Not Span/Hispanic,48,Emergency,Skilled Nursing Home,2019,INJ008,"TRAUMATIC BRAIN INJURY (TBI); CONCUSSION, INITIAL ENCOUNTER",RES010,TRACHEOSTOMY,005,TRACHEOSTOMY W MV 96+ HOURS W/O EXTENSIVE PROCEDURE,01,DISEASES AND DISORDERS OF THE NERVOUS SYSTEM,4,Extreme,Extreme,Surgical,Medicare,,,,,true,333197.05,221442.76
New York City,Manhattan,7002001,001438,Bellevue Hospital Center,70 or Older,112,F,Other Race,Not Span/Hispanic,44,Emergency,Expired,2019,RSP012,RESPIRATORY FAILURE; INSUFFICIENCY; ARREST,RES010,TRACHEOSTOMY,005,TRACHEOSTOMY W MV 96+ HOURS W/O EXTENSIVE PROCEDURE,04,DISEASES AND DISORDERS OF THE RESPIRATORY SYSTEM,4,Extreme,Extreme,Surgical,Medicare,Medicaid,,,,false,283817.72,188625.26
New York City,Manhattan,7002001,001438,Bellevue Hospital Center,50 to 69,113,M,Black/African American,Not Span/Hispanic,37,Emergency,Expired,2019,NVS013,COMA; STUPOR; AND BRAIN DAMAGE,RES010,TRACHEOSTOMY,005,TRACHEOSTOMY W MV 96+ HOURS W/O EXTENSIVE PROCEDURE,01,DISEASES AND DISORDERS OF THE NERVOUS SYSTEM,4,Extreme,Extreme,Surgical,Medicaid,,,,,false,258481.42,171786.75
New York City,Manhattan,7002001,001438,Bellevue Hospital Center,30 to 49,100,M,Other Race,Spanish/Hispanic,120 +,Emergency,Skilled Nursing Home,2019,NVS013,COMA; STUPOR; AND BRAIN DAMAGE,RES010,TRACHEOSTOMY,005,TRACHEOSTOMY W MV 96+ HOURS W/O EXTENSIVE PROCEDURE,01,DISEASES AND DISORDERS OF THE NERVOUS SYSTEM,4,Extreme,Extreme,Surgical,Medicare,Medicare,Medicaid,,,false,753944.97,501071.83
New York City,Manhattan,7002001,001438,Bellevue Hospital Center,30 to 49,113,M,Other Race,Not Span/Hispanic,44,Emergency,Home or Self Care,2019,RSP012,RESPIRATORY FAILURE; INSUFFICIENCY; ARREST,ESA003,MECHANICAL VENTILATION,005,TRACHEOSTOMY W MV 96+ HOURS W/O EXTENSIVE PROCEDURE,04,DISEASES AND DISORDERS OF THE RESPIRATORY SYSTEM,4,Extreme,Extreme,Surgical,Medicaid,Medicaid,,,,false,263560.7,175162.44
New York City,Manhattan,7002001,001438,Bellevue Hospital Center,70 or Older,114,F,Other Race,Not Span/Hispanic,36,Emergency,Hospice - Home,2019,NEO050,ENDOCRINE SYSTEM CANCERS - THYROID,RES010,TRACHEOSTOMY,005,TRACHEOSTOMY W MV 96+ HOURS W/O EXTENSIVE PROCEDURE,10,"ENDOCRINE, NUTRITIONAL AND METABOLIC DISEASES AND DISORDERS",4,Extreme,Extreme,Surgical,Private Health Insurance,,,,,false,230222.52,153005.89
New York City,Manhattan,7002001,001438,Bellevue Hospital Center,50 to 69,100,F,Other Race,Spanish/Hispanic,36,Emergency,Inpatient Rehabilitation Facility,2019,INJ008,"TRAUMATIC BRAIN INJURY (TBI); CONCUSSION, INITIAL ENCOUNTER",RES010,TRACHEOSTOMY,005,TRACHEOSTOMY W MV 96+ HOURS W/O EXTENSIVE PROCEDURE,01,DISEASES AND DISORDERS OF THE NERVOUS SYSTEM,4,Extreme,Extreme,Surgical,Medicare,Medicare,Medicaid,,,true,293962.38,195367.4
New York City,Manhattan,7002001,001438,Bellevue Hospital Center,50 to 69,104,F,Black/African American,Not Span/Hispanic,76,Urgent,Expired,2019,INF002,SEPTICEMIA,GIS017,GASTROSTOMY,005,TRACHEOSTOMY W MV 96+ HOURS W/O EXTENSIVE PROCEDURE,18,INFECTIOUS AND PARASITIC DISEASES (SYSTEMIC OR UNSPECIFIED SITES),4,Extreme,Extreme,Surgical,Medicare,Medicaid,,,,false,750746.8,498946.32
New York City,Manhattan,7002001,001438,Bellevue Hospital Center,70 or Older,113,M,Black/African American,Not Span/Hispanic,47,Urgent,Skilled Nursing Home,2019,GEN003,CHRONIC KIDNEY DISEASE,ESA003,MECHANICAL VENTILATION,005,TRACHEOSTOMY W MV 96+ HOURS W/O EXTENSIVE PROCEDURE,05,DISEASES AND DISORDERS OF THE CIRCULATORY SYSTEM,4,Extreme,Major,Surgical,Medicare,,,,,false,388726.61,258347.71
New York City,Manhattan,7002001,001438,Bellevue Hospital Center,30 to 49,112,F,Other Race,Spanish/Hispanic,52,Urgent,Skilled Nursing Home,2019,NVS013,COMA; STUPOR; AND BRAIN DAMAGE,RES010,TRACHEOSTOMY,005,TRACHEOSTOMY W MV 96+ HOURS W/O EXTENSIVE PROCEDURE,01,DISEASES AND DISORDERS OF THE NERVOUS SYSTEM,4,Extreme,Extreme,Surgical,Medicaid,,,,,false,469687.85,312154.55
New York City,Manhattan,7002001,001438,Bellevue Hospital Center,50 to 69,104,F,White,Not Span/Hispanic,39,Urgent,Expired,2019,NVS009,EPILEPSY; CONVULSIONS,RES007,AIRWAY INTUBATION,005,TRACHEOSTOMY W MV 96+ HOURS W/O EXTENSIVE PROCEDURE,01,DISEASES AND DISORDERS OF THE NERVOUS SYSTEM,4,Extreme,Extreme,Surgical,Medicaid,,,,,false,423578.73,281510.42
New York City,Manhattan,7002001,001438,Bellevue Hospital Center,50 to 69,100,M,Black/African American,Not Span/Hispanic,58,Urgent,Expired,2019,NEO022,RESPIRATORY CANCERS,RES007,AIRWAY INTUBATION,005,TRACHEOSTOMY W MV 96+ HOURS W/O EXTENSIVE PROCEDURE,04,DISEASES AND DISORDERS OF THE RESPIRATORY SYSTEM,4,Extreme,Extreme,Surgical,Medicaid,,,,,false,582015.56,386807.54
New York City,Manhattan,7002001,001438,Bellevue Hospital Center,50 to 69,114,M,Other Race,Not Span/Hispanic,17,Urgent,Inpatient Rehabilitation Facility,2019,CIR020,CEREBRAL INFARCTION,RES010,TRACHEOSTOMY,005,TRACHEOSTOMY W MV 96+ HOURS W/O EXTENSIVE PROCEDURE,01,DISEASES AND DISORDERS OF THE NERVOUS SYSTEM,4,Extreme,Major,Surgical,Medicare,,,,,false,197794.07,131453.94
New York City,Manhattan,7002001,001438,Bellevue Hospital Center,30 to 49,100,M,Black/African American,Not Span/Hispanic,59,Urgent,Skilled Nursing Home,2019,NVS009,EPILEPSY; CONVULSIONS,RES010,TRACHEOSTOMY,005,TRACHEOSTOMY W MV 96+ HOURS W/O EXTENSIVE PROCEDURE,01,DISEASES AND DISORDERS OF THE NERVOUS SYSTEM,4,Extreme,Extreme,Surgical,Private Health Insurance,,,,,false,471667.92,313470.5
New York City,Manhattan,7002001,001438,Bellevue Hospital Center,50 to 69,104,M,Black/African American,Not Span/Hispanic,42,Urgent,Home or Self Care,2019,INF002,SEPTICEMIA,RES010,TRACHEOSTOMY,005,TRACHEOSTOMY W MV 96+ HOURS W/O EXTENSIVE PROCEDURE,18,INFECTIOUS AND PARASITIC DISEASES (SYSTEMIC OR UNSPECIFIED SITES),4,Extreme,Extreme,Surgical,Medicare,,,,,false,530641.34,352664.23
New York City,Manhattan,7002001,001438,Bellevue Hospital Center,30 to 49,112,F,Black/African American,Not Span/Hispanic,40,Urgent,Expired,2019,INF002,SEPTICEMIA,ESA003,MECHANICAL VENTILATION,005,TRACHEOSTOMY W MV 96+ HOURS W/O EXTENSIVE PROCEDURE,18,INFECTIOUS AND PARASITIC DISEASES (SYSTEMIC OR UNSPECIFIED SITES),4,Extreme,Extreme,Surgical,Private Health Insurance,,,,,false,532377.26,353817.93
New York City,Manhattan,7002001,001438,Bellevue Hospital Center,18 to 29,,M,Other Race,Unknown,41,Emergency,Home w/ Home Health Services,2019,INJ004,"FRACTURE OF THE UPPER LIMB, INITIAL ENCOUNTER",RES010,TRACHEOSTOMY,005,TRACHEOSTOMY W MV 96+ HOURS W/O EXTENSIVE PROCEDURE,08,DISEASES AND DISORDERS OF THE MUSCULOSKELETAL SYSTEM AND CONNECTIVE TISSUE,4,Extreme,Extreme,Surgical,Private Health Insurance,Private Health Insurance,,,,true,396727.38,263665.02
New York City,Manhattan,7002001,001438,Bellevue Hospital Center,30 to 49,104,M,Black/African American,Unknown,33,Urgent,Home w/ Home Health Services,2019,INF002,SEPTICEMIA,RES010,TRACHEOSTOMY,005,TRACHEOSTOMY W MV 96+ HOURS W/O EXTENSIVE PROCEDURE,18,INFECTIOUS AND PARASITIC DISEASES (SYSTEMIC OR UNSPECIFIED SITES),4,Extreme,Extreme,Surgical,Medicaid,,,,,false,326383.95,216914.77
New York City,Manhattan,7002001,001438,Bellevue Hospital Center,30 to 49,112,F,White,Not Span/Hispanic,26,Urgent,Medicaid Cert Nursing Facility,2019,RSP012,RESPIRATORY FAILURE; INSUFFICIENCY; ARREST,RES010,TRACHEOSTOMY,005,TRACHEOSTOMY W MV 96+ HOURS W/O EXTENSIVE PROCEDURE,04,DISEASES AND DISORDERS OF THE RESPIRATORY SYSTEM,4,Extreme,Extreme,Surgical,Medicaid,,,,,false,365435.53,242868.45
New York City,Manhattan,7002001,001438,Bellevue Hospital Center,70 or Older,104,M,Black/African American,Unknown,83,Elective,Medicare Cert Long Term Care Hospital,2019,CIR009,ACUTE MYOCARDIAL INFARCTION,RES010,TRACHEOSTOMY,005,TRACHEOSTOMY W MV 96+ HOURS W/O EXTENSIVE PROCEDURE,05,DISEASES AND DISORDERS OF THE CIRCULATORY SYSTEM,4,Extreme,Extreme,Surgical,Medicare,,,,,false,887932.1,590119.67
