Hospital Service Area,Hospital County,Operating Certificate Number,Permanent Facility Id,Facility Name,Age Group,Zip Code - 3 digits,Gender,Race,Ethnicity,Length of Stay,Type of Admission,Patient Disposition,Discharge Year,CCS Diagnosis Code,CCS Diagnosis Description,CCS Procedure Code,CCS Procedure Description,APR DRG Code,APR DRG Description,APR MDC Code,APR MDC Description,APR Severity of Illness Code,APR Severity of Illness Description,APR Risk of Mortality,APR Medical Surgical Description,Payment Typology 1,Payment Typology 2,Payment Typology 3,Birth Weight,Abortion Edit Indicator,Emergency Department Indicator,Total Charges,Total Costs
Long Island,Nassau,2908000,000511,NYU Langone Hospital-Long Island,70 or Older,117,M,White,Not Span/Hispanic,40,Emergency,Skilled Nursing Home,2019,NVS018,MYOPATHIES,RES010,TRACHEOSTOMY,005,TRACHEOSTOMY W MV 96+ HOURS W/O EXTENSIVE PROCEDURE,01,DISEASES AND DISORDERS OF THE NERVOUS SYSTEM,4,Extreme,Extreme,Surgical,Medicare,Medicare,,,,true,1073418.77,173700.59
Long Island,Nassau,2908000,000511,NYU Langone Hospital-Long Island,50 to 69,117,M,White,Not Span/Hispanic,59,Emergency,Skilled Nursing Home,2019,NVS002,ENCEPHALITIS,RES010,TRACHEOSTOMY,005,TRACHEOSTOMY W MV 96+ HOURS W/O EXTENSIVE PROCEDURE,01,DISEASES AND DISORDERS OF THE NERVOUS SYSTEM,4,Extreme,Extreme,Surgical,Private Health Insurance,Medicare,,,,true,1180918.09,187546.43
Long Island,Nassau,2908000,000511,NYU Langone Hospital-Long Island,18 to 29,115,M,Other Race,Not Span/Hispanic,35,Emergency,Short-term Hospital,2019,RSP009,ASTHMA,RES010,TRACHEOSTOMY,005,TRACHEOSTOMY W MV 96+ HOURS W/O EXTENSIVE PROCEDURE,04,DISEASES AND DISORDERS OF THE RESPIRATORY SYSTEM,4,Extreme,Extreme,Surgical,Federal/State/Local/VA,,,,,true,2974772.93,335576.85
Long Island,Nassau,2908000,000511,NYU Langone Hospital-Long Island,50 to 69,115,F,White,Not Span/Hispanic,29,Emergency,Skilled Nursing Home,2019,INF002,SEPTICEMIA,RES010,TRACHEOSTOMY,005,TRACHEOSTOMY W MV 96+ HOURS W/O EXTENSIVE PROCEDURE,18,INFECTIOUS AND PARASITIC DISEASES (SYSTEMIC OR UNSPECIFIED SITES),4,Extreme,Major,Surgical,Medicare,Medicare,Private Health Insurance,,,true,803804.01,111392.65
Long Island,Nassau,2908000,000511,NYU Langone Hospital-Long Island,30 to 49,,F,Black/African American,Not Span/Hispanic,60,Emergency,Inpatient Rehabilitation Facility,2019,INF006,HIV INFECTION,RES010,TRACHEOSTOMY,005,TRACHEOSTOMY W MV 96+ HOURS W/O EXTENSIVE PROCEDURE,24,MULTIPLE SIGNIFICANT TRAUMA,4,Extreme,Major,Surgical,Medicaid,Medicaid,,,,true,1301179.93,215215.11
Long Island,Nassau,2908000,000511,NYU Langone Hospital-Long Island,18 to 29,115,M,Black/African American,Not Span/Hispanic,53,Urgent,Home or Self Care,2019,NVS002,ENCEPHALITIS,RES010,TRACHEOSTOMY,005,TRACHEOSTOMY W MV 96+ HOURS W/O EXTENSIVE PROCEDURE,01,DISEASES AND DISORDERS OF THE NERVOUS SYSTEM,4,Extreme,Extreme,Surgical,Private Health Insurance,Medicaid,,,,false,1557952.54,214494.93
Long Island,Nassau,2908000,000511,NYU Langone Hospital-Long Island,50 to 69,115,M,White,Spanish/Hispanic,20,Emergency,Skilled Nursing Home,2019,INF002,SEPTICEMIA,CAR024,VENOUS AND ARTERIAL CATHETER PLACEMENT,005,TRACHEOSTOMY W MV 96+ HOURS W/O EXTENSIVE PROCEDURE,18,INFECTIOUS AND PARASITIC DISEASES (SYSTEMIC OR UNSPECIFIED SITES),4,Extreme,Extreme,Surgical,Medicare,Medicaid,Medicare,,,true,443598.23,77053.11
Long Island,Nassau,2908000,000511,NYU Langone Hospital-Long Island,70 or Older,117,F,Other Race,Unknown,31,Emergency,Skilled Nursing Home,2019,CIR022,SEQUELA OF HEMORRHAGIC CEREBROVASCULAR DISEASE,RES010,TRACHEOSTOMY,005,TRACHEOSTOMY W MV 96+ HOURS W/O EXTENSIVE PROCEDURE,01,DISEASES AND DISORDERS OF THE NERVOUS SYSTEM,4,Extreme,Extreme,Surgical,Medicare,Medicare,Private Health Insurance,,,true,898381.38,122885.7
Long Island,Nassau,2908000,000511,NYU Langone Hospital-Long Island,70 or Older,115,F,White,Not Span/Hispanic,32,Emergency,Skilled Nursing Home,2019,NVS009,EPILEPSY; CONVULSIONS,ESA003,MECHANICAL VENTILATION,005,TRACHEOSTOMY W MV 96+ HOURS W/O EXTENSIVE PROCEDURE,01,DISEASES AND DISORDERS OF THE NERVOUS SYSTEM,4,Extreme,Extreme,Surgical,Medicare,Medicare,Medicaid,,,true,1125489.9,145911.98
Long Island,Nassau,2908000,000511,NYU Langone Hospital-Long Island,18 to 29,110,F,Black/African American,Not Span/Hispanic,37,Elective,Skilled Nursing Home,2019,NVS009,EPILEPSY; CONVULSIONS,RES010,TRACHEOSTOMY,005,TRACHEOSTOMY W MV 96+ HOURS W/O EXTENSIVE PROCEDURE,01,DISEASES AND DISORDERS OF THE NERVOUS SYSTEM,4,Extreme,Extreme,Surgical,Private Health Insurance,,,,,true,1089057.18,129693.93
Long Island,Nassau,2908000,000511,NYU Langone Hospital-Long Island,70 or Older,,F,White,Not Span/Hispanic,38,Emergency,Hospice - Medical Facility,2019,RSP002,PNEUMONIA (EXCEPT THAT CAUSED BY TUBERCULOSIS),RES010,TRACHEOSTOMY,005,TRACHEOSTOMY W MV 96+ HOURS W/O EXTENSIVE PROCEDURE,04,DISEASES AND DISORDERS OF THE RESPIRATORY SYSTEM,4,Extreme,Extreme,Surgical,Medicare,Miscellaneous/Other,,,,true,617222.1,105874.99
