Hospital Service Area,Hospital County,Operating Certificate Number,Permanent Facility Id,Facility Name,Age Group,Zip Code - 3 digits,Gender,Race,Ethnicity,Length of Stay,Type of Admission,Patient Disposition,Discharge Year,CCS Diagnosis Code,CCS Diagnosis Description,CCS Procedure Code,CCS Procedure Description,APR DRG Code,APR DRG Description,APR MDC Code,APR MDC Description,APR Severity of Illness Code,APR Severity of Illness Description,APR Risk of Mortality,APR Medical Surgical Description,Payment Typology 1,Payment Typology 2,Payment Typology 3,Birth Weight,Abortion Edit Indicator,Emergency Department Indicator,Total Charges,Total Costs
New York City,Kings,7002053,001304,NYU Langone Hospital-Brooklyn,50 to 69,112,M,Black/African American,Not Span/Hispanic,47,Emergency,Skilled Nursing Home,2020,NVS020,OTHER SPECIFIED NERVOUS SYSTEM DISORDERS,RES010,TRACHEOSTOMY,005,TRACHEOSTOMY W MV 96+ HOURS W/O EXTENSIVE PROCEDURE,01,DISEASES AND DISORDERS OF THE NERVOUS SYSTEM,3,Major,Major,Surgical,Medicaid,,,,,Y,1557616.29,403360.61
New York City,Kings,7002053,001304,NYU Langone Hospital-Brooklyn,30 to 49,112,M,Other Race,Not Span/Hispanic,21,Emergency,Medicare Cert Long Term Care Hospital,2020,NVS002,ENCEPHALITIS,RES010,TRACHEOSTOMY,005,TRACHEOSTOMY W MV 96+ HOURS W/O EXTENSIVE PROCEDURE,01,DISEASES AND DISORDERS OF THE NERVOUS SYSTEM,3,Major,Extreme,Surgical,Medicaid,,,,,Y,931534.09,201686.76
New York City,Kings,7002053,001304,NYU Langone Hospital-Brooklyn,70 or Older,112,M,White,Not Span/Hispanic,22,Emergency,Expired,2020,RSP008,CHRONIC OBSTRUCTIVE PULMONARY DISEASE AND BRONCHIECTASIS,RES010,TRACHEOSTOMY,005,TRACHEOSTOMY W MV 96+ HOURS W/O EXTENSIVE PROCEDURE,04,DISEASES AND DISORDERS OF THE RESPIRATORY SYSTEM,4,Extreme,Extreme,Surgical,Medicare,,,,,Y,578490.66,161321.39
New York City,Kings,7002053,001304,NYU Langone Hospital-Brooklyn,30 to 49,112,M,Multi-racial,Spanish/Hispanic,24,Emergency,Skilled Nursing Home,2020,RSP009,ASTHMA,ESA003,MECHANICAL VENTILATION,005,TRACHEOSTOMY W MV 96+ HOURS W/O EXTENSIVE PROCEDURE,04,DISEASES AND DISORDERS OF THE RESPIRATORY SYSTEM,4,Extreme,Extreme,Surgical,Medicaid,,,,,Y,619779.75,173295.06
New York City,Kings,7002053,001304,NYU Langone Hospital-Brooklyn,50 to 69,112,M,Black/African American,Not Span/Hispanic,52,Emergency,Medicare Cert Long Term Care Hospital,2020,NVS020,OTHER SPECIFIED NERVOUS SYSTEM DISORDERS,ESA003,MECHANICAL VENTILATION,005,TRACHEOSTOMY W MV 96+ HOURS W/O EXTENSIVE PROCEDURE,01,DISEASES AND DISORDERS OF THE NERVOUS SYSTEM,4,Extreme,Major,Surgical,Blue Cross/Blue Shield,,,,,Y,1970966.5,477472.59
New York City,Kings,7002053,001304,NYU Langone Hospital-Brooklyn,70 or Older,112,F,White,Not Span/Hispanic,46,Emergency,Skilled Nursing Home,2020,INF002,SEPTICEMIA,RES010,TRACHEOSTOMY,005,TRACHEOSTOMY W MV 96+ HOURS W/O EXTENSIVE PROCEDURE,18,INFECTIOUS AND PARASITIC DISEASES (SYSTEMIC OR UNSPECIFIED SITES),4,Extreme,Extreme,Surgical,Medicare,,,,,Y,1199819.31,320152.1
New York City,Kings,7002053,001304,NYU Langone Hospital-Brooklyn,70 or Older,112,F,White,Not Span/Hispanic,20,Emergency,Medicare Cert Long Term Care Hospital,2020,CIR020,CEREBRAL INFARCTION,RES010,TRACHEOSTOMY,005,TRACHEOSTOMY W MV 96+ HOURS W/O EXTENSIVE PROCEDURE,01,DISEASES AND DISORDERS OF THE NERVOUS SYSTEM,4,Extreme,Major,Surgical,Medicare,Private Health Insurance,,,,Y,512676.17,158710.74
New York City,Kings,7002053,001304,NYU Langone Hospital-Brooklyn,70 or Older,112,F,White,Not Span/Hispanic,18,Emergency,Medicare Cert Long Term Care Hospital,2020,INF002,SEPTICEMIA,RES010,TRACHEOSTOMY,005,TRACHEOSTOMY W MV 96+ HOURS W/O EXTENSIVE PROCEDURE,18,INFECTIOUS AND PARASITIC DISEASES (SYSTEMIC OR UNSPECIFIED SITES),3,Major,Major,Surgical,Medicare,Medicaid,,,,Y,668392.23,146843.77
New York City,Kings,7002053,001304,NYU Langone Hospital-Brooklyn,50 to 69,112,M,Other Race,Not Span/Hispanic,37,Emergency,Medicare Cert Long Term Care Hospital,2020,NVS015,POLYNEUROPATHIES,RES010,TRACHEOSTOMY,005,TRACHEOSTOMY W MV 96+ HOURS W/O EXTENSIVE PROCEDURE,01,DISEASES AND DISORDERS OF THE NERVOUS SYSTEM,4,Extreme,Extreme,Surgical,Private Health Insurance,,,,,Y,1115649.66,295252.14
New York City,Kings,7002053,001304,NYU Langone Hospital-Brooklyn,50 to 69,112,M,Black/African American,Not Span/Hispanic,20,Emergency,Home or Self Care,2020,RSP006,OTHER SPECIFIED UPPER RESPIRATORY INFECTIONS,RES010,TRACHEOSTOMY,005,TRACHEOSTOMY W MV 96+ HOURS W/O EXTENSIVE PROCEDURE,03,"DISEASES AND DISORDERS OF THE EAR, NOSE, MOUTH AND THROAT",3,Major,Major,Surgical,Private Health Insurance,,,,,Y,392765.04,120509.33
New York City,Kings,7002053,001304,NYU Langone Hospital-Brooklyn,50 to 69,112,F,White,Not Span/Hispanic,25,Emergency,Medicare Cert Long Term Care Hospital,2020,INF002,SEPTICEMIA,ESA003,MECHANICAL VENTILATION,005,TRACHEOSTOMY W MV 96+ HOURS W/O EXTENSIVE PROCEDURE,18,INFECTIOUS AND PARASITIC DISEASES (SYSTEMIC OR UNSPECIFIED SITES),4,Extreme,Extreme,Surgical,Medicare,Blue Cross/Blue Shield,,,,Y,593548.7,158568.26
New York City,Kings,7002053,001304,NYU Langone Hospital-Brooklyn,50 to 69,112,M,Other Race,Spanish/Hispanic,26,Emergency,Hospice - Medical Facility,2020,INF012,CORONAVIRUS DISEASE 2019 (COVID-19),RES010,TRACHEOSTOMY,005,TRACHEOSTOMY W MV 96+ HOURS W/O EXTENSIVE PROCEDURE,04,DISEASES AND DISORDERS OF THE RESPIRATORY SYSTEM,4,Extreme,Extreme,Surgical,Medicaid,,,,,Y,557557.09,161706.65
New York City,Kings,7002053,001304,NYU Langone Hospital-Brooklyn,70 or Older,112,M,White,Not Span/Hispanic,35,Emergency,Skilled Nursing Home,2020,INF012,CORONAVIRUS DISEASE 2019 (COVID-19),RES010,TRACHEOSTOMY,005,TRACHEOSTOMY W MV 96+ HOURS W/O EXTENSIVE PROCEDURE,04,DISEASES AND DISORDERS OF THE RESPIRATORY SYSTEM,4,Extreme,Extreme,Surgical,Medicare,,,,,Y,624464.74,200653.79
New York City,Kings,7002053,001304,NYU Langone Hospital-Brooklyn,70 or Older,112,F,Other Race,Spanish/Hispanic,32,Emergency,Expired,2020,INF002,SEPTICEMIA,RES010,TRACHEOSTOMY,005,TRACHEOSTOMY W MV 96+ HOURS W/O EXTENSIVE PROCEDURE,18,INFECTIOUS AND PARASITIC DISEASES (SYSTEMIC OR UNSPECIFIED SITES),4,Extreme,Extreme,Surgical,Medicare,Medicaid,,,,Y,718374.11,201153.56
New York City,Kings,7002053,001304,NYU Langone Hospital-Brooklyn,70 or Older,112,M,White,Not Span/Hispanic,28,Emergency,Hospice - Medical Facility,2020,INF002,SEPTICEMIA,RES010,TRACHEOSTOMY,005,TRACHEOSTOMY W MV 96+ HOURS W/O EXTENSIVE PROCEDURE,18,INFECTIOUS AND PARASITIC DISEASES (SYSTEMIC OR UNSPECIFIED SITES),4,Extreme,Extreme,Surgical,Medicare,Medicaid,,,,Y,548069.11,180925.31
New York City,Kings,7002053,001304,NYU Langone Hospital-Brooklyn,30 to 49,112,M,Other Race,Spanish/Hispanic,46,Emergency,Inpatient Rehabilitation Facility,2020,INF002,SEPTICEMIA,ESA003,MECHANICAL VENTILATION,005,TRACHEOSTOMY W MV 96+ HOURS W/O EXTENSIVE PROCEDURE,18,INFECTIOUS AND PARASITIC DISEASES (SYSTEMIC OR UNSPECIFIED SITES),4,Extreme,Extreme,Surgical,Medicaid,,,,,Y,1069955.06,330237.74
New York City,Kings,7002053,001304,NYU Langone Hospital-Brooklyn,30 to 49,112,F,Other Race,Not Span/Hispanic,46,Emergency,Inpatient Rehabilitation Facility,2020,INF002,SEPTICEMIA,CAR024,VENOUS AND ARTERIAL CATHETER PLACEMENT,005,TRACHEOSTOMY W MV 96+ HOURS W/O EXTENSIVE PROCEDURE,18,INFECTIOUS AND PARASITIC DISEASES (SYSTEMIC OR UNSPECIFIED SITES),4,Extreme,Major,Surgical,Medicaid,,,,,Y,1084424.86,339638.3
New York City,Kings,7002053,001304,NYU Langone Hospital-Brooklyn,50 to 69,112,M,Other Race,Not Span/Hispanic,33,Emergency,Skilled Nursing Home,2020,INF002,SEPTICEMIA,RES010,TRACHEOSTOMY,005,TRACHEOSTOMY W MV 96+ HOURS W/O EXTENSIVE PROCEDURE,18,INFECTIOUS AND PARASITIC DISEASES (SYSTEMIC OR UNSPECIFIED SITES),4,Extreme,Extreme,Surgical,Blue Cross/Blue Shield,,,,,Y,554152.15,171130.64
New York City,Kings,7002053,001304,NYU Langone Hospital-Brooklyn,70 or Older,112,F,Other Race,Spanish/Hispanic,44,Emergency,Medicare Cert Long Term Care Hospital,2020,INF002,SEPTICEMIA,RES010,TRACHEOSTOMY,005,TRACHEOSTOMY W MV 96+ HOURS W/O EXTENSIVE PROCEDURE,18,INFECTIOUS AND PARASITIC DISEASES (SYSTEMIC OR UNSPECIFIED SITES),4,Extreme,Extreme,Surgical,Medicare,Medicaid,,,,Y,962094.77,319506.69
New York City,Kings,7002053,001304,NYU Langone Hospital-Brooklyn,70 or Older,112,M,Other Race,Unknown,41,Emergency,Skilled Nursing Home,2020,CIR019,HEART FAILURE,ESA003,MECHANICAL VENTILATION,005,TRACHEOSTOMY W MV 96+ HOURS W/O EXTENSIVE PROCEDURE,05,DISEASES AND DISORDERS OF THE CIRCULATORY SYSTEM,4,Extreme,Major,Surgical,Medicaid,,,,,Y,1097165.99,305804.54
New York City,Kings,7002053,001304,NYU Langone Hospital-Brooklyn,18 to 29,112,M,Other Race,Not Span/Hispanic,51,Emergency,Skilled Nursing Home,2020,INF002,SEPTICEMIA,RES010,TRACHEOSTOMY,005,TRACHEOSTOMY W MV 96+ HOURS W/O EXTENSIVE PROCEDURE,18,INFECTIOUS AND PARASITIC DISEASES (SYSTEMIC OR UNSPECIFIED SITES),4,Extreme,Extreme,Surgical,Medicaid,,,,,Y,980679.41,251822.85
New York City,Kings,7002053,001304,NYU Langone Hospital-Brooklyn,50 to 69,112,M,White,Not Span/Hispanic,60,Emergency,Medicare Cert Long Term Care Hospital,2020,INF002,SEPTICEMIA,RES010,TRACHEOSTOMY,005,TRACHEOSTOMY W MV 96+ HOURS W/O EXTENSIVE PROCEDURE,18,INFECTIOUS AND PARASITIC DISEASES (SYSTEMIC OR UNSPECIFIED SITES),4,Extreme,Extreme,Surgical,Blue Cross/Blue Shield,,,,,Y,1335439.76,395689.84
New York City,Kings,7002053,001304,NYU Langone Hospital-Brooklyn,70 or Older,112,M,Other Race,Spanish/Hispanic,33,Emergency,Skilled Nursing Home,2020,INF002,SEPTICEMIA,RES010,TRACHEOSTOMY,005,TRACHEOSTOMY W MV 96+ HOURS W/O EXTENSIVE PROCEDURE,18,INFECTIOUS AND PARASITIC DISEASES (SYSTEMIC OR UNSPECIFIED SITES),4,Extreme,Extreme,Surgical,Medicare,Medicaid,,,,Y,802472.63,233803.84
New York City,Kings,7002053,001304,NYU Langone Hospital-Brooklyn,30 to 49,112,M,Other Race,Spanish/Hispanic,72,Emergency,Skilled Nursing Home,2020,INF002,SEPTICEMIA,ESA003,MECHANICAL VENTILATION,005,TRACHEOSTOMY W MV 96+ HOURS W/O EXTENSIVE PROCEDURE,18,INFECTIOUS AND PARASITIC DISEASES (SYSTEMIC OR UNSPECIFIED SITES),4,Extreme,Extreme,Surgical,Medicaid,,,,,Y,2198423.87,575300.05
New York City,Kings,7002053,001304,NYU Langone Hospital-Brooklyn,70 or Older,112,F,White,Not Span/Hispanic,33,Emergency,Expired,2020,INF002,SEPTICEMIA,RES010,TRACHEOSTOMY,005,TRACHEOSTOMY W MV 96+ HOURS W/O EXTENSIVE PROCEDURE,18,INFECTIOUS AND PARASITIC DISEASES (SYSTEMIC OR UNSPECIFIED SITES),4,Extreme,Extreme,Surgical,Medicare,Medicaid,,,,Y,903640.35,258257.97
New York City,Kings,7002053,001304,NYU Langone Hospital-Brooklyn,50 to 69,112,M,Other Race,Not Span/Hispanic,25,Emergency,Medicare Cert Long Term Care Hospital,2020,CIR009,ACUTE MYOCARDIAL INFARCTION,RES010,TRACHEOSTOMY,005,TRACHEOSTOMY W MV 96+ HOURS W/O EXTENSIVE PROCEDURE,05,DISEASES AND DISORDERS OF THE CIRCULATORY SYSTEM,4,Extreme,Extreme,Surgical,Medicare,,,,,Y,705558.4,217899.39
New York City,Kings,7002053,001304,NYU Langone Hospital-Brooklyn,70 or Older,112,F,Other Race,Spanish/Hispanic,42,Emergency,Medicare Cert Long Term Care Hospital,2020,INF002,SEPTICEMIA,RES010,TRACHEOSTOMY,005,TRACHEOSTOMY W MV 96+ HOURS W/O EXTENSIVE PROCEDURE,18,INFECTIOUS AND PARASITIC DISEASES (SYSTEMIC OR UNSPECIFIED SITES),4,Extreme,Extreme,Surgical,Medicare,Medicaid,,,,Y,1031963.37,288617.15
New York City,Kings,7002053,001304,NYU Langone Hospital-Brooklyn,50 to 69,112,M,Other Race,Not Span/Hispanic,21,Emergency,Medicare Cert Long Term Care Hospital,2020,CIR020,CEREBRAL INFARCTION,RES010,TRACHEOSTOMY,005,TRACHEOSTOMY W MV 96+ HOURS W/O EXTENSIVE PROCEDURE,01,DISEASES AND DISORDERS OF THE NERVOUS SYSTEM,4,Extreme,Extreme,Surgical,Medicaid,,,,,Y,973819.67,197900.23
New York City,Kings,7002053,001304,NYU Langone Hospital-Brooklyn,50 to 69,112,M,Other Race,Unknown,52,Emergency,Skilled Nursing Home,2020,INF002,SEPTICEMIA,RES010,TRACHEOSTOMY,005,TRACHEOSTOMY W MV 96+ HOURS W/O EXTENSIVE PROCEDURE,18,INFECTIOUS AND PARASITIC DISEASES (SYSTEMIC OR UNSPECIFIED SITES),4,Extreme,Extreme,Surgical,Medicaid,,,,,Y,1182052.11,303061.05
New York City,Kings,7002053,001304,NYU Langone Hospital-Brooklyn,50 to 69,112,M,Other Race,Spanish/Hispanic,24,Emergency,Home w/ Home Health Services,2020,DIG020,PANCREATIC DISORDERS (EXCLUDING DIABETES),RES010,TRACHEOSTOMY,005,TRACHEOSTOMY W MV 96+ HOURS W/O EXTENSIVE PROCEDURE,07,DISEASES AND DISORDERS OF THE HEPATOBILIARY SYSTEM AND PANCREAS,4,Extreme,Major,Surgical,Medicaid,,,,,Y,588012.27,187516.73
New York City,Kings,7002053,001304,NYU Langone Hospital-Brooklyn,70 or Older,OOS,M,Other Race,Not Span/Hispanic,16,Emergency,Skilled Nursing Home,2020,CIR020,CEREBRAL INFARCTION,CAR008,ANGIOPLASTY AND RELATED VESSEL PROCEDURES (ENDOVASCULAR; EXCLUDING CAROTID),005,TRACHEOSTOMY W MV 96+ HOURS W/O EXTENSIVE PROCEDURE,01,DISEASES AND DISORDERS OF THE NERVOUS SYSTEM,4,Extreme,Extreme,Surgical,Medicare,,,,,Y,748977.81,169889.06
New York City,Kings,7002053,001304,NYU Langone Hospital-Brooklyn,50 to 69,112,M,Other Race,Not Span/Hispanic,35,Emergency,Inpatient Rehabilitation Facility,2020,DIG020,PANCREATIC DISORDERS (EXCLUDING DIABETES),RES010,TRACHEOSTOMY,005,TRACHEOSTOMY W MV 96+ HOURS W/O EXTENSIVE PROCEDURE,07,DISEASES AND DISORDERS OF THE HEPATOBILIARY SYSTEM AND PANCREAS,4,Extreme,Extreme,Surgical,Medicaid,,,,,Y,1066140.52,292501.5
New York City,Kings,7002053,001304,NYU Langone Hospital-Brooklyn,70 or Older,112,M,White,Not Span/Hispanic,13,Emergency,Medicare Cert Long Term Care Hospital,2020,INJ008,"TRAUMATIC BRAIN INJURY (TBI); CONCUSSION, INITIAL ENCOUNTER",RES010,TRACHEOSTOMY,005,TRACHEOSTOMY W MV 96+ HOURS W/O EXTENSIVE PROCEDURE,01,DISEASES AND DISORDERS OF THE NERVOUS SYSTEM,3,Major,Major,Surgical,Medicare,,,,,Y,434914.55,58986.3
New York City,Kings,7002053,001304,NYU Langone Hospital-Brooklyn,70 or Older,112,F,White,Not Span/Hispanic,23,Emergency,Medicare Cert Long Term Care Hospital,2020,NVS009,EPILEPSY; CONVULSIONS,RES010,TRACHEOSTOMY,005,TRACHEOSTOMY W MV 96+ HOURS W/O EXTENSIVE PROCEDURE,01,DISEASES AND DISORDERS OF THE NERVOUS SYSTEM,4,Extreme,Extreme,Surgical,Medicare,Medicaid,,,,Y,995989.41,215792.86
New York City,Kings,7002053,001304,NYU Langone Hospital-Brooklyn,70 or Older,112,M,Other Race,Not Span/Hispanic,21,Emergency,Medicare Cert Long Term Care Hospital,2020,DIG020,PANCREATIC DISORDERS (EXCLUDING DIABETES),RES010,TRACHEOSTOMY,005,TRACHEOSTOMY W MV 96+ HOURS W/O EXTENSIVE PROCEDURE,07,DISEASES AND DISORDERS OF THE HEPATOBILIARY SYSTEM AND PANCREAS,3,Major,Major,Surgical,Medicare,,,,,Y,605300.44,184592.43
New York City,Kings,7002053,001304,NYU Langone Hospital-Brooklyn,50 to 69,112,M,White,Not Span/Hispanic,24,Emergency,Skilled Nursing Home,2020,RSP012,RESPIRATORY FAILURE; INSUFFICIENCY; ARREST,RES010,TRACHEOSTOMY,005,TRACHEOSTOMY W MV 96+ HOURS W/O EXTENSIVE PROCEDURE,04,DISEASES AND DISORDERS OF THE RESPIRATORY SYSTEM,4,Extreme,Extreme,Surgical,Medicare,Private Health Insurance,,,,Y,660254.59,194457.21
New York City,Kings,7002053,001304,NYU Langone Hospital-Brooklyn,50 to 69,112,F,Other Race,Not Span/Hispanic,36,Emergency,Medicare Cert Long Term Care Hospital,2020,INF012,CORONAVIRUS DISEASE 2019 (COVID-19),ESA003,MECHANICAL VENTILATION,005,TRACHEOSTOMY W MV 96+ HOURS W/O EXTENSIVE PROCEDURE,04,DISEASES AND DISORDERS OF THE RESPIRATORY SYSTEM,4,Extreme,Extreme,Surgical,Medicare,,,,,Y,1128517.63,310055.7
New York City,Kings,7002053,001304,NYU Langone Hospital-Brooklyn,50 to 69,112,F,Black/African American,Not Span/Hispanic,15,Emergency,Medicare Cert Long Term Care Hospital,2020,INJ008,"TRAUMATIC BRAIN INJURY (TBI); CONCUSSION, INITIAL ENCOUNTER",RES010,TRACHEOSTOMY,005,TRACHEOSTOMY W MV 96+ HOURS W/O EXTENSIVE PROCEDURE,01,DISEASES AND DISORDERS OF THE NERVOUS SYSTEM,4,Extreme,Extreme,Surgical,Medicare,Blue Cross/Blue Shield,,,,Y,616005.88,76598.79
New York City,Kings,7002053,001304,NYU Langone Hospital-Brooklyn,70 or Older,112,F,White,Not Span/Hispanic,16,Emergency,Medicare Cert Long Term Care Hospital,2020,INF002,SEPTICEMIA,RES010,TRACHEOSTOMY,005,TRACHEOSTOMY W MV 96+ HOURS W/O EXTENSIVE PROCEDURE,18,INFECTIOUS AND PARASITIC DISEASES (SYSTEMIC OR UNSPECIFIED SITES),4,Extreme,Extreme,Surgical,Medicare,Medicaid,,,,Y,483149.55,147231.94
New York City,Kings,7002053,001304,NYU Langone Hospital-Brooklyn,70 or Older,112,M,Black/African American,Not Span/Hispanic,25,Emergency,Skilled Nursing Home,2020,INJ008,"TRAUMATIC BRAIN INJURY (TBI); CONCUSSION, INITIAL ENCOUNTER",RES010,TRACHEOSTOMY,005,TRACHEOSTOMY W MV 96+ HOURS W/O EXTENSIVE PROCEDURE,01,DISEASES AND DISORDERS OF THE NERVOUS SYSTEM,4,Extreme,Major,Surgical,Medicare,,,,,Y,710067.97,183851.22
New York City,Kings,7002053,001304,NYU Langone Hospital-Brooklyn,70 or Older,OOS,F,Other Race,Not Span/Hispanic,19,Emergency,Skilled Nursing Home,2020,CIR020,CEREBRAL INFARCTION,RES010,TRACHEOSTOMY,005,TRACHEOSTOMY W MV 96+ HOURS W/O EXTENSIVE PROCEDURE,01,DISEASES AND DISORDERS OF THE NERVOUS SYSTEM,4,Extreme,Major,Surgical,Medicaid,Medicare,,,,Y,703344.51,180726.53
New York City,Kings,7002053,001304,NYU Langone Hospital-Brooklyn,70 or Older,112,M,Other Race,Unknown,25,Emergency,Medicare Cert Long Term Care Hospital,2020,INF002,SEPTICEMIA,ADM015,ADMINISTRATION OF ANTIBIOTICS,005,TRACHEOSTOMY W MV 96+ HOURS W/O EXTENSIVE PROCEDURE,18,INFECTIOUS AND PARASITIC DISEASES (SYSTEMIC OR UNSPECIFIED SITES),4,Extreme,Extreme,Surgical,Medicare,Medicaid,,,,Y,933205.36,265312.1
New York City,Kings,7002053,001304,NYU Langone Hospital-Brooklyn,30 to 49,112,M,Other Race,Spanish/Hispanic,40,Emergency,Expired,2020,INF002,SEPTICEMIA,RES010,TRACHEOSTOMY,005,TRACHEOSTOMY W MV 96+ HOURS W/O EXTENSIVE PROCEDURE,18,INFECTIOUS AND PARASITIC DISEASES (SYSTEMIC OR UNSPECIFIED SITES),4,Extreme,Extreme,Surgical,Medicaid,,,,,Y,1066166.8,323918.6
New York City,Kings,7002053,001304,NYU Langone Hospital-Brooklyn,30 to 49,112,M,White,Spanish/Hispanic,32,Emergency,Expired,2020,INF002,SEPTICEMIA,RES010,TRACHEOSTOMY,005,TRACHEOSTOMY W MV 96+ HOURS W/O EXTENSIVE PROCEDURE,18,INFECTIOUS AND PARASITIC DISEASES (SYSTEMIC OR UNSPECIFIED SITES),4,Extreme,Extreme,Surgical,Medicaid,,,,,Y,842924.24,254805.94
New York City,Kings,7002053,001304,NYU Langone Hospital-Brooklyn,70 or Older,112,M,Other Race,Not Span/Hispanic,38,Emergency,Expired,2020,INF002,SEPTICEMIA,RES010,TRACHEOSTOMY,005,TRACHEOSTOMY W MV 96+ HOURS W/O EXTENSIVE PROCEDURE,18,INFECTIOUS AND PARASITIC DISEASES (SYSTEMIC OR UNSPECIFIED SITES),4,Extreme,Extreme,Surgical,Medicare,Medicaid,,,,Y,1018659.4,294816.93
New York City,Kings,7002053,001304,NYU Langone Hospital-Brooklyn,30 to 49,112,M,Other Race,Not Span/Hispanic,21,Emergency,Expired,2020,INF012,CORONAVIRUS DISEASE 2019 (COVID-19),OTR004,ISOLATION PROCEDURES,005,TRACHEOSTOMY W MV 96+ HOURS W/O EXTENSIVE PROCEDURE,04,DISEASES AND DISORDERS OF THE RESPIRATORY SYSTEM,4,Extreme,Extreme,Surgical,Self-Pay,,,,,Y,624795.19,171897.76
New York City,Kings,7002053,001304,NYU Langone Hospital-Brooklyn,50 to 69,112,M,White,Spanish/Hispanic,23,Emergency,Expired,2020,INF002,SEPTICEMIA,RES010,TRACHEOSTOMY,005,TRACHEOSTOMY W MV 96+ HOURS W/O EXTENSIVE PROCEDURE,18,INFECTIOUS AND PARASITIC DISEASES (SYSTEMIC OR UNSPECIFIED SITES),4,Extreme,Extreme,Surgical,Medicaid,,,,,Y,614357.58,181563.89
New York City,Kings,7002053,001304,NYU Langone Hospital-Brooklyn,30 to 49,112,M,Other Race,Spanish/Hispanic,120 +,Emergency,Expired,2020,INF002,SEPTICEMIA,ESA002,EXTRACORPOREAL MEMBRANE OXYGENATION,005,TRACHEOSTOMY W MV 96+ HOURS W/O EXTENSIVE PROCEDURE,18,INFECTIOUS AND PARASITIC DISEASES (SYSTEMIC OR UNSPECIFIED SITES),4,Extreme,Extreme,Surgical,Medicaid,,,,,Y,7949593.84,1602417.8
New York City,Kings,7002053,001304,NYU Langone Hospital-Brooklyn,70 or Older,112,F,Other Race,Not Span/Hispanic,17,Emergency,Expired,2020,INF002,SEPTICEMIA,RES010,TRACHEOSTOMY,005,TRACHEOSTOMY W MV 96+ HOURS W/O EXTENSIVE PROCEDURE,18,INFECTIOUS AND PARASITIC DISEASES (SYSTEMIC OR UNSPECIFIED SITES),4,Extreme,Extreme,Surgical,Medicare,Medicaid,,,,Y,433882.18,124441.94
New York City,Kings,7002053,001304,NYU Langone Hospital-Brooklyn,70 or Older,112,F,Other Race,Spanish/Hispanic,34,Emergency,Medicare Cert Long Term Care Hospital,2020,INF012,CORONAVIRUS DISEASE 2019 (COVID-19),RES010,TRACHEOSTOMY,005,TRACHEOSTOMY W MV 96+ HOURS W/O EXTENSIVE PROCEDURE,04,DISEASES AND DISORDERS OF THE RESPIRATORY SYSTEM,4,Extreme,Extreme,Surgical,Medicare,Medicaid,,,,Y,925273.84,305544.78
New York City,Kings,7002053,001304,NYU Langone Hospital-Brooklyn,50 to 69,112,F,Other Race,Not Span/Hispanic,35,Emergency,Hospice - Medical Facility,2020,INF012,CORONAVIRUS DISEASE 2019 (COVID-19),RES010,TRACHEOSTOMY,005,TRACHEOSTOMY W MV 96+ HOURS W/O EXTENSIVE PROCEDURE,04,DISEASES AND DISORDERS OF THE RESPIRATORY SYSTEM,4,Extreme,Extreme,Surgical,Blue Cross/Blue Shield,,,,,Y,855335.04,270018.55
New York City,Kings,7002053,001304,NYU Langone Hospital-Brooklyn,70 or Older,112,F,White,Not Span/Hispanic,23,Emergency,Medicare Cert Long Term Care Hospital,2020,INF002,SEPTICEMIA,ESA003,MECHANICAL VENTILATION,005,TRACHEOSTOMY W MV 96+ HOURS W/O EXTENSIVE PROCEDURE,18,INFECTIOUS AND PARASITIC DISEASES (SYSTEMIC OR UNSPECIFIED SITES),4,Extreme,Extreme,Surgical,Medicare,Private Health Insurance,,,,Y,617028.34,191182.31
New York City,Kings,7002053,001304,NYU Langone Hospital-Brooklyn,30 to 49,112,M,White,Not Span/Hispanic,32,Emergency,Expired,2020,INF002,SEPTICEMIA,RES010,TRACHEOSTOMY,005,TRACHEOSTOMY W MV 96+ HOURS W/O EXTENSIVE PROCEDURE,18,INFECTIOUS AND PARASITIC DISEASES (SYSTEMIC OR UNSPECIFIED SITES),4,Extreme,Extreme,Surgical,Medicaid,,,,,Y,797071.38,236275.09
