Hospital Service Area,Hospital County,Operating Certificate Number,Permanent Facility Id,Facility Name,Age Group,Zip Code - 3 digits,Gender,Race,Ethnicity,Length of Stay,Type of Admission,Patient Disposition,Discharge Year,CCS Diagnosis Code,CCS Diagnosis Description,CCS Procedure Code,CCS Procedure Description,APR DRG Code,APR DRG Description,APR MDC Code,APR MDC Description,APR Severity of Illness Code,APR Severity of Illness Description,APR Risk of Mortality,APR Medical Surgical Description,Payment Typology 1,Payment Typology 2,Payment Typology 3,Birth Weight,Abortion Edit Indicator,Emergency Department Indicator,Total Charges,Total Costs
New York City,Manhattan,7002001,001438,Bellevue Hospital Center,50 to 69,100,M,Other Race,Spanish/Hispanic,120 +,Emergency,Skilled Nursing Home,2020,INF002,SEPTICEMIA,ADM001,TRANSFUSION OF BLOOD AND BLOOD PRODUCTS,005,TRACHEOSTOMY W MV 96+ HOURS W/O EXTENSIVE PROCEDURE,18,INFECTIOUS AND PARASITIC DISEASES (SYSTEMIC OR UNSPECIFIED SITES),4,Extreme,Extreme,Surgical,Medicaid,,,,,Y,2706890.93,1556689.66
New York City,Manhattan,7002001,001438,Bellevue Hospital Center,70 or Older,112,F,Other Race,Spanish/Hispanic,63,Urgent,Expired,2020,NVS009,EPILEPSY; CONVULSIONS,RES010,TRACHEOSTOMY,005,TRACHEOSTOMY W MV 96+ HOURS W/O EXTENSIVE PROCEDURE,01,DISEASES AND DISORDERS OF THE NERVOUS SYSTEM,4,Extreme,Extreme,Surgical,Medicare,Medicaid,,,,N,627138.86,360657.52
New York City,Manhattan,7002001,001438,Bellevue Hospital Center,70 or Older,100,M,Other Race,Spanish/Hispanic,55,Urgent,Skilled Nursing Home,2020,CIR021,ACUTE HEMORRHAGIC CEREBROVASCULAR DISEASE,RES007,AIRWAY INTUBATION,005,TRACHEOSTOMY W MV 96+ HOURS W/O EXTENSIVE PROCEDURE,01,DISEASES AND DISORDERS OF THE NERVOUS SYSTEM,4,Extreme,Extreme,Surgical,Medicare,Medicaid,,,,N,524983.81,301909.79
New York City,Manhattan,7002001,001438,Bellevue Hospital Center,70 or Older,100,F,White,Not Span/Hispanic,52,Emergency,Inpatient Rehabilitation Facility,2020,INF002,SEPTICEMIA,RES010,TRACHEOSTOMY,005,TRACHEOSTOMY W MV 96+ HOURS W/O EXTENSIVE PROCEDURE,18,INFECTIOUS AND PARASITIC DISEASES (SYSTEMIC OR UNSPECIFIED SITES),4,Extreme,Extreme,Surgical,Medicare,Private Health Insurance,,,,Y,478109.66,274953.22
New York City,Manhattan,7002001,001438,Bellevue Hospital Center,50 to 69,112,F,Other Race,Spanish/Hispanic,43,Emergency,Inpatient Rehabilitation Facility,2020,INF002,SEPTICEMIA,ESA003,MECHANICAL VENTILATION,005,TRACHEOSTOMY W MV 96+ HOURS W/O EXTENSIVE PROCEDURE,18,INFECTIOUS AND PARASITIC DISEASES (SYSTEMIC OR UNSPECIFIED SITES),4,Extreme,Extreme,Surgical,Medicare,Medicaid,,,,Y,368905.08,212151.41
New York City,Manhattan,7002001,001438,Bellevue Hospital Center,70 or Older,112,M,Other Race,Spanish/Hispanic,45,Emergency,Medicaid Cert Nursing Facility,2020,INF012,CORONAVIRUS DISEASE 2019 (COVID-19),RES010,TRACHEOSTOMY,005,TRACHEOSTOMY W MV 96+ HOURS W/O EXTENSIVE PROCEDURE,04,DISEASES AND DISORDERS OF THE RESPIRATORY SYSTEM,4,Extreme,Extreme,Surgical,Medicare,Medicaid,,,,Y,453701.11,260916.25
New York City,Manhattan,7002001,001438,Bellevue Hospital Center,50 to 69,111,M,Other Race,Spanish/Hispanic,27,Urgent,Expired,2020,INF012,CORONAVIRUS DISEASE 2019 (COVID-19),RES010,TRACHEOSTOMY,005,TRACHEOSTOMY W MV 96+ HOURS W/O EXTENSIVE PROCEDURE,04,DISEASES AND DISORDERS OF THE RESPIRATORY SYSTEM,4,Extreme,Extreme,Surgical,Private Health Insurance,,,,,N,299309.22,172127.94
New York City,Manhattan,7002001,001438,Bellevue Hospital Center,50 to 69,113,M,Other Race,Unknown,61,Emergency,Court/Law Enforcement,2020,INF012,CORONAVIRUS DISEASE 2019 (COVID-19),RES007,AIRWAY INTUBATION,005,TRACHEOSTOMY W MV 96+ HOURS W/O EXTENSIVE PROCEDURE,04,DISEASES AND DISORDERS OF THE RESPIRATORY SYSTEM,4,Extreme,Extreme,Surgical,Medicaid,,,,,Y,590192.92,339410.51
New York City,Manhattan,7002001,001438,Bellevue Hospital Center,30 to 49,112,M,Other Race,Spanish/Hispanic,40,Emergency,Expired,2020,INF012,CORONAVIRUS DISEASE 2019 (COVID-19),ESA002,EXTRACORPOREAL MEMBRANE OXYGENATION,005,TRACHEOSTOMY W MV 96+ HOURS W/O EXTENSIVE PROCEDURE,04,DISEASES AND DISORDERS OF THE RESPIRATORY SYSTEM,4,Extreme,Extreme,Surgical,Medicaid,,,,,Y,630547.15,362617.58
New York City,Manhattan,7002001,001438,Bellevue Hospital Center,50 to 69,104,F,Other Race,Spanish/Hispanic,19,Emergency,Critical Access Hospital,2020,INF002,SEPTICEMIA,RES010,TRACHEOSTOMY,005,TRACHEOSTOMY W MV 96+ HOURS W/O EXTENSIVE PROCEDURE,18,INFECTIOUS AND PARASITIC DISEASES (SYSTEMIC OR UNSPECIFIED SITES),4,Extreme,Extreme,Surgical,Medicaid,,,,,Y,239170.57,137543.17
New York City,Manhattan,7002001,001438,Bellevue Hospital Center,50 to 69,111,M,Other Race,Not Span/Hispanic,60,Emergency,Inpatient Rehabilitation Facility,2020,INF012,CORONAVIRUS DISEASE 2019 (COVID-19),RES010,TRACHEOSTOMY,005,TRACHEOSTOMY W MV 96+ HOURS W/O EXTENSIVE PROCEDURE,04,DISEASES AND DISORDERS OF THE RESPIRATORY SYSTEM,4,Extreme,Extreme,Surgical,Private Health Insurance,,,,,Y,517458,297581.82
New York City,Manhattan,7002001,001438,Bellevue Hospital Center,70 or Older,OOS,M,White,Not Span/Hispanic,25,Emergency,Home w/ Home Health Services,2020,INJ020,"EFFECT OF FOREIGN BODY ENTERING OPENING, INITIAL ENCOUNTER",RES010,TRACHEOSTOMY,005,TRACHEOSTOMY W MV 96+ HOURS W/O EXTENSIVE PROCEDURE,04,DISEASES AND DISORDERS OF THE RESPIRATORY SYSTEM,4,Extreme,Extreme,Surgical,Medicare,Private Health Insurance,,,,Y,215199.86,123758
New York City,Manhattan,7002001,001438,Bellevue Hospital Center,50 to 69,110,M,Other Race,Not Span/Hispanic,62,Emergency,Expired,2020,CIR018,CARDIAC ARREST AND VENTRICULAR FIBRILLATION,ESA003,MECHANICAL VENTILATION,005,TRACHEOSTOMY W MV 96+ HOURS W/O EXTENSIVE PROCEDURE,05,DISEASES AND DISORDERS OF THE CIRCULATORY SYSTEM,4,Extreme,Extreme,Surgical,Medicare,Medicaid,,,,Y,677503.26,389621.28
New York City,Manhattan,7002001,001438,Bellevue Hospital Center,50 to 69,113,M,Other Race,Not Span/Hispanic,8,Emergency,Home or Self Care,2020,RSP007,OTHER SPECIFIED AND UNSPECIFIED UPPER RESPIRATORY DISEASE,RES010,TRACHEOSTOMY,005,TRACHEOSTOMY W MV 96+ HOURS W/O EXTENSIVE PROCEDURE,03,"DISEASES AND DISORDERS OF THE EAR, NOSE, MOUTH AND THROAT",1,Minor,Minor,Surgical,Medicaid,,,,,Y,71828.01,41307.14
New York City,Manhattan,7002001,001438,Bellevue Hospital Center,50 to 69,112,M,Other Race,Not Span/Hispanic,9,Urgent,Expired,2020,RSP012,RESPIRATORY FAILURE; INSUFFICIENCY; ARREST,RES010,TRACHEOSTOMY,005,TRACHEOSTOMY W MV 96+ HOURS W/O EXTENSIVE PROCEDURE,04,DISEASES AND DISORDERS OF THE RESPIRATORY SYSTEM,4,Extreme,Extreme,Surgical,Medicare,Medicaid,,,,N,195008.59,112146.32
New York City,Manhattan,7002001,001438,Bellevue Hospital Center,50 to 69,114,M,Other Race,Not Span/Hispanic,75,Urgent,Skilled Nursing Home,2020,INF012,CORONAVIRUS DISEASE 2019 (COVID-19),RES010,TRACHEOSTOMY,005,TRACHEOSTOMY W MV 96+ HOURS W/O EXTENSIVE PROCEDURE,04,DISEASES AND DISORDERS OF THE RESPIRATORY SYSTEM,4,Extreme,Extreme,Surgical,Private Health Insurance,Medicare,,,,N,701534.55,403441.3
New York City,Manhattan,7002001,001438,Bellevue Hospital Center,50 to 69,OOS,M,Other Race,Unknown,63,Emergency,Expired,2020,SYM003,SHOCK,RES010,TRACHEOSTOMY,005,TRACHEOSTOMY W MV 96+ HOURS W/O EXTENSIVE PROCEDURE,05,DISEASES AND DISORDERS OF THE CIRCULATORY SYSTEM,4,Extreme,Extreme,Surgical,Medicaid,,,,,Y,752751.55,432895.37
New York City,Manhattan,7002001,001438,Bellevue Hospital Center,70 or Older,112,F,Other Race,Not Span/Hispanic,62,Elective,Skilled Nursing Home,2020,RSP012,RESPIRATORY FAILURE; INSUFFICIENCY; ARREST,RES010,TRACHEOSTOMY,005,TRACHEOSTOMY W MV 96+ HOURS W/O EXTENSIVE PROCEDURE,04,DISEASES AND DISORDERS OF THE RESPIRATORY SYSTEM,4,Extreme,Extreme,Surgical,Medicare,Medicaid,,,,N,714050.06,410638.76
New York City,Manhattan,7002001,001438,Bellevue Hospital Center,30 to 49,104,M,Black/African American,Not Span/Hispanic,92,Urgent,Skilled Nursing Home,2020,CIR018,CARDIAC ARREST AND VENTRICULAR FIBRILLATION,RES010,TRACHEOSTOMY,005,TRACHEOSTOMY W MV 96+ HOURS W/O EXTENSIVE PROCEDURE,05,DISEASES AND DISORDERS OF THE CIRCULATORY SYSTEM,3,Major,Extreme,Surgical,Medicaid,,,,,N,1090881.13,627348.28
New York City,Manhattan,7002001,001438,Bellevue Hospital Center,50 to 69,113,F,Black/African American,Not Span/Hispanic,44,Emergency,Skilled Nursing Home,2020,RSP012,RESPIRATORY FAILURE; INSUFFICIENCY; ARREST,RES010,TRACHEOSTOMY,005,TRACHEOSTOMY W MV 96+ HOURS W/O EXTENSIVE PROCEDURE,04,DISEASES AND DISORDERS OF THE RESPIRATORY SYSTEM,4,Extreme,Major,Surgical,Medicaid,,,,,Y,423524.8,243562.34
New York City,Manhattan,7002001,001438,Bellevue Hospital Center,30 to 49,113,M,Other Race,Spanish/Hispanic,36,Emergency,Short-term Hospital,2020,INF012,CORONAVIRUS DISEASE 2019 (COVID-19),RES010,TRACHEOSTOMY,005,TRACHEOSTOMY W MV 96+ HOURS W/O EXTENSIVE PROCEDURE,04,DISEASES AND DISORDERS OF THE RESPIRATORY SYSTEM,4,Extreme,Extreme,Surgical,Medicaid,,,,,Y,378928.41,217915.67
New York City,Manhattan,7002001,001438,Bellevue Hospital Center,50 to 69,112,M,Black/African American,Not Span/Hispanic,67,Emergency,Medicare Cert Long Term Care Hospital,2020,INF012,CORONAVIRUS DISEASE 2019 (COVID-19),RES010,TRACHEOSTOMY,005,TRACHEOSTOMY W MV 96+ HOURS W/O EXTENSIVE PROCEDURE,04,DISEASES AND DISORDERS OF THE RESPIRATORY SYSTEM,4,Extreme,Extreme,Surgical,Medicaid,,,,,Y,730108.56,419873.75
New York City,Manhattan,7002001,001438,Bellevue Hospital Center,70 or Older,112,M,Other Race,Not Span/Hispanic,21,Emergency,Expired,2020,INF012,CORONAVIRUS DISEASE 2019 (COVID-19),RES010,TRACHEOSTOMY,005,TRACHEOSTOMY W MV 96+ HOURS W/O EXTENSIVE PROCEDURE,04,DISEASES AND DISORDERS OF THE RESPIRATORY SYSTEM,4,Extreme,Extreme,Surgical,Medicare,,,,,Y,242005.94,139173.74
New York City,Manhattan,7002001,001438,Bellevue Hospital Center,70 or Older,114,F,Other Race,Not Span/Hispanic,41,Urgent,Skilled Nursing Home,2020,INF002,SEPTICEMIA,RES010,TRACHEOSTOMY,005,TRACHEOSTOMY W MV 96+ HOURS W/O EXTENSIVE PROCEDURE,18,INFECTIOUS AND PARASITIC DISEASES (SYSTEMIC OR UNSPECIFIED SITES),4,Extreme,Extreme,Surgical,Medicare,,,,,N,469844.1,270199.82
New York City,Manhattan,7002001,001438,Bellevue Hospital Center,50 to 69,112,F,Black/African American,Not Span/Hispanic,54,Urgent,Expired,2020,INF012,CORONAVIRUS DISEASE 2019 (COVID-19),RES010,TRACHEOSTOMY,005,TRACHEOSTOMY W MV 96+ HOURS W/O EXTENSIVE PROCEDURE,04,DISEASES AND DISORDERS OF THE RESPIRATORY SYSTEM,4,Extreme,Extreme,Surgical,Medicare,Medicaid,,,,N,613769.43,352968.98
New York City,Manhattan,7002001,001438,Bellevue Hospital Center,50 to 69,112,M,Black/African American,Not Span/Hispanic,52,Emergency,Short-term Hospital,2020,INF012,CORONAVIRUS DISEASE 2019 (COVID-19),RES010,TRACHEOSTOMY,005,TRACHEOSTOMY W MV 96+ HOURS W/O EXTENSIVE PROCEDURE,04,DISEASES AND DISORDERS OF THE RESPIRATORY SYSTEM,4,Extreme,Extreme,Surgical,Medicare,,,,,Y,445512.06,256206.86
New York City,Manhattan,7002001,001438,Bellevue Hospital Center,50 to 69,100,M,Other Race,Spanish/Hispanic,19,Urgent,Expired,2020,CIR009,ACUTE MYOCARDIAL INFARCTION,RES007,AIRWAY INTUBATION,005,TRACHEOSTOMY W MV 96+ HOURS W/O EXTENSIVE PROCEDURE,05,DISEASES AND DISORDERS OF THE CIRCULATORY SYSTEM,4,Extreme,Extreme,Surgical,Medicaid,,,,,N,237135.3,136372.72
New York City,Manhattan,7002001,001438,Bellevue Hospital Center,70 or Older,113,M,Other Race,Not Span/Hispanic,45,Emergency,Expired,2020,MUS014,"PATHOLOGICAL FRACTURE, INITIAL ENCOUNTER",RES010,TRACHEOSTOMY,005,TRACHEOSTOMY W MV 96+ HOURS W/O EXTENSIVE PROCEDURE,08,DISEASES AND DISORDERS OF THE MUSCULOSKELETAL SYSTEM AND CONNECTIVE TISSUE,4,Extreme,Extreme,Surgical,Medicaid,,,,,Y,587518.6,337872.55
New York City,Manhattan,7002001,001438,Bellevue Hospital Center,70 or Older,104,M,Other Race,Spanish/Hispanic,70,Urgent,Expired,2020,INF002,SEPTICEMIA,RES010,TRACHEOSTOMY,005,TRACHEOSTOMY W MV 96+ HOURS W/O EXTENSIVE PROCEDURE,18,INFECTIOUS AND PARASITIC DISEASES (SYSTEMIC OR UNSPECIFIED SITES),4,Extreme,Extreme,Surgical,Medicare,,,,,N,1131402.98,650651.75
New York City,Manhattan,7002001,001438,Bellevue Hospital Center,70 or Older,113,M,Other Race,Spanish/Hispanic,46,Emergency,Home or Self Care,2020,INF012,CORONAVIRUS DISEASE 2019 (COVID-19),RES010,TRACHEOSTOMY,005,TRACHEOSTOMY W MV 96+ HOURS W/O EXTENSIVE PROCEDURE,04,DISEASES AND DISORDERS OF THE RESPIRATORY SYSTEM,4,Extreme,Extreme,Surgical,Medicaid,,,,,Y,400227.45,230164.4
New York City,Manhattan,7002001,001438,Bellevue Hospital Center,30 to 49,104,F,Black/African American,Not Span/Hispanic,30,Urgent,Skilled Nursing Home,2020,PRG027,COMPLICATIONS SPECIFIED DURING THE PUERPERIUM,RES010,TRACHEOSTOMY,005,TRACHEOSTOMY W MV 96+ HOURS W/O EXTENSIVE PROCEDURE,14,"PREGNANCY, CHILDBIRTH AND THE PUERPERIUM",4,Extreme,Major,Surgical,Medicaid,,,,,N,268675.12,154510.76
New York City,Manhattan,7002001,001438,Bellevue Hospital Center,50 to 69,111,M,Other Race,Unknown,48,Emergency,Short-term Hospital,2020,INF012,CORONAVIRUS DISEASE 2019 (COVID-19),CAR024,VENOUS AND ARTERIAL CATHETER PLACEMENT,005,TRACHEOSTOMY W MV 96+ HOURS W/O EXTENSIVE PROCEDURE,04,DISEASES AND DISORDERS OF THE RESPIRATORY SYSTEM,4,Extreme,Extreme,Surgical,Medicaid,,,,,Y,494700.86,284494.55
New York City,Manhattan,7002001,001438,Bellevue Hospital Center,50 to 69,100,F,White,Not Span/Hispanic,31,Emergency,Skilled Nursing Home,2020,INF002,SEPTICEMIA,ESA003,MECHANICAL VENTILATION,005,TRACHEOSTOMY W MV 96+ HOURS W/O EXTENSIVE PROCEDURE,18,INFECTIOUS AND PARASITIC DISEASES (SYSTEMIC OR UNSPECIFIED SITES),3,Major,Major,Surgical,Medicare,Medicaid,,,,Y,257750.51,148228.19
New York City,Manhattan,7002001,001438,Bellevue Hospital Center,70 or Older,112,M,Black/African American,Not Span/Hispanic,111,Urgent,Skilled Nursing Home,2020,SYM003,SHOCK,RES010,TRACHEOSTOMY,005,TRACHEOSTOMY W MV 96+ HOURS W/O EXTENSIVE PROCEDURE,05,DISEASES AND DISORDERS OF THE CIRCULATORY SYSTEM,4,Extreme,Extreme,Surgical,Medicare,,,,,N,1440517.99,828418.85
New York City,Manhattan,7002001,001438,Bellevue Hospital Center,18 to 29,112,M,Other Race,Not Span/Hispanic,40,Emergency,Inpatient Rehabilitation Facility,2020,INJ022,"POISONING BY DRUGS, INITIAL ENCOUNTER",RES010,TRACHEOSTOMY,005,TRACHEOSTOMY W MV 96+ HOURS W/O EXTENSIVE PROCEDURE,21,"INJURIES, POISONINGS AND TOXIC EFFECTS OF DRUGS",4,Extreme,Extreme,Surgical,Medicaid,,,,,Y,407324.42,234245.76
New York City,Manhattan,7002001,001438,Bellevue Hospital Center,50 to 69,100,F,Black/African American,Spanish/Hispanic,7,Emergency,Short-term Hospital,2020,RSP007,OTHER SPECIFIED AND UNSPECIFIED UPPER RESPIRATORY DISEASE,RES010,TRACHEOSTOMY,005,TRACHEOSTOMY W MV 96+ HOURS W/O EXTENSIVE PROCEDURE,03,"DISEASES AND DISORDERS OF THE EAR, NOSE, MOUTH AND THROAT",3,Major,Major,Surgical,Medicaid,,,,,Y,101949.62,58629.6
New York City,Manhattan,7002001,001438,Bellevue Hospital Center,50 to 69,113,F,Other Race,Spanish/Hispanic,42,Urgent,Short-term Hospital,2020,INF012,CORONAVIRUS DISEASE 2019 (COVID-19),RES010,TRACHEOSTOMY,005,TRACHEOSTOMY W MV 96+ HOURS W/O EXTENSIVE PROCEDURE,04,DISEASES AND DISORDERS OF THE RESPIRATORY SYSTEM,4,Extreme,Extreme,Surgical,Medicare,Medicaid,,,,N,411587.46,236697.36
New York City,Manhattan,7002001,001438,Bellevue Hospital Center,70 or Older,100,M,White,Not Span/Hispanic,37,Emergency,Inpatient Rehabilitation Facility,2020,END003,DIABETES MELLITUS WITH COMPLICATION,RES010,TRACHEOSTOMY,005,TRACHEOSTOMY W MV 96+ HOURS W/O EXTENSIVE PROCEDURE,10,"ENDOCRINE, NUTRITIONAL AND METABOLIC DISEASES AND DISORDERS",4,Extreme,Extreme,Surgical,Medicare,Medicare,,,,Y,530277.42,304954.06
New York City,Manhattan,7002001,001438,Bellevue Hospital Center,70 or Older,112,M,Other Race,Spanish/Hispanic,60,Urgent,Skilled Nursing Home,2020,CIR019,HEART FAILURE,RES010,TRACHEOSTOMY,005,TRACHEOSTOMY W MV 96+ HOURS W/O EXTENSIVE PROCEDURE,05,DISEASES AND DISORDERS OF THE CIRCULATORY SYSTEM,4,Extreme,Extreme,Surgical,Medicare,Medicaid,,,,N,727162.42,418179.47
New York City,Manhattan,7002001,001438,Bellevue Hospital Center,70 or Older,113,F,Black/African American,Not Span/Hispanic,28,Urgent,Expired,2020,INF002,SEPTICEMIA,RES010,TRACHEOSTOMY,005,TRACHEOSTOMY W MV 96+ HOURS W/O EXTENSIVE PROCEDURE,18,INFECTIOUS AND PARASITIC DISEASES (SYSTEMIC OR UNSPECIFIED SITES),4,Extreme,Extreme,Surgical,Medicare,Medicaid,,,,N,467714.97,268975.4
New York City,Manhattan,7002001,001438,Bellevue Hospital Center,50 to 69,113,M,Other Race,Not Span/Hispanic,48,Emergency,Inpatient Rehabilitation Facility,2020,INF012,CORONAVIRUS DISEASE 2019 (COVID-19),RES007,AIRWAY INTUBATION,005,TRACHEOSTOMY W MV 96+ HOURS W/O EXTENSIVE PROCEDURE,04,DISEASES AND DISORDERS OF THE RESPIRATORY SYSTEM,4,Extreme,Extreme,Surgical,Private Health Insurance,,,,,Y,467476.93,268838.5
New York City,Manhattan,7002001,001438,Bellevue Hospital Center,50 to 69,113,M,Other Race,Spanish/Hispanic,32,Emergency,Expired,2020,INF012,CORONAVIRUS DISEASE 2019 (COVID-19),RES010,TRACHEOSTOMY,005,TRACHEOSTOMY W MV 96+ HOURS W/O EXTENSIVE PROCEDURE,04,DISEASES AND DISORDERS OF THE RESPIRATORY SYSTEM,4,Extreme,Extreme,Surgical,Medicaid,,,,,Y,323972.12,186311.18
New York City,Manhattan,7002001,001438,Bellevue Hospital Center,50 to 69,113,M,Other Race,Unknown,34,Urgent,Inpatient Rehabilitation Facility,2020,INF012,CORONAVIRUS DISEASE 2019 (COVID-19),ESA003,MECHANICAL VENTILATION,005,TRACHEOSTOMY W MV 96+ HOURS W/O EXTENSIVE PROCEDURE,04,DISEASES AND DISORDERS OF THE RESPIRATORY SYSTEM,4,Extreme,Extreme,Surgical,Medicaid,,,,,N,277719.21,159711.87
New York City,Manhattan,7002001,001438,Bellevue Hospital Center,30 to 49,113,M,Other Race,Spanish/Hispanic,58,Emergency,Inpatient Rehabilitation Facility,2020,INF012,CORONAVIRUS DISEASE 2019 (COVID-19),ADM021,"ADMINISTRATION OF THERAPEUTIC SUBSTANCES, NEC",005,TRACHEOSTOMY W MV 96+ HOURS W/O EXTENSIVE PROCEDURE,04,DISEASES AND DISORDERS OF THE RESPIRATORY SYSTEM,4,Extreme,Extreme,Surgical,Medicaid,,,,,Y,590202.36,339415.93
New York City,Manhattan,7002001,001438,Bellevue Hospital Center,50 to 69,104,M,Other Race,Spanish/Hispanic,104,Emergency,Hospice - Medical Facility,2020,DIG024,POSTPROCEDURAL OR POSTOPERATIVE DIGESTIVE SYSTEM COMPLICATION,RES010,TRACHEOSTOMY,005,TRACHEOSTOMY W MV 96+ HOURS W/O EXTENSIVE PROCEDURE,06,DISEASES AND DISORDERS OF THE DIGESTIVE SYSTEM,4,Extreme,Extreme,Surgical,Medicaid,,,,,Y,854969.34,491679.19
New York City,Manhattan,7002001,001438,Bellevue Hospital Center,70 or Older,103,M,Black/African American,Not Span/Hispanic,23,Urgent,Skilled Nursing Home,2020,INF002,SEPTICEMIA,RES010,TRACHEOSTOMY,005,TRACHEOSTOMY W MV 96+ HOURS W/O EXTENSIVE PROCEDURE,18,INFECTIOUS AND PARASITIC DISEASES (SYSTEMIC OR UNSPECIFIED SITES),4,Extreme,Extreme,Surgical,Medicare,Medicaid,,,,N,259353.63,149150.12
New York City,Manhattan,7002001,001438,Bellevue Hospital Center,30 to 49,112,M,Other Race,Spanish/Hispanic,26,Emergency,Short-term Hospital,2020,INF012,CORONAVIRUS DISEASE 2019 (COVID-19),ESA002,EXTRACORPOREAL MEMBRANE OXYGENATION,005,TRACHEOSTOMY W MV 96+ HOURS W/O EXTENSIVE PROCEDURE,04,DISEASES AND DISORDERS OF THE RESPIRATORY SYSTEM,4,Extreme,Extreme,Surgical,Medicaid,,,,,N,393762.66,226446.61
New York City,Manhattan,7002001,001438,Bellevue Hospital Center,70 or Older,114,M,Other Race,Spanish/Hispanic,31,Emergency,Expired,2020,INF002,SEPTICEMIA,ESA002,EXTRACORPOREAL MEMBRANE OXYGENATION,005,TRACHEOSTOMY W MV 96+ HOURS W/O EXTENSIVE PROCEDURE,18,INFECTIOUS AND PARASITIC DISEASES (SYSTEMIC OR UNSPECIFIED SITES),4,Extreme,Extreme,Surgical,Medicaid,,,,,N,529819.05,304690.46
New York City,Manhattan,7002001,001438,Bellevue Hospital Center,50 to 69,104,M,Other Race,Not Span/Hispanic,120 +,Emergency,Skilled Nursing Home,2020,DIG018,HEPATIC FAILURE,RES010,TRACHEOSTOMY,005,TRACHEOSTOMY W MV 96+ HOURS W/O EXTENSIVE PROCEDURE,07,DISEASES AND DISORDERS OF THE HEPATOBILIARY SYSTEM AND PANCREAS,4,Extreme,Extreme,Surgical,Medicaid,,,,,Y,2007267.1,1154347.19
New York City,Manhattan,7002001,001438,Bellevue Hospital Center,30 to 49,112,M,White,Unknown,39,Urgent,Inpatient Rehabilitation Facility,2020,INF012,CORONAVIRUS DISEASE 2019 (COVID-19),RES007,AIRWAY INTUBATION,005,TRACHEOSTOMY W MV 96+ HOURS W/O EXTENSIVE PROCEDURE,04,DISEASES AND DISORDERS OF THE RESPIRATORY SYSTEM,4,Extreme,Extreme,Surgical,Private Health Insurance,,,,,N,365738.63,210330.43
New York City,Manhattan,7002001,001438,Bellevue Hospital Center,50 to 69,114,M,Other Race,Spanish/Hispanic,33,Urgent,Home or Self Care,2020,INF012,CORONAVIRUS DISEASE 2019 (COVID-19),RES010,TRACHEOSTOMY,005,TRACHEOSTOMY W MV 96+ HOURS W/O EXTENSIVE PROCEDURE,04,DISEASES AND DISORDERS OF THE RESPIRATORY SYSTEM,4,Extreme,Major,Surgical,Medicaid,,,,,N,284157.64,163414.51
New York City,Manhattan,7002001,001438,Bellevue Hospital Center,30 to 49,112,M,Other Race,Not Span/Hispanic,45,Emergency,Expired,2020,INF012,CORONAVIRUS DISEASE 2019 (COVID-19),RES007,AIRWAY INTUBATION,005,TRACHEOSTOMY W MV 96+ HOURS W/O EXTENSIVE PROCEDURE,04,DISEASES AND DISORDERS OF THE RESPIRATORY SYSTEM,3,Major,Major,Surgical,Medicaid,,,,,Y,794388.81,456840.29
New York City,Manhattan,7002001,001438,Bellevue Hospital Center,50 to 69,112,M,Black/African American,Not Span/Hispanic,47,Urgent,Home or Self Care,2020,INF002,SEPTICEMIA,RES010,TRACHEOSTOMY,005,TRACHEOSTOMY W MV 96+ HOURS W/O EXTENSIVE PROCEDURE,18,INFECTIOUS AND PARASITIC DISEASES (SYSTEMIC OR UNSPECIFIED SITES),4,Extreme,Extreme,Surgical,Medicaid,,,,,N,449997.07,258786.12
New York City,Manhattan,7002001,001438,Bellevue Hospital Center,50 to 69,113,M,Other Race,Spanish/Hispanic,49,Emergency,Home or Self Care,2020,INF012,CORONAVIRUS DISEASE 2019 (COVID-19),ADM017,ADMINISTRATION OF NUTRITIONAL AND ELECTROLYTIC SUBSTANCES,005,TRACHEOSTOMY W MV 96+ HOURS W/O EXTENSIVE PROCEDURE,04,DISEASES AND DISORDERS OF THE RESPIRATORY SYSTEM,4,Extreme,Extreme,Surgical,Medicaid,,,,,Y,450455.02,259049.47
New York City,Manhattan,7002001,001438,Bellevue Hospital Center,70 or Older,112,F,Black/African American,Not Span/Hispanic,113,Emergency,Skilled Nursing Home,2020,INF002,SEPTICEMIA,RES010,TRACHEOSTOMY,005,TRACHEOSTOMY W MV 96+ HOURS W/O EXTENSIVE PROCEDURE,18,INFECTIOUS AND PARASITIC DISEASES (SYSTEMIC OR UNSPECIFIED SITES),4,Extreme,Extreme,Surgical,Medicare,Private Health Insurance,,,,Y,1410382.11,811088.19
New York City,Manhattan,7002001,001438,Bellevue Hospital Center,50 to 69,113,M,Other Race,Not Span/Hispanic,58,Emergency,Inpatient Rehabilitation Facility,2020,INF012,CORONAVIRUS DISEASE 2019 (COVID-19),RES010,TRACHEOSTOMY,005,TRACHEOSTOMY W MV 96+ HOURS W/O EXTENSIVE PROCEDURE,04,DISEASES AND DISORDERS OF THE RESPIRATORY SYSTEM,4,Extreme,Major,Surgical,Medicaid,,,,,Y,495991.77,285236.93
New York City,Manhattan,7002001,001438,Bellevue Hospital Center,50 to 69,104,M,Other Race,Spanish/Hispanic,83,Urgent,Expired,2020,INJ008,"TRAUMATIC BRAIN INJURY (TBI); CONCUSSION, INITIAL ENCOUNTER",RES010,TRACHEOSTOMY,005,TRACHEOSTOMY W MV 96+ HOURS W/O EXTENSIVE PROCEDURE,01,DISEASES AND DISORDERS OF THE NERVOUS SYSTEM,4,Extreme,Major,Surgical,Medicare,Medicaid,,,,N,912984.71,525042.9
New York City,Manhattan,7002001,001438,Bellevue Hospital Center,18 to 29,100,M,Other Race,Unknown,46,Emergency,Inpatient Rehabilitation Facility,2020,INJ007,"DISLOCATIONS, INITIAL ENCOUNTER",RES007,AIRWAY INTUBATION,005,TRACHEOSTOMY W MV 96+ HOURS W/O EXTENSIVE PROCEDURE,08,DISEASES AND DISORDERS OF THE MUSCULOSKELETAL SYSTEM AND CONNECTIVE TISSUE,4,Extreme,Extreme,Surgical,Medicaid,,,,,Y,564556.53,324667.43
New York City,Manhattan,7002001,001438,Bellevue Hospital Center,50 to 69,104,M,Other Race,Not Span/Hispanic,37,Urgent,Short-term Hospital,2020,INF002,SEPTICEMIA,RES007,AIRWAY INTUBATION,005,TRACHEOSTOMY W MV 96+ HOURS W/O EXTENSIVE PROCEDURE,18,INFECTIOUS AND PARASITIC DISEASES (SYSTEMIC OR UNSPECIFIED SITES),4,Extreme,Extreme,Surgical,Private Health Insurance,,,,,N,375928.1,216190.24