Hospital Service Area,Hospital County,Operating Certificate Number,Permanent Facility Id,Facility Name,Age Group,Zip Code - 3 digits,Gender,Race,Ethnicity,Length of Stay,Type of Admission,Patient Disposition,Discharge Year,CCS Diagnosis Code,CCS Diagnosis Description,CCS Procedure Code,CCS Procedure Description,APR DRG Code,APR DRG Description,APR MDC Code,APR MDC Description,APR Severity of Illness Code,APR Severity of Illness Description,APR Risk of Mortality,APR Medical Surgical Description,Payment Typology 1,Payment Typology 2,Payment Typology 3,Birth Weight,Abortion Edit Indicator,Emergency Department Indicator,Total Charges,Total Costs
New York City,Manhattan,7002053,001463,NYU Langone Hospitals,50 to 69,112,F,White,Not Span/Hispanic,36,Urgent,Skilled Nursing Home,2020,CIR020,CEREBRAL INFARCTION,RES010,TRACHEOSTOMY,005,TRACHEOSTOMY W MV 96+ HOURS W/O EXTENSIVE PROCEDURE,01,DISEASES AND DISORDERS OF THE NERVOUS SYSTEM,4,Extreme,Extreme,Surgical,Medicaid,,,,,N,968088.29,255598.58
New York City,Manhattan,7002053,001463,NYU Langone Hospitals,50 to 69,125,M,White,Not Span/Hispanic,32,Emergency,Skilled Nursing Home,2020,NVS009,EPILEPSY; CONVULSIONS,RES010,TRACHEOSTOMY,005,TRACHEOSTOMY W MV 96+ HOURS W/O EXTENSIVE PROCEDURE,01,DISEASES AND DISORDERS OF THE NERVOUS SYSTEM,4,Extreme,Major,Surgical,Medicare,Blue Cross/Blue Shield,,,,N,788482.35,220544.79
New York City,Manhattan,7002053,001463,NYU Langone Hospitals,70 or Older,112,M,White,Not Span/Hispanic,20,Emergency,Medicare Cert Long Term Care Hospital,2020,CIR019,HEART FAILURE,RES010,TRACHEOSTOMY,005,TRACHEOSTOMY W MV 96+ HOURS W/O EXTENSIVE PROCEDURE,05,DISEASES AND DISORDERS OF THE CIRCULATORY SYSTEM,4,Extreme,Extreme,Surgical,Medicare,Private Health Insurance,Medicaid,,,Y,483754.44,148666.79
New York City,Manhattan,7002053,001463,NYU Langone Hospitals,50 to 69,112,F,Other Race,Not Span/Hispanic,36,Emergency,Home w/ Home Health Services,2020,INF002,SEPTICEMIA,ESA003,MECHANICAL VENTILATION,005,TRACHEOSTOMY W MV 96+ HOURS W/O EXTENSIVE PROCEDURE,18,INFECTIOUS AND PARASITIC DISEASES (SYSTEMIC OR UNSPECIFIED SITES),3,Major,Major,Surgical,Medicare,Medicaid,,,,Y,711288.31,196585.34
New York City,Manhattan,7002053,001463,NYU Langone Hospitals,50 to 69,115,F,White,Unknown,24,Emergency,Hospice - Medical Facility,2020,NVS009,EPILEPSY; CONVULSIONS,MAM011,ELECTROENCEPHALOGRAM (EEG),005,TRACHEOSTOMY W MV 96+ HOURS W/O EXTENSIVE PROCEDURE,01,DISEASES AND DISORDERS OF THE NERVOUS SYSTEM,4,Extreme,Extreme,Surgical,Private Health Insurance,,,,,N,888047.02,195606.13
New York City,Manhattan,7002053,001463,NYU Langone Hospitals,18 to 29,104,F,Other Race,Unknown,26,Emergency,Inpatient Rehabilitation Facility,2020,CIR020,CEREBRAL INFARCTION,RES010,TRACHEOSTOMY,005,TRACHEOSTOMY W MV 96+ HOURS W/O EXTENSIVE PROCEDURE,01,DISEASES AND DISORDERS OF THE NERVOUS SYSTEM,4,Extreme,Extreme,Surgical,Medicaid,,,,,N,446341.55,127048.88
New York City,Manhattan,7002053,001463,NYU Langone Hospitals,0 to 17,104,F,Other Race,Spanish/Hispanic,86,Emergency,Home or Self Care,2020,RSP012,RESPIRATORY FAILURE; INSUFFICIENCY; ARREST,RES010,TRACHEOSTOMY,005,TRACHEOSTOMY W MV 96+ HOURS W/O EXTENSIVE PROCEDURE,04,DISEASES AND DISORDERS OF THE RESPIRATORY SYSTEM,4,Extreme,Major,Surgical,Medicaid,,,,,Y,1796596.84,463387.27
New York City,Manhattan,7002053,001463,NYU Langone Hospitals,70 or Older,112,M,White,Not Span/Hispanic,22,Emergency,Skilled Nursing Home,2020,INJ034,"COMPLICATION OF GENITOURINARY DEVICE, IMPLANT OR GRAFT, INITIAL ENCOUNTER",ESA003,MECHANICAL VENTILATION,005,TRACHEOSTOMY W MV 96+ HOURS W/O EXTENSIVE PROCEDURE,11,DISEASES AND DISORDERS OF THE KIDNEY AND URINARY TRACT,4,Extreme,Extreme,Surgical,Medicare,Medicaid,,,,Y,731834.66,163726.23
New York City,Manhattan,7002053,001463,NYU Langone Hospitals,70 or Older,100,F,Other Race,Not Span/Hispanic,25,Emergency,Medicare Cert Long Term Care Hospital,2020,INF002,SEPTICEMIA,RES010,TRACHEOSTOMY,005,TRACHEOSTOMY W MV 96+ HOURS W/O EXTENSIVE PROCEDURE,18,INFECTIOUS AND PARASITIC DISEASES (SYSTEMIC OR UNSPECIFIED SITES),4,Extreme,Extreme,Surgical,Medicare,Medicare,,,,N,766456.52,225261.39
New York City,Manhattan,7002053,001463,NYU Langone Hospitals,50 to 69,112,F,Black/African American,Not Span/Hispanic,22,Emergency,Expired,2020,RSP016,OTHER SPECIFIED AND UNSPECIFIED LOWER RESPIRATORY DISEASE,CAR024,VENOUS AND ARTERIAL CATHETER PLACEMENT,005,TRACHEOSTOMY W MV 96+ HOURS W/O EXTENSIVE PROCEDURE,04,DISEASES AND DISORDERS OF THE RESPIRATORY SYSTEM,4,Extreme,Extreme,Surgical,Medicare,,,,,N,1128773.29,243108.17
New York City,Manhattan,7002053,001463,NYU Langone Hospitals,50 to 69,114,M,White,Not Span/Hispanic,71,Emergency,Inpatient Rehabilitation Facility,2020,RSP010,ASPIRATION PNEUMONITIS,RES010,TRACHEOSTOMY,005,TRACHEOSTOMY W MV 96+ HOURS W/O EXTENSIVE PROCEDURE,04,DISEASES AND DISORDERS OF THE RESPIRATORY SYSTEM,4,Extreme,Extreme,Surgical,Private Health Insurance,,,,,Y,1929426.3,494331.27
New York City,Manhattan,7002053,001463,NYU Langone Hospitals,18 to 29,107,M,White,Not Span/Hispanic,24,Emergency,Home or Self Care,2020,INF012,CORONAVIRUS DISEASE 2019 (COVID-19),ESA002,EXTRACORPOREAL MEMBRANE OXYGENATION,005,TRACHEOSTOMY W MV 96+ HOURS W/O EXTENSIVE PROCEDURE,04,DISEASES AND DISORDERS OF THE RESPIRATORY SYSTEM,2,Moderate,Moderate,Surgical,Blue Cross/Blue Shield,,,,,Y,936099.98,224802.98
New York City,Manhattan,7002053,001463,NYU Langone Hospitals,18 to 29,OOS,M,White,Not Span/Hispanic,37,Emergency,Inpatient Rehabilitation Facility,2020,INF002,SEPTICEMIA,CNS002,LUMBAR PUNCTURE,005,TRACHEOSTOMY W MV 96+ HOURS W/O EXTENSIVE PROCEDURE,18,INFECTIOUS AND PARASITIC DISEASES (SYSTEMIC OR UNSPECIFIED SITES),4,Extreme,Extreme,Surgical,Private Health Insurance,,,,,Y,936981.36,252765.1
New York City,Manhattan,7002053,001463,NYU Langone Hospitals,50 to 69,100,M,Other Race,Not Span/Hispanic,28,Emergency,Expired,2020,INF002,SEPTICEMIA,RES010,TRACHEOSTOMY,005,TRACHEOSTOMY W MV 96+ HOURS W/O EXTENSIVE PROCEDURE,18,INFECTIOUS AND PARASITIC DISEASES (SYSTEMIC OR UNSPECIFIED SITES),4,Extreme,Extreme,Surgical,Medicare,,,,,Y,670931.57,206942.13
New York City,Manhattan,7002053,001463,NYU Langone Hospitals,30 to 49,112,M,Multi-racial,Unknown,32,Emergency,Inpatient Rehabilitation Facility,2020,INF002,SEPTICEMIA,RES010,TRACHEOSTOMY,005,TRACHEOSTOMY W MV 96+ HOURS W/O EXTENSIVE PROCEDURE,18,INFECTIOUS AND PARASITIC DISEASES (SYSTEMIC OR UNSPECIFIED SITES),3,Major,Moderate,Surgical,Medicaid,,,,,Y,538675.4,176460.12
New York City,Manhattan,7002053,001463,NYU Langone Hospitals,70 or Older,100,M,Other Race,Not Span/Hispanic,18,Emergency,Expired,2020,INF012,CORONAVIRUS DISEASE 2019 (COVID-19),RES010,TRACHEOSTOMY,005,TRACHEOSTOMY W MV 96+ HOURS W/O EXTENSIVE PROCEDURE,04,DISEASES AND DISORDERS OF THE RESPIRATORY SYSTEM,4,Extreme,Extreme,Surgical,Medicare,Medicare,,,,Y,423124.38,140979.62
New York City,Manhattan,7002053,001463,NYU Langone Hospitals,70 or Older,113,F,White,Not Span/Hispanic,21,Emergency,Expired,2020,INF012,CORONAVIRUS DISEASE 2019 (COVID-19),RES010,TRACHEOSTOMY,005,TRACHEOSTOMY W MV 96+ HOURS W/O EXTENSIVE PROCEDURE,04,DISEASES AND DISORDERS OF THE RESPIRATORY SYSTEM,4,Extreme,Extreme,Surgical,Medicare,Medicaid,,,,Y,426918.47,148892.65
New York City,Manhattan,7002053,001463,NYU Langone Hospitals,50 to 69,100,F,Black/African American,Unknown,36,Emergency,Skilled Nursing Home,2020,RSP010,ASPIRATION PNEUMONITIS,RES010,TRACHEOSTOMY,005,TRACHEOSTOMY W MV 96+ HOURS W/O EXTENSIVE PROCEDURE,04,DISEASES AND DISORDERS OF THE RESPIRATORY SYSTEM,3,Major,Extreme,Surgical,Medicaid,,,,,Y,828292.97,233795.42
New York City,Manhattan,7002053,001463,NYU Langone Hospitals,50 to 69,117,M,Other Race,Not Span/Hispanic,31,Emergency,Inpatient Rehabilitation Facility,2020,INF012,CORONAVIRUS DISEASE 2019 (COVID-19),RES007,AIRWAY INTUBATION,005,TRACHEOSTOMY W MV 96+ HOURS W/O EXTENSIVE PROCEDURE,04,DISEASES AND DISORDERS OF THE RESPIRATORY SYSTEM,3,Major,Moderate,Surgical,Private Health Insurance,,,,,Y,913300.11,258142.01
New York City,Manhattan,7002053,001463,NYU Langone Hospitals,50 to 69,100,M,White,Not Span/Hispanic,23,Emergency,Hospice - Medical Facility,2020,INF012,CORONAVIRUS DISEASE 2019 (COVID-19),RES010,TRACHEOSTOMY,005,TRACHEOSTOMY W MV 96+ HOURS W/O EXTENSIVE PROCEDURE,04,DISEASES AND DISORDERS OF THE RESPIRATORY SYSTEM,4,Extreme,Extreme,Surgical,Private Health Insurance,,,,,Y,552233.14,172109.15
New York City,Manhattan,7002053,001463,NYU Langone Hospitals,30 to 49,112,M,Other Race,Unknown,38,Emergency,Inpatient Rehabilitation Facility,2020,INF012,CORONAVIRUS DISEASE 2019 (COVID-19),RES010,TRACHEOSTOMY,005,TRACHEOSTOMY W MV 96+ HOURS W/O EXTENSIVE PROCEDURE,04,DISEASES AND DISORDERS OF THE RESPIRATORY SYSTEM,3,Major,Moderate,Surgical,Medicaid,,,,,Y,1471122.44,349526.81
New York City,Manhattan,7002053,001463,NYU Langone Hospitals,70 or Older,113,M,Other Race,Not Span/Hispanic,33,Emergency,Expired,2020,INF002,SEPTICEMIA,RES007,AIRWAY INTUBATION,005,TRACHEOSTOMY W MV 96+ HOURS W/O EXTENSIVE PROCEDURE,18,INFECTIOUS AND PARASITIC DISEASES (SYSTEMIC OR UNSPECIFIED SITES),4,Extreme,Extreme,Surgical,Medicare,Blue Cross/Blue Shield,,,,Y,1187424.78,310837.9
New York City,Manhattan,7002053,001463,NYU Langone Hospitals,18 to 29,OOS,M,Other Race,Not Span/Hispanic,22,Emergency,Inpatient Rehabilitation Facility,2020,INF002,SEPTICEMIA,ESA002,EXTRACORPOREAL MEMBRANE OXYGENATION,005,TRACHEOSTOMY W MV 96+ HOURS W/O EXTENSIVE PROCEDURE,18,INFECTIOUS AND PARASITIC DISEASES (SYSTEMIC OR UNSPECIFIED SITES),3,Major,Moderate,Surgical,Medicaid,,,,,Y,789521.9,199646.51
New York City,Manhattan,7002053,001463,NYU Langone Hospitals,30 to 49,101,M,White,Not Span/Hispanic,37,Emergency,Inpatient Rehabilitation Facility,2020,INF002,SEPTICEMIA,ESA002,EXTRACORPOREAL MEMBRANE OXYGENATION,005,TRACHEOSTOMY W MV 96+ HOURS W/O EXTENSIVE PROCEDURE,18,INFECTIOUS AND PARASITIC DISEASES (SYSTEMIC OR UNSPECIFIED SITES),4,Extreme,Major,Surgical,Private Health Insurance,,,,,Y,1297733.98,344098.07
New York City,Manhattan,7002053,001463,NYU Langone Hospitals,70 or Older,112,M,White,Not Span/Hispanic,27,Emergency,Expired,2020,INF012,CORONAVIRUS DISEASE 2019 (COVID-19),RES010,TRACHEOSTOMY,005,TRACHEOSTOMY W MV 96+ HOURS W/O EXTENSIVE PROCEDURE,04,DISEASES AND DISORDERS OF THE RESPIRATORY SYSTEM,4,Extreme,Extreme,Surgical,Medicare,Medicaid,,,,Y,724749.21,218635.94
New York City,Manhattan,7002053,001463,NYU Langone Hospitals,70 or Older,112,M,White,Not Span/Hispanic,29,Emergency,Expired,2020,INF012,CORONAVIRUS DISEASE 2019 (COVID-19),RES007,AIRWAY INTUBATION,005,TRACHEOSTOMY W MV 96+ HOURS W/O EXTENSIVE PROCEDURE,04,DISEASES AND DISORDERS OF THE RESPIRATORY SYSTEM,4,Extreme,Extreme,Surgical,Medicare,,,,,Y,666028.92,223116.96
New York City,Manhattan,7002053,001463,NYU Langone Hospitals,50 to 69,112,F,White,Not Span/Hispanic,41,Emergency,Home w/ Home Health Services,2020,INF012,CORONAVIRUS DISEASE 2019 (COVID-19),RES010,TRACHEOSTOMY,005,TRACHEOSTOMY W MV 96+ HOURS W/O EXTENSIVE PROCEDURE,04,DISEASES AND DISORDERS OF THE RESPIRATORY SYSTEM,3,Major,Major,Surgical,Medicaid,,,,,Y,828920.42,259011.94
New York City,Manhattan,7002053,001463,NYU Langone Hospitals,50 to 69,112,F,Black/African American,Not Span/Hispanic,38,Emergency,Inpatient Rehabilitation Facility,2020,INF012,CORONAVIRUS DISEASE 2019 (COVID-19),RES010,TRACHEOSTOMY,005,TRACHEOSTOMY W MV 96+ HOURS W/O EXTENSIVE PROCEDURE,04,DISEASES AND DISORDERS OF THE RESPIRATORY SYSTEM,4,Extreme,Extreme,Surgical,Blue Cross/Blue Shield,,,,,Y,773809.49,247703.79
New York City,Manhattan,7002053,001463,NYU Langone Hospitals,70 or Older,113,F,White,Not Span/Hispanic,28,Emergency,Hospice - Medical Facility,2020,INF012,CORONAVIRUS DISEASE 2019 (COVID-19),RES010,TRACHEOSTOMY,005,TRACHEOSTOMY W MV 96+ HOURS W/O EXTENSIVE PROCEDURE,04,DISEASES AND DISORDERS OF THE RESPIRATORY SYSTEM,4,Extreme,Extreme,Surgical,Private Health Insurance,Medicare,,,,Y,703693.21,220877.15
New York City,Manhattan,7002053,001463,NYU Langone Hospitals,50 to 69,114,M,Black/African American,Not Span/Hispanic,14,Emergency,Expired,2020,INF012,CORONAVIRUS DISEASE 2019 (COVID-19),ESA003,MECHANICAL VENTILATION,005,TRACHEOSTOMY W MV 96+ HOURS W/O EXTENSIVE PROCEDURE,04,DISEASES AND DISORDERS OF THE RESPIRATORY SYSTEM,4,Extreme,Major,Surgical,Medicare,Blue Cross/Blue Shield,,,,N,416570.23,119430.31
New York City,Manhattan,7002053,001463,NYU Langone Hospitals,30 to 49,112,M,Other Race,Not Span/Hispanic,27,Emergency,Inpatient Rehabilitation Facility,2020,INF012,CORONAVIRUS DISEASE 2019 (COVID-19),OTR004,ISOLATION PROCEDURES,005,TRACHEOSTOMY W MV 96+ HOURS W/O EXTENSIVE PROCEDURE,04,DISEASES AND DISORDERS OF THE RESPIRATORY SYSTEM,3,Major,Moderate,Surgical,Medicaid,,,,,Y,876377.47,243787.07
New York City,Manhattan,7002053,001463,NYU Langone Hospitals,70 or Older,100,M,White,Not Span/Hispanic,41,Emergency,Inpatient Rehabilitation Facility,2020,INF012,CORONAVIRUS DISEASE 2019 (COVID-19),RES010,TRACHEOSTOMY,005,TRACHEOSTOMY W MV 96+ HOURS W/O EXTENSIVE PROCEDURE,04,DISEASES AND DISORDERS OF THE RESPIRATORY SYSTEM,4,Extreme,Extreme,Surgical,Medicare,Private Health Insurance,,,,Y,752430.9,243733.25
New York City,Manhattan,7002053,001463,NYU Langone Hospitals,50 to 69,112,M,Other Race,Not Span/Hispanic,41,Emergency,Inpatient Rehabilitation Facility,2020,INF002,SEPTICEMIA,RES010,TRACHEOSTOMY,005,TRACHEOSTOMY W MV 96+ HOURS W/O EXTENSIVE PROCEDURE,18,INFECTIOUS AND PARASITIC DISEASES (SYSTEMIC OR UNSPECIFIED SITES),3,Major,Major,Surgical,Medicaid,,,,,Y,966051.06,290866.77
New York City,Manhattan,7002053,001463,NYU Langone Hospitals,30 to 49,112,F,Other Race,Not Span/Hispanic,49,Emergency,Inpatient Rehabilitation Facility,2020,INF002,SEPTICEMIA,ADM012,CHEMOTHERAPY,005,TRACHEOSTOMY W MV 96+ HOURS W/O EXTENSIVE PROCEDURE,18,INFECTIOUS AND PARASITIC DISEASES (SYSTEMIC OR UNSPECIFIED SITES),4,Extreme,Extreme,Surgical,Private Health Insurance,,,,,Y,1848090.1,466279.97
New York City,Manhattan,7002053,001463,NYU Langone Hospitals,50 to 69,112,M,White,Not Span/Hispanic,41,Emergency,Home w/ Home Health Services,2020,INF002,SEPTICEMIA,RES010,TRACHEOSTOMY,005,TRACHEOSTOMY W MV 96+ HOURS W/O EXTENSIVE PROCEDURE,18,INFECTIOUS AND PARASITIC DISEASES (SYSTEMIC OR UNSPECIFIED SITES),4,Extreme,Extreme,Surgical,Medicaid,,,,,Y,996107.59,306823.82
New York City,Manhattan,7002053,001463,NYU Langone Hospitals,30 to 49,112,M,Other Race,Not Span/Hispanic,41,Emergency,Home w/ Home Health Services,2020,INF002,SEPTICEMIA,RES007,AIRWAY INTUBATION,005,TRACHEOSTOMY W MV 96+ HOURS W/O EXTENSIVE PROCEDURE,18,INFECTIOUS AND PARASITIC DISEASES (SYSTEMIC OR UNSPECIFIED SITES),4,Extreme,Extreme,Surgical,Medicaid,,,,,Y,910270.99,279190.65
New York City,Manhattan,7002053,001463,NYU Langone Hospitals,30 to 49,112,F,Other Race,Not Span/Hispanic,34,Emergency,Skilled Nursing Home,2020,INF012,CORONAVIRUS DISEASE 2019 (COVID-19),RES010,TRACHEOSTOMY,005,TRACHEOSTOMY W MV 96+ HOURS W/O EXTENSIVE PROCEDURE,04,DISEASES AND DISORDERS OF THE RESPIRATORY SYSTEM,4,Extreme,Extreme,Surgical,Medicaid,,,,,Y,561559.07,193447.49
New York City,Manhattan,7002053,001463,NYU Langone Hospitals,70 or Older,112,M,White,Not Span/Hispanic,45,Emergency,Skilled Nursing Home,2020,INF012,CORONAVIRUS DISEASE 2019 (COVID-19),RES007,AIRWAY INTUBATION,005,TRACHEOSTOMY W MV 96+ HOURS W/O EXTENSIVE PROCEDURE,04,DISEASES AND DISORDERS OF THE RESPIRATORY SYSTEM,4,Extreme,Extreme,Surgical,Private Health Insurance,Medicare,,,,Y,886861.67,243216.54
New York City,Manhattan,7002053,001463,NYU Langone Hospitals,70 or Older,112,M,White,Not Span/Hispanic,43,Emergency,Skilled Nursing Home,2020,INF002,SEPTICEMIA,RES010,TRACHEOSTOMY,005,TRACHEOSTOMY W MV 96+ HOURS W/O EXTENSIVE PROCEDURE,18,INFECTIOUS AND PARASITIC DISEASES (SYSTEMIC OR UNSPECIFIED SITES),4,Extreme,Extreme,Surgical,Medicare,Private Health Insurance,,,,Y,845156.27,277101.3
New York City,Manhattan,7002053,001463,NYU Langone Hospitals,30 to 49,112,M,White,Not Span/Hispanic,29,Emergency,Inpatient Rehabilitation Facility,2020,INF002,SEPTICEMIA,ESA002,EXTRACORPOREAL MEMBRANE OXYGENATION,005,TRACHEOSTOMY W MV 96+ HOURS W/O EXTENSIVE PROCEDURE,18,INFECTIOUS AND PARASITIC DISEASES (SYSTEMIC OR UNSPECIFIED SITES),3,Major,Major,Surgical,Blue Cross/Blue Shield,,,,,Y,1288657.86,304420.03
New York City,Manhattan,7002053,001463,NYU Langone Hospitals,70 or Older,112,M,White,Not Span/Hispanic,47,Emergency,Home w/ Home Health Services,2020,INF012,CORONAVIRUS DISEASE 2019 (COVID-19),RES007,AIRWAY INTUBATION,005,TRACHEOSTOMY W MV 96+ HOURS W/O EXTENSIVE PROCEDURE,04,DISEASES AND DISORDERS OF THE RESPIRATORY SYSTEM,4,Extreme,Major,Surgical,Medicare,Medicaid,,,,Y,819223.49,292332.7
New York City,Manhattan,7002053,001463,NYU Langone Hospitals,70 or Older,112,M,White,Not Span/Hispanic,41,Emergency,Medicare Cert Long Term Care Hospital,2020,INF012,CORONAVIRUS DISEASE 2019 (COVID-19),RES007,AIRWAY INTUBATION,005,TRACHEOSTOMY W MV 96+ HOURS W/O EXTENSIVE PROCEDURE,04,DISEASES AND DISORDERS OF THE RESPIRATORY SYSTEM,4,Extreme,Extreme,Surgical,Medicare,Medicaid,,,,Y,861284.74,307178.94
New York City,Manhattan,7002053,001463,NYU Langone Hospitals,50 to 69,103,M,White,Not Span/Hispanic,49,Emergency,Inpatient Rehabilitation Facility,2020,INF002,SEPTICEMIA,ESA003,MECHANICAL VENTILATION,005,TRACHEOSTOMY W MV 96+ HOURS W/O EXTENSIVE PROCEDURE,18,INFECTIOUS AND PARASITIC DISEASES (SYSTEMIC OR UNSPECIFIED SITES),4,Extreme,Extreme,Surgical,Blue Cross/Blue Shield,,,,,Y,1397236.07,367949.21
New York City,Manhattan,7002053,001463,NYU Langone Hospitals,70 or Older,112,F,White,Not Span/Hispanic,56,Emergency,Home w/ Home Health Services,2020,INF012,CORONAVIRUS DISEASE 2019 (COVID-19),RES010,TRACHEOSTOMY,005,TRACHEOSTOMY W MV 96+ HOURS W/O EXTENSIVE PROCEDURE,04,DISEASES AND DISORDERS OF THE RESPIRATORY SYSTEM,4,Extreme,Extreme,Surgical,Medicare,Medicaid,,,,Y,1093289.95,273629.99
New York City,Manhattan,7002053,001463,NYU Langone Hospitals,70 or Older,112,M,White,Not Span/Hispanic,37,Emergency,Skilled Nursing Home,2020,INF002,SEPTICEMIA,ESA003,MECHANICAL VENTILATION,005,TRACHEOSTOMY W MV 96+ HOURS W/O EXTENSIVE PROCEDURE,18,INFECTIOUS AND PARASITIC DISEASES (SYSTEMIC OR UNSPECIFIED SITES),4,Extreme,Extreme,Surgical,Medicare,Medicaid,,,,Y,727333.92,262897
New York City,Manhattan,7002053,001463,NYU Langone Hospitals,50 to 69,100,M,Other Race,Not Span/Hispanic,35,Emergency,Inpatient Rehabilitation Facility,2020,INF012,CORONAVIRUS DISEASE 2019 (COVID-19),RES010,TRACHEOSTOMY,005,TRACHEOSTOMY W MV 96+ HOURS W/O EXTENSIVE PROCEDURE,04,DISEASES AND DISORDERS OF THE RESPIRATORY SYSTEM,4,Extreme,Extreme,Surgical,Private Health Insurance,,,,,Y,1177755.62,296531.16
New York City,Manhattan,7002053,001463,NYU Langone Hospitals,50 to 69,112,M,White,Not Span/Hispanic,49,Emergency,Home w/ Home Health Services,2020,INF002,SEPTICEMIA,RES007,AIRWAY INTUBATION,005,TRACHEOSTOMY W MV 96+ HOURS W/O EXTENSIVE PROCEDURE,18,INFECTIOUS AND PARASITIC DISEASES (SYSTEMIC OR UNSPECIFIED SITES),4,Extreme,Extreme,Surgical,Medicare,Medicare,,,,Y,1003826.48,280581.92
New York City,Manhattan,7002053,001463,NYU Langone Hospitals,50 to 69,113,F,White,Not Span/Hispanic,35,Emergency,Expired,2020,INF012,CORONAVIRUS DISEASE 2019 (COVID-19),RES010,TRACHEOSTOMY,005,TRACHEOSTOMY W MV 96+ HOURS W/O EXTENSIVE PROCEDURE,04,DISEASES AND DISORDERS OF THE RESPIRATORY SYSTEM,4,Extreme,Extreme,Surgical,Medicare,Private Health Insurance,,,,Y,866068.56,243610.89
New York City,Manhattan,7002053,001463,NYU Langone Hospitals,70 or Older,112,M,White,Not Span/Hispanic,58,Emergency,Expired,2020,INF012,CORONAVIRUS DISEASE 2019 (COVID-19),ESA003,MECHANICAL VENTILATION,005,TRACHEOSTOMY W MV 96+ HOURS W/O EXTENSIVE PROCEDURE,04,DISEASES AND DISORDERS OF THE RESPIRATORY SYSTEM,4,Extreme,Extreme,Surgical,Medicare,Medicare,,,,Y,1326246.52,367649.19
New York City,Manhattan,7002053,001463,NYU Langone Hospitals,50 to 69,112,M,Other Race,Unknown,58,Emergency,Inpatient Rehabilitation Facility,2020,INF002,SEPTICEMIA,CAR024,VENOUS AND ARTERIAL CATHETER PLACEMENT,005,TRACHEOSTOMY W MV 96+ HOURS W/O EXTENSIVE PROCEDURE,18,INFECTIOUS AND PARASITIC DISEASES (SYSTEMIC OR UNSPECIFIED SITES),4,Extreme,Extreme,Surgical,Medicare,Private Health Insurance,,,,Y,1246054.76,387274.53
New York City,Manhattan,7002053,001463,NYU Langone Hospitals,70 or Older,112,M,White,Not Span/Hispanic,54,Emergency,Inpatient Rehabilitation Facility,2020,INF012,CORONAVIRUS DISEASE 2019 (COVID-19),RES010,TRACHEOSTOMY,005,TRACHEOSTOMY W MV 96+ HOURS W/O EXTENSIVE PROCEDURE,04,DISEASES AND DISORDERS OF THE RESPIRATORY SYSTEM,4,Extreme,Extreme,Surgical,Medicare,Private Health Insurance,,,,Y,1051271.73,326473.67
New York City,Manhattan,7002053,001463,NYU Langone Hospitals,50 to 69,112,M,Other Race,Not Span/Hispanic,54,Emergency,Inpatient Rehabilitation Facility,2020,INF012,CORONAVIRUS DISEASE 2019 (COVID-19),RES007,AIRWAY INTUBATION,005,TRACHEOSTOMY W MV 96+ HOURS W/O EXTENSIVE PROCEDURE,04,DISEASES AND DISORDERS OF THE RESPIRATORY SYSTEM,4,Extreme,Extreme,Surgical,Medicaid,,,,,Y,1298488.17,393382.51
New York City,Manhattan,7002053,001463,NYU Langone Hospitals,50 to 69,111,F,White,Not Span/Hispanic,38,Emergency,Expired,2020,INF002,SEPTICEMIA,RES007,AIRWAY INTUBATION,005,TRACHEOSTOMY W MV 96+ HOURS W/O EXTENSIVE PROCEDURE,18,INFECTIOUS AND PARASITIC DISEASES (SYSTEMIC OR UNSPECIFIED SITES),4,Extreme,Extreme,Surgical,Medicaid,,,,,Y,1194881.6,338368.85
New York City,Manhattan,7002053,001463,NYU Langone Hospitals,50 to 69,112,M,White,Not Span/Hispanic,57,Emergency,Inpatient Rehabilitation Facility,2020,INF002,SEPTICEMIA,ESA003,MECHANICAL VENTILATION,005,TRACHEOSTOMY W MV 96+ HOURS W/O EXTENSIVE PROCEDURE,18,INFECTIOUS AND PARASITIC DISEASES (SYSTEMIC OR UNSPECIFIED SITES),4,Extreme,Extreme,Surgical,Medicaid,,,,,Y,1378382.86,391362.45
New York City,Manhattan,7002053,001463,NYU Langone Hospitals,50 to 69,112,F,Other Race,Not Span/Hispanic,62,Emergency,Expired,2020,INF002,SEPTICEMIA,ESA003,MECHANICAL VENTILATION,005,TRACHEOSTOMY W MV 96+ HOURS W/O EXTENSIVE PROCEDURE,18,INFECTIOUS AND PARASITIC DISEASES (SYSTEMIC OR UNSPECIFIED SITES),4,Extreme,Extreme,Surgical,Medicare,,,,,Y,1753653.74,468230.21
New York City,Manhattan,7002053,001463,NYU Langone Hospitals,50 to 69,112,M,White,Not Span/Hispanic,56,Emergency,Medicare Cert Long Term Care Hospital,2020,INF012,CORONAVIRUS DISEASE 2019 (COVID-19),RES010,TRACHEOSTOMY,005,TRACHEOSTOMY W MV 96+ HOURS W/O EXTENSIVE PROCEDURE,04,DISEASES AND DISORDERS OF THE RESPIRATORY SYSTEM,4,Extreme,Extreme,Surgical,Medicaid,,,,,Y,1503957.14,435190.56
New York City,Manhattan,7002053,001463,NYU Langone Hospitals,50 to 69,113,M,Other Race,Not Span/Hispanic,56,Emergency,Skilled Nursing Home,2020,INF012,CORONAVIRUS DISEASE 2019 (COVID-19),ESA003,MECHANICAL VENTILATION,005,TRACHEOSTOMY W MV 96+ HOURS W/O EXTENSIVE PROCEDURE,04,DISEASES AND DISORDERS OF THE RESPIRATORY SYSTEM,4,Extreme,Major,Surgical,Private Health Insurance,,,,,Y,1386054.12,438009.9
New York City,Manhattan,7002053,001463,NYU Langone Hospitals,50 to 69,112,M,White,Not Span/Hispanic,58,Emergency,Home w/ Home Health Services,2020,INF002,SEPTICEMIA,RES010,TRACHEOSTOMY,005,TRACHEOSTOMY W MV 96+ HOURS W/O EXTENSIVE PROCEDURE,18,INFECTIOUS AND PARASITIC DISEASES (SYSTEMIC OR UNSPECIFIED SITES),4,Extreme,Extreme,Surgical,Medicare,Medicare,,,,Y,1177148.8,408989.94
New York City,Manhattan,7002053,001463,NYU Langone Hospitals,70 or Older,115,M,White,Not Span/Hispanic,56,Emergency,Inpatient Rehabilitation Facility,2020,INF012,CORONAVIRUS DISEASE 2019 (COVID-19),CAR006,CAROTID ENDARTERECTOMY AND STENTING,005,TRACHEOSTOMY W MV 96+ HOURS W/O EXTENSIVE PROCEDURE,04,DISEASES AND DISORDERS OF THE RESPIRATORY SYSTEM,4,Extreme,Extreme,Surgical,Medicare,Private Health Insurance,,,,Y,1375833.42,373606.55