Hospital Service Area,Hospital County,Operating Certificate Number,Permanent Facility Id,Facility Name,Age Group,Zip Code - 3 digits,Gender,Race,Ethnicity,Length of Stay,Type of Admission,Patient Disposition,Discharge Year,CCS Diagnosis Code,CCS Diagnosis Description,CCS Procedure Code,CCS Procedure Description,APR DRG Code,APR DRG Description,APR MDC Code,APR MDC Description,APR Severity of Illness Code,APR Severity of Illness Description,APR Risk of Mortality,APR Medical Surgical Description,Payment Typology 1,Payment Typology 2,Payment Typology 3,Birth Weight,Abortion Edit Indicator,Emergency Department Indicator,Total Charges,Total Costs
Long Island,Suffolk,5123000,000885,Long Island Community Hospital,50 to 69,117,M,White,Not Span/Hispanic,77,Emergency,Skilled Nursing Home,2020,INF002,SEPTICEMIA,RES010,TRACHEOSTOMY,005,TRACHEOSTOMY W MV 96+ HOURS W/O EXTENSIVE PROCEDURE,18,INFECTIOUS AND PARASITIC DISEASES (SYSTEMIC OR UNSPECIFIED SITES),3,Major,Extreme,Surgical,Medicare,Medicare,Medicaid,,,Y,728715.89,174097.86
Long Island,Suffolk,5123000,000885,Long Island Community Hospital,70 or Older,119,M,White,Not Span/Hispanic,41,Emergency,Home or Self Care,2020,INJ008,"TRAUMATIC BRAIN INJURY (TBI); CONCUSSION, INITIAL ENCOUNTER",RES010,TRACHEOSTOMY,005,TRACHEOSTOMY W MV 96+ HOURS W/O EXTENSIVE PROCEDURE,01,DISEASES AND DISORDERS OF THE NERVOUS SYSTEM,3,Major,Extreme,Surgical,Private Health Insurance,Medicare,,,,Y,621625.19,103044.53
Long Island,Suffolk,5123000,000885,Long Island Community Hospital,50 to 69,117,M,White,Not Span/Hispanic,28,Emergency,Skilled Nursing Home,2020,INJ008,"TRAUMATIC BRAIN INJURY (TBI); CONCUSSION, INITIAL ENCOUNTER",RES010,TRACHEOSTOMY,005,TRACHEOSTOMY W MV 96+ HOURS W/O EXTENSIVE PROCEDURE,01,DISEASES AND DISORDERS OF THE NERVOUS SYSTEM,4,Extreme,Extreme,Surgical,Medicare,Medicare,Medicaid,,,Y,1146807.15,195411.5
Long Island,Suffolk,5123000,000885,Long Island Community Hospital,70 or Older,117,F,White,Not Span/Hispanic,24,Emergency,Skilled Nursing Home,2020,INF002,SEPTICEMIA,RES010,TRACHEOSTOMY,005,TRACHEOSTOMY W MV 96+ HOURS W/O EXTENSIVE PROCEDURE,18,INFECTIOUS AND PARASITIC DISEASES (SYSTEMIC OR UNSPECIFIED SITES),4,Extreme,Extreme,Surgical,Medicare,Medicare,Medicaid,,,Y,300322.21,54239.42
Long Island,Suffolk,5123000,000885,Long Island Community Hospital,50 to 69,117,M,White,Not Span/Hispanic,96,Emergency,Skilled Nursing Home,2020,RSP008,CHRONIC OBSTRUCTIVE PULMONARY DISEASE AND BRONCHIECTASIS,RES010,TRACHEOSTOMY,005,TRACHEOSTOMY W MV 96+ HOURS W/O EXTENSIVE PROCEDURE,04,DISEASES AND DISORDERS OF THE RESPIRATORY SYSTEM,4,Extreme,Extreme,Surgical,Private Health Insurance,Medicaid,,,,Y,1040349.23,194501.01
Long Island,Suffolk,5123000,000885,Long Island Community Hospital,70 or Older,117,M,Black/African American,Not Span/Hispanic,77,Emergency,Expired,2020,INF002,SEPTICEMIA,RES010,TRACHEOSTOMY,005,TRACHEOSTOMY W MV 96+ HOURS W/O EXTENSIVE PROCEDURE,18,INFECTIOUS AND PARASITIC DISEASES (SYSTEMIC OR UNSPECIFIED SITES),4,Extreme,Extreme,Surgical,Medicare,Medicare,Medicaid,,,Y,1227026.95,247676.1
Long Island,Suffolk,5123000,000885,Long Island Community Hospital,70 or Older,117,F,White,Not Span/Hispanic,37,Emergency,Skilled Nursing Home,2020,INF002,SEPTICEMIA,RES010,TRACHEOSTOMY,005,TRACHEOSTOMY W MV 96+ HOURS W/O EXTENSIVE PROCEDURE,18,INFECTIOUS AND PARASITIC DISEASES (SYSTEMIC OR UNSPECIFIED SITES),3,Major,Extreme,Surgical,Medicare,,,,,Y,503610.81,88493.15
Long Island,Suffolk,5123000,000885,Long Island Community Hospital,50 to 69,117,M,White,Not Span/Hispanic,72,Emergency,Skilled Nursing Home,2020,INF002,SEPTICEMIA,RES007,AIRWAY INTUBATION,005,TRACHEOSTOMY W MV 96+ HOURS W/O EXTENSIVE PROCEDURE,18,INFECTIOUS AND PARASITIC DISEASES (SYSTEMIC OR UNSPECIFIED SITES),4,Extreme,Extreme,Surgical,Medicaid,,,,,Y,690194.32,136299.24
Long Island,Suffolk,5123000,000885,Long Island Community Hospital,50 to 69,119,F,White,Not Span/Hispanic,44,Emergency,Expired,2020,INF002,SEPTICEMIA,ESA005,CARDIAC CHEST COMPRESSION,005,TRACHEOSTOMY W MV 96+ HOURS W/O EXTENSIVE PROCEDURE,18,INFECTIOUS AND PARASITIC DISEASES (SYSTEMIC OR UNSPECIFIED SITES),4,Extreme,Extreme,Surgical,Private Health Insurance,Medicaid,,,,Y,606876.08,166232.63
Long Island,Suffolk,5123000,000885,Long Island Community Hospital,70 or Older,117,M,White,Not Span/Hispanic,95,Emergency,Home w/ Home Health Services,2020,INF012,CORONAVIRUS DISEASE 2019 (COVID-19),RES010,TRACHEOSTOMY,005,TRACHEOSTOMY W MV 96+ HOURS W/O EXTENSIVE PROCEDURE,04,DISEASES AND DISORDERS OF THE RESPIRATORY SYSTEM,4,Extreme,Extreme,Surgical,Medicare,Medicare,Private Health Insurance,,,Y,978707.76,192490.25
Long Island,Suffolk,5123000,000885,Long Island Community Hospital,70 or Older,117,M,White,Not Span/Hispanic,88,Emergency,Skilled Nursing Home,2020,INF002,SEPTICEMIA,RES010,TRACHEOSTOMY,005,TRACHEOSTOMY W MV 96+ HOURS W/O EXTENSIVE PROCEDURE,18,INFECTIOUS AND PARASITIC DISEASES (SYSTEMIC OR UNSPECIFIED SITES),4,Extreme,Major,Surgical,Medicare,Medicare,Blue Cross/Blue Shield,,,Y,954269.06,188021.42
Long Island,Suffolk,5123000,000885,Long Island Community Hospital,50 to 69,119,M,White,Not Span/Hispanic,70,Emergency,Skilled Nursing Home,2020,INF002,SEPTICEMIA,RES010,TRACHEOSTOMY,005,TRACHEOSTOMY W MV 96+ HOURS W/O EXTENSIVE PROCEDURE,18,INFECTIOUS AND PARASITIC DISEASES (SYSTEMIC OR UNSPECIFIED SITES),4,Extreme,Extreme,Surgical,Medicare,Medicare,Medicaid,,,Y,756680.41,166556.58
Long Island,Suffolk,5123000,000885,Long Island Community Hospital,50 to 69,117,F,White,Not Span/Hispanic,112,Emergency,Expired,2020,INF002,SEPTICEMIA,ESA003,MECHANICAL VENTILATION,005,TRACHEOSTOMY W MV 96+ HOURS W/O EXTENSIVE PROCEDURE,18,INFECTIOUS AND PARASITIC DISEASES (SYSTEMIC OR UNSPECIFIED SITES),4,Extreme,Extreme,Surgical,Medicaid,,,,,N,1277241.47,300457.81
Long Island,Suffolk,5123000,000885,Long Island Community Hospital,50 to 69,117,F,Other Race,Not Span/Hispanic,53,Emergency,Skilled Nursing Home,2020,INF002,SEPTICEMIA,RES010,TRACHEOSTOMY,005,TRACHEOSTOMY W MV 96+ HOURS W/O EXTENSIVE PROCEDURE,18,INFECTIOUS AND PARASITIC DISEASES (SYSTEMIC OR UNSPECIFIED SITES),4,Extreme,Major,Surgical,Medicare,Medicare,,,,Y,615464.83,113625.12
Long Island,Suffolk,5123000,000885,Long Island Community Hospital,70 or Older,119,F,White,Not Span/Hispanic,31,Emergency,Expired,2020,INJ003,"FRACTURE OF TORSO, INITIAL ENCOUNTER",RES010,TRACHEOSTOMY,005,TRACHEOSTOMY W MV 96+ HOURS W/O EXTENSIVE PROCEDURE,04,DISEASES AND DISORDERS OF THE RESPIRATORY SYSTEM,4,Extreme,Extreme,Surgical,Medicare,,,,,Y,513120.3,85232.94
Long Island,Suffolk,5123000,000885,Long Island Community Hospital,70 or Older,117,M,White,Not Span/Hispanic,22,Emergency,Expired,2020,INF002,SEPTICEMIA,RES010,TRACHEOSTOMY,005,TRACHEOSTOMY W MV 96+ HOURS W/O EXTENSIVE PROCEDURE,18,INFECTIOUS AND PARASITIC DISEASES (SYSTEMIC OR UNSPECIFIED SITES),4,Extreme,Extreme,Surgical,Medicare,,,,,Y,386351.87,90921.8
Long Island,Suffolk,5123000,000885,Long Island Community Hospital,70 or Older,117,F,White,Not Span/Hispanic,34,Emergency,Skilled Nursing Home,2020,INJ020,"EFFECT OF FOREIGN BODY ENTERING OPENING, INITIAL ENCOUNTER",RES010,TRACHEOSTOMY,005,TRACHEOSTOMY W MV 96+ HOURS W/O EXTENSIVE PROCEDURE,04,DISEASES AND DISORDERS OF THE RESPIRATORY SYSTEM,4,Extreme,Extreme,Surgical,Medicare,,,,,Y,373464.05,96597.44
Long Island,Suffolk,5123000,000885,Long Island Community Hospital,50 to 69,119,M,White,Not Span/Hispanic,56,Emergency,Expired,2020,INF002,SEPTICEMIA,RES010,TRACHEOSTOMY,005,TRACHEOSTOMY W MV 96+ HOURS W/O EXTENSIVE PROCEDURE,18,INFECTIOUS AND PARASITIC DISEASES (SYSTEMIC OR UNSPECIFIED SITES),4,Extreme,Extreme,Surgical,Private Health Insurance,,,,,Y,443740.54,97177.96
Long Island,Suffolk,5123000,000885,Long Island Community Hospital,70 or Older,117,F,White,Not Span/Hispanic,28,Emergency,Expired,2020,MBD012,SUICIDAL IDEATION/ATTEMPT/INTENTIONAL SELF-HARM,RES010,TRACHEOSTOMY,005,TRACHEOSTOMY W MV 96+ HOURS W/O EXTENSIVE PROCEDURE,21,"INJURIES, POISONINGS AND TOXIC EFFECTS OF DRUGS",4,Extreme,Major,Surgical,Medicare,Medicare,Medicaid,,,Y,394395.58,90130.07
Long Island,Suffolk,5123000,000885,Long Island Community Hospital,50 to 69,117,M,White,Not Span/Hispanic,49,Emergency,Hospice - Medical Facility,2020,INF002,SEPTICEMIA,GIS017,GASTROSTOMY,005,TRACHEOSTOMY W MV 96+ HOURS W/O EXTENSIVE PROCEDURE,18,INFECTIOUS AND PARASITIC DISEASES (SYSTEMIC OR UNSPECIFIED SITES),4,Extreme,Extreme,Surgical,Private Health Insurance,Medicaid,,,,Y,676756.49,122400.05
