Hospital Service Area,Hospital County,Operating Certificate Number,Permanent Facility Id,Facility Name,Age Group,Zip Code - 3 digits,Gender,Race,Ethnicity,Length of Stay,Type of Admission,Patient Disposition,Discharge Year,CCS Diagnosis Code,CCS Diagnosis Description,CCS Procedure Code,CCS Procedure Description,APR DRG Code,APR DRG Description,APR MDC Code,APR MDC Description,APR Severity of Illness Code,APR Severity of Illness Description,APR Risk of Mortality,APR Medical Surgical Description,Payment Typology 1,Payment Typology 2,Payment Typology 3,Birth Weight,Abortion Edit Indicator,Emergency Department Indicator,Total Charges,Total Costs
New York City,Manhattan,7002001,001438,Bellevue Hospital Center,50 to 69,112,M,White,Not Span/Hispanic,1,Emergency,Short-term Hospital,2017,076,Meningitis (except that caused by tuberculosis or sexually transmitted disease),216,RESP INTUB/MECH VENTIL,050,Non-bacterial infections of nervous system exc viral meningitis,01,Diseases and Disorders of the Nervous System,3,Major,Extreme,Medical,Self-Pay,,,,N,N,11460.96,7389.43
New York City,Manhattan,7002001,001438,Bellevue Hospital Center,50 to 69,100,M,Other Race,Not Span/Hispanic,1,Emergency,Home or Self Care,2017,007,Viral infection,041,OT NON-OR THER PRC RESP,050,Non-bacterial infections of nervous system exc viral meningitis,01,Diseases and Disorders of the Nervous System,1,Minor,Minor,Medical,Medicaid,Medicaid,,,N,Y,8468.03,5459.75
New York City,Manhattan,7002001,001438,Bellevue Hospital Center,30 to 49,113,F,Other Race,Spanish/Hispanic,4,Emergency,Home or Self Care,2017,076,Meningitis (except that caused by tuberculosis or sexually transmitted disease),231,OTHER THERAPEUTIC PRCS,050,Non-bacterial infections of nervous system exc viral meningitis,01,Diseases and Disorders of the Nervous System,2,Moderate,Moderate,Medical,Medicaid,,,,N,Y,28207.70,18186.86
New York City,Manhattan,7002001,001438,Bellevue Hospital Center,30 to 49,104,F,Other Race,Not Span/Hispanic,4,Emergency,Home or Self Care,2017,076,Meningitis (except that caused by tuberculosis or sexually transmitted disease),231,OTHER THERAPEUTIC PRCS,050,Non-bacterial infections of nervous system exc viral meningitis,01,Diseases and Disorders of the Nervous System,1,Minor,Minor,Medical,Self-Pay,,,,N,Y,24072.14,15520.46
New York City,Manhattan,7002001,001438,Bellevue Hospital Center,50 to 69,100,M,Other Race,Not Span/Hispanic,1,Emergency,Home or Self Care,2017,077,Encephalitis (except that caused by tuberculosis or sexually transmitted disease),177,COMP AXIAL TOMOGR (CT),050,Non-bacterial infections of nervous system exc viral meningitis,01,Diseases and Disorders of the Nervous System,2,Moderate,Minor,Medical,Medicare,Medicare,,,N,Y,8784.20,5663.60
New York City,Manhattan,7002001,001438,Bellevue Hospital Center,18 to 29,104,M,Other Race,Spanish/Hispanic,3,Emergency,Home or Self Care,2017,076,Meningitis (except that caused by tuberculosis or sexually transmitted disease),063,OT NON-OR THER CARDIO,050,Non-bacterial infections of nervous system exc viral meningitis,01,Diseases and Disorders of the Nervous System,1,Minor,Minor,Medical,Medicaid,Medicaid,,,N,Y,33331.89,21490.67
New York City,Manhattan,7002001,001438,Bellevue Hospital Center,70 or Older,114,F,Other Race,Spanish/Hispanic,8,Emergency,Home or Self Care,2017,076,Meningitis (except that caused by tuberculosis or sexually transmitted disease),004,DIAGNOSTIC SPINAL TAP,050,Non-bacterial infections of nervous system exc viral meningitis,01,Diseases and Disorders of the Nervous System,2,Moderate,Moderate,Medical,Medicare,Medicare,,,N,N,55500.42,35783.78
New York City,Manhattan,7002001,001438,Bellevue Hospital Center,18 to 29,100,F,Black/African American,Not Span/Hispanic,5,Emergency,Home or Self Care,2017,076,Meningitis (except that caused by tuberculosis or sexually transmitted disease),000,NO PROC,050,Non-bacterial infections of nervous system exc viral meningitis,01,Diseases and Disorders of the Nervous System,2,Moderate,Minor,Medical,Private Health Insurance,Medicaid,,,N,Y,37972.10,24482.44
New York City,Manhattan,7002001,001438,Bellevue Hospital Center,50 to 69,112,M,Black/African American,Not Span/Hispanic,9,Emergency,Another Type Not Listed,2017,076,Meningitis (except that caused by tuberculosis or sexually transmitted disease),180,OTHER CT SCAN,050,Non-bacterial infections of nervous system exc viral meningitis,01,Diseases and Disorders of the Nervous System,1,Minor,Minor,Medical,"Managed Care, Unspecified",Medicaid,,,N,Y,58098.84,37459.11
New York City,Manhattan,7002001,001438,Bellevue Hospital Center,18 to 29,104,F,Other Race,Not Span/Hispanic,3,Emergency,Home or Self Care,2017,076,Meningitis (except that caused by tuberculosis or sexually transmitted disease),004,DIAGNOSTIC SPINAL TAP,050,Non-bacterial infections of nervous system exc viral meningitis,01,Diseases and Disorders of the Nervous System,1,Minor,Minor,Medical,Medicaid,Medicaid,,,N,Y,23655.27,15251.69
New York City,Manhattan,7002001,001438,Bellevue Hospital Center,50 to 69,112,M,White,Not Span/Hispanic,12,Emergency,Home or Self Care,2017,077,Encephalitis (except that caused by tuberculosis or sexually transmitted disease),000,NO PROC,050,Non-bacterial infections of nervous system exc viral meningitis,01,Diseases and Disorders of the Nervous System,2,Moderate,Moderate,Medical,Private Health Insurance,,,,N,Y,65584.93,42285.75
New York City,Manhattan,7002001,001438,Bellevue Hospital Center,18 to 29,113,F,Other Race,Not Span/Hispanic,21,Emergency,Home or Self Care,2017,077,Encephalitis (except that caused by tuberculosis or sexually transmitted disease),215,OT PHYS THER/REHAB,050,Non-bacterial infections of nervous system exc viral meningitis,01,Diseases and Disorders of the Nervous System,2,Moderate,Minor,Medical,Medicaid,Medicaid,,,N,N,37074.84,23903.93
New York City,Manhattan,7002001,001438,Bellevue Hospital Center,0 to 17,112,F,Other Race,Spanish/Hispanic,2,Emergency,Home or Self Care,2017,077,Encephalitis (except that caused by tuberculosis or sexually transmitted disease),198,MAG RESONANCE IMAGING,050,Non-bacterial infections of nervous system exc viral meningitis,01,Diseases and Disorders of the Nervous System,2,Moderate,Minor,Medical,Medicaid,Medicaid,,,N,N,15960.56,10290.54
