Hospital Service Area,Hospital County,Operating Certificate Number,Permanent Facility Id,Facility Name,Age Group,Zip Code - 3 digits,Gender,Race,Ethnicity,Length of Stay,Type of Admission,Patient Disposition,Discharge Year,CCS Diagnosis Code,CCS Diagnosis Description,CCS Procedure Code,CCS Procedure Description,APR DRG Code,APR DRG Description,APR MDC Code,APR MDC Description,APR Severity of Illness Code,APR Severity of Illness Description,APR Risk of Mortality,APR Medical Surgical Description,Payment Typology 1,Payment Typology 2,Payment Typology 3,Birth Weight,Abortion Edit Indicator,Emergency Department Indicator,Total Charges,Total Costs
New York City,Manhattan,7002001,001438,Bellevue Hospital Center,50 to 69,104,M,Other Race,Not Span/Hispanic,3,Emergency,Home or Self Care,2017,029,Cancer of prostate,116,DX PRCS; MALE GENITAL,500,"Malignancy, male reproductive system",12,Diseases and Disorders of the Male Reproductive System,2,Moderate,Moderate,Medical,Medicaid,,,,N,Y,36316.32,23414.87
New York City,Manhattan,7002001,001438,Bellevue Hospital Center,50 to 69,112,M,White,Not Span/Hispanic,7,Emergency,Home or Self Care,2017,029,Cancer of prostate,116,DX PRCS; MALE GENITAL,500,"Malignancy, male reproductive system",12,Diseases and Disorders of the Male Reproductive System,3,Major,Major,Medical,Medicare,Medicaid,,,N,Y,43553.30,28080.90
New York City,Manhattan,7002001,001438,Bellevue Hospital Center,50 to 69,104,M,Other Race,Not Span/Hispanic,4,Emergency,Home or Self Care,2017,029,Cancer of prostate,198,MAG RESONANCE IMAGING,500,"Malignancy, male reproductive system",12,Diseases and Disorders of the Male Reproductive System,2,Moderate,Moderate,Medical,Medicaid,,,,N,Y,33629.75,21682.71
New York City,Manhattan,7002001,001438,Bellevue Hospital Center,50 to 69,112,M,Other Race,Not Span/Hispanic,4,Emergency,Home or Self Care,2017,029,Cancer of prostate,198,MAG RESONANCE IMAGING,500,"Malignancy, male reproductive system",12,Diseases and Disorders of the Male Reproductive System,2,Moderate,Minor,Medical,Self-Pay,,,,N,N,29226.28,18843.59
New York City,Manhattan,7002001,001438,Bellevue Hospital Center,50 to 69,100,M,Black/African American,Not Span/Hispanic,6,Emergency,Home or Self Care,2017,029,Cancer of prostate,000,NO PROC,500,"Malignancy, male reproductive system",12,Diseases and Disorders of the Male Reproductive System,2,Moderate,Moderate,Medical,Medicaid,Medicaid,,,N,N,58121.72,37473.86
New York City,Manhattan,7002001,001438,Bellevue Hospital Center,50 to 69,112,M,Other Race,Not Span/Hispanic,5,Emergency,Home or Self Care,2017,029,Cancer of prostate,000,NO PROC,500,"Malignancy, male reproductive system",12,Diseases and Disorders of the Male Reproductive System,1,Minor,Minor,Medical,Self-Pay,,,,N,N,29590.55,19078.45
New York City,Manhattan,7002001,001438,Bellevue Hospital Center,50 to 69,112,M,Black/African American,Not Span/Hispanic,8,Emergency,Home or Self Care,2017,029,Cancer of prostate,179,CT SCAN ABDOMEN,500,"Malignancy, male reproductive system",12,Diseases and Disorders of the Male Reproductive System,2,Moderate,Moderate,Medical,Medicare,Medicaid,,,N,Y,44694.86,28816.92
New York City,Manhattan,7002001,001438,Bellevue Hospital Center,50 to 69,112,M,White,Not Span/Hispanic,5,Emergency,Home or Self Care,2017,029,Cancer of prostate,222,BLOOD TRANSFUSION,500,"Malignancy, male reproductive system",12,Diseases and Disorders of the Male Reproductive System,3,Major,Major,Medical,Private Health Insurance,,,,N,Y,44424.53,28642.63
