Hospital Service Area,Hospital County,Operating Certificate Number,Permanent Facility Id,Facility Name,Age Group,Zip Code - 3 digits,Gender,Race,Ethnicity,Length of Stay,Type of Admission,Patient Disposition,Discharge Year,CCS Diagnosis Code,CCS Diagnosis Description,CCS Procedure Code,CCS Procedure Description,APR DRG Code,APR DRG Description,APR MDC Code,APR MDC Description,APR Severity of Illness Code,APR Severity of Illness Description,APR Risk of Mortality,APR Medical Surgical Description,Payment Typology 1,Payment Typology 2,Payment Typology 3,Birth Weight,Abortion Edit Indicator,Emergency Department Indicator,Total Charges,Total Costs
Long Island,Nassau,2908000,000511,NYU Langone Hospital-Long Island,70 or Older,115,M,Black/African American,Not Span/Hispanic,11,Emergency,Home w/ Home Health Services,2019,NEO039,MALE REPRODUCTIVE SYSTEM CANCERS - PROSTATE,ADM001,TRANSFUSION OF BLOOD AND BLOOD PRODUCTS,500,"MALIGNANCY, MALE REPRODUCTIVE SYSTEM",12,DISEASES AND DISORDERS OF THE MALE REPRODUCTIVE SYSTEM,3,Major,Major,Medical,Medicare,Medicare,Private Health Insurance,,,true,119143.79,24182.6
Long Island,Nassau,2908000,000511,NYU Langone Hospital-Long Island,70 or Older,117,M,White,Not Span/Hispanic,4,Emergency,Home or Self Care,2019,NEO039,MALE REPRODUCTIVE SYSTEM CANCERS - PROSTATE,MRS004,PROSTATE AND SEMINAL VESICLE PROCEDURES (EXCLUDING PROSTATECTOMY),500,"MALIGNANCY, MALE REPRODUCTIVE SYSTEM",12,DISEASES AND DISORDERS OF THE MALE REPRODUCTIVE SYSTEM,2,Moderate,Moderate,Medical,Medicare,Medicare,Private Health Insurance,,,true,86313.72,12062.07
Long Island,Nassau,2908000,000511,NYU Langone Hospital-Long Island,30 to 49,115,M,White,Not Span/Hispanic,2,Emergency,Home or Self Care,2019,NEO040,MALE REPRODUCTIVE SYSTEM CANCERS - TESTIS,GIS001,ESOPHAGOGASTRODUODENOSCOPY (EGD) WITH BIOPSY,500,"MALIGNANCY, MALE REPRODUCTIVE SYSTEM",12,DISEASES AND DISORDERS OF THE MALE REPRODUCTIVE SYSTEM,2,Moderate,Moderate,Medical,Blue Cross/Blue Shield,,,,,true,75488.7,9124.29
Long Island,Nassau,2908000,000511,NYU Langone Hospital-Long Island,70 or Older,115,M,White,Spanish/Hispanic,8,Emergency,Home w/ Home Health Services,2019,NEO039,MALE REPRODUCTIVE SYSTEM CANCERS - PROSTATE,LYM001,LYMPH NODE BIOPSY,500,"MALIGNANCY, MALE REPRODUCTIVE SYSTEM",12,DISEASES AND DISORDERS OF THE MALE REPRODUCTIVE SYSTEM,2,Moderate,Major,Medical,Medicare,,,,,true,215669.27,25096.85
Long Island,Nassau,2908000,000511,NYU Langone Hospital-Long Island,70 or Older,115,M,White,Not Span/Hispanic,5,Emergency,Home w/ Home Health Services,2019,NEO039,MALE REPRODUCTIVE SYSTEM CANCERS - PROSTATE,,,500,"MALIGNANCY, MALE REPRODUCTIVE SYSTEM",12,DISEASES AND DISORDERS OF THE MALE REPRODUCTIVE SYSTEM,3,Major,Major,Medical,Medicare,Medicare,,,,true,75092.91,12746.47
Long Island,Nassau,2908000,000511,NYU Langone Hospital-Long Island,70 or Older,114,M,Black/African American,Not Span/Hispanic,3,Emergency,Home w/ Home Health Services,2019,NEO039,MALE REPRODUCTIVE SYSTEM CANCERS - PROSTATE,,,500,"MALIGNANCY, MALE REPRODUCTIVE SYSTEM",12,DISEASES AND DISORDERS OF THE MALE REPRODUCTIVE SYSTEM,3,Major,Major,Medical,Medicare,Medicare,,,,true,48246.64,7667.87
Long Island,Nassau,2908000,000511,NYU Langone Hospital-Long Island,50 to 69,115,M,White,Not Span/Hispanic,3,Emergency,Home or Self Care,2019,NEO039,MALE REPRODUCTIVE SYSTEM CANCERS - PROSTATE,,,500,"MALIGNANCY, MALE REPRODUCTIVE SYSTEM",12,DISEASES AND DISORDERS OF THE MALE REPRODUCTIVE SYSTEM,3,Major,Major,Medical,Federal/State/Local/VA,,,,,true,105724.09,11513.03
Long Island,Nassau,2908000,000511,NYU Langone Hospital-Long Island,70 or Older,115,M,Black/African American,Not Span/Hispanic,17,Urgent,Hospice - Medical Facility,2019,NEO039,MALE REPRODUCTIVE SYSTEM CANCERS - PROSTATE,CAR028,INFERIOR VENA CAVA (IVC) FILTER PROCEDURES,500,"MALIGNANCY, MALE REPRODUCTIVE SYSTEM",12,DISEASES AND DISORDERS OF THE MALE REPRODUCTIVE SYSTEM,4,Extreme,Extreme,Medical,Medicare,Medicare,Private Health Insurance,,,false,241039.27,46739
Long Island,Nassau,2908000,000511,NYU Langone Hospital-Long Island,70 or Older,117,M,White,Not Span/Hispanic,12,Emergency,Expired,2019,NEO039,MALE REPRODUCTIVE SYSTEM CANCERS - PROSTATE,MST002,BONE AND JOINT BIOPSY,500,"MALIGNANCY, MALE REPRODUCTIVE SYSTEM",12,DISEASES AND DISORDERS OF THE MALE REPRODUCTIVE SYSTEM,3,Major,Major,Medical,Medicare,Medicare,Private Health Insurance,,,true,228992.96,39041.05
Long Island,Nassau,2908000,000511,NYU Langone Hospital-Long Island,50 to 69,117,M,Black/African American,Not Span/Hispanic,16,Emergency,Skilled Nursing Home,2019,NEO039,MALE REPRODUCTIVE SYSTEM CANCERS - PROSTATE,RAD001,BEAM RADIATION,500,"MALIGNANCY, MALE REPRODUCTIVE SYSTEM",12,DISEASES AND DISORDERS OF THE MALE REPRODUCTIVE SYSTEM,3,Major,Moderate,Medical,Medicaid,,,,,true,193236.38,34008.13
Long Island,Nassau,2908000,000511,NYU Langone Hospital-Long Island,50 to 69,114,M,Black/African American,Not Span/Hispanic,1,Emergency,Home w/ Home Health Services,2019,NEO039,MALE REPRODUCTIVE SYSTEM CANCERS - PROSTATE,ADM001,TRANSFUSION OF BLOOD AND BLOOD PRODUCTS,500,"MALIGNANCY, MALE REPRODUCTIVE SYSTEM",12,DISEASES AND DISORDERS OF THE MALE REPRODUCTIVE SYSTEM,2,Moderate,Major,Medical,Private Health Insurance,,,,,true,23704.48,3669.01
