Hospital Service Area,Hospital County,Operating Certificate Number,Permanent Facility Id,Facility Name,Age Group,Zip Code - 3 digits,Gender,Race,Ethnicity,Length of Stay,Type of Admission,Patient Disposition,Discharge Year,CCS Diagnosis Code,CCS Diagnosis Description,CCS Procedure Code,CCS Procedure Description,APR DRG Code,APR DRG Description,APR MDC Code,APR MDC Description,APR Severity of Illness Code,APR Severity of Illness Description,APR Risk of Mortality,APR Medical Surgical Description,Payment Typology 1,Payment Typology 2,Payment Typology 3,Birth Weight,Abortion Edit Indicator,Emergency Department Indicator,Total Charges,Total Costs
Long Island,Suffolk,5123000,000885,Brookhaven Memorial Hospital Medical Center Inc,70 or Older,117,M,White,Not Span/Hispanic,16,Emergency,Home w/ Home Health Services,2017,165,Inflammatory conditions of male genital organs,070,UP GASTRO ENDOSC/BIOPSY,501,Male reproductive system diagnoses except malignancy,12,Diseases and Disorders of the Male Reproductive System,3,Major,Major,Medical,Medicare,Medicare,Private Health Insurance,,N,Y,130993.05,23649.63
Long Island,Suffolk,5123000,000885,Brookhaven Memorial Hospital Medical Center Inc,18 to 29,117,M,Black/African American,Not Span/Hispanic,8,Emergency,Home w/ Home Health Services,2017,165,Inflammatory conditions of male genital organs,117,OT NON-OR THER PRCS; M,501,Male reproductive system diagnoses except malignancy,12,Diseases and Disorders of the Male Reproductive System,1,Minor,Minor,Medical,Medicaid,,,,N,Y,71414.49,12901.44
Long Island,Suffolk,5123000,000885,Brookhaven Memorial Hospital Medical Center Inc,70 or Older,119,M,White,Not Span/Hispanic,5,Emergency,Home or Self Care,2017,165,Inflammatory conditions of male genital organs,000,NO PROC,501,Male reproductive system diagnoses except malignancy,12,Diseases and Disorders of the Male Reproductive System,3,Major,Major,Medical,Medicare,Medicare,Private Health Insurance,,N,Y,46528.36,7970.27
Long Island,Suffolk,5123000,000885,Brookhaven Memorial Hospital Medical Center Inc,50 to 69,117,M,Other Race,Not Span/Hispanic,11,Emergency,Skilled Nursing Home,2017,165,Inflammatory conditions of male genital organs,000,NO PROC,501,Male reproductive system diagnoses except malignancy,12,Diseases and Disorders of the Male Reproductive System,3,Major,Moderate,Medical,Private Health Insurance,,,,N,Y,78702.29,14868.55
Long Island,Suffolk,5123000,000885,Brookhaven Memorial Hospital Medical Center Inc,50 to 69,117,M,White,Not Span/Hispanic,2,Emergency,Home or Self Care,2017,165,Inflammatory conditions of male genital organs,000,NO PROC,501,Male reproductive system diagnoses except malignancy,12,Diseases and Disorders of the Male Reproductive System,1,Minor,Minor,Medical,Blue Cross/Blue Shield,,,,N,Y,25437.71,3133.54
Long Island,Suffolk,5123000,000885,Brookhaven Memorial Hospital Medical Center Inc,50 to 69,117,M,White,Not Span/Hispanic,3,Emergency,Home w/ Home Health Services,2017,165,Inflammatory conditions of male genital organs,000,NO PROC,501,Male reproductive system diagnoses except malignancy,12,Diseases and Disorders of the Male Reproductive System,2,Moderate,Minor,Medical,Medicare,Medicare,,,N,Y,25451.78,5033.71
Long Island,Suffolk,5123000,000885,Brookhaven Memorial Hospital Medical Center Inc,30 to 49,117,M,Other Race,Not Span/Hispanic,3,Emergency,Home w/ Home Health Services,2017,165,Inflammatory conditions of male genital organs,117,OT NON-OR THER PRCS; M,501,Male reproductive system diagnoses except malignancy,12,Diseases and Disorders of the Male Reproductive System,1,Minor,Minor,Medical,Medicaid,,,,N,Y,41444.34,6516.48
Long Island,Suffolk,5123000,000885,Brookhaven Memorial Hospital Medical Center Inc,50 to 69,117,M,White,Not Span/Hispanic,4,Emergency,Home or Self Care,2017,166,Other male genital disorders,109,PRCS ON THE URETHRA,501,Male reproductive system diagnoses except malignancy,12,Diseases and Disorders of the Male Reproductive System,1,Minor,Minor,Medical,Private Health Insurance,,,,N,Y,44855.95,7631.29
Long Island,Suffolk,5123000,000885,Brookhaven Memorial Hospital Medical Center Inc,70 or Older,117,M,Other Race,Not Span/Hispanic,7,Emergency,Skilled Nursing Home,2017,165,Inflammatory conditions of male genital organs,000,NO PROC,501,Male reproductive system diagnoses except malignancy,12,Diseases and Disorders of the Male Reproductive System,2,Moderate,Moderate,Medical,Medicare,Medicare,Private Health Insurance,,N,Y,48874.03,9376.28
Long Island,Suffolk,5123000,000885,Brookhaven Memorial Hospital Medical Center Inc,70 or Older,119,M,White,Not Span/Hispanic,5,Emergency,Skilled Nursing Home,2017,164,Hyperplasia of prostate,000,NO PROC,501,Male reproductive system diagnoses except malignancy,12,Diseases and Disorders of the Male Reproductive System,3,Major,Major,Medical,Medicare,Medicare,Medicaid,,N,Y,49921.61,7258.26
Long Island,Suffolk,5123000,000885,Brookhaven Memorial Hospital Medical Center Inc,30 to 49,117,M,White,Not Span/Hispanic,1,Emergency,Home or Self Care,2017,166,Other male genital disorders,000,NO PROC,501,Male reproductive system diagnoses except malignancy,12,Diseases and Disorders of the Male Reproductive System,1,Minor,Minor,Medical,Private Health Insurance,,,,N,Y,10193.53,1936.14
Long Island,Suffolk,5123000,000885,Brookhaven Memorial Hospital Medical Center Inc,30 to 49,119,M,Other Race,Not Span/Hispanic,3,Emergency,Home or Self Care,2017,235,Open wounds of head; neck; and trunk,000,NO PROC,501,Male reproductive system diagnoses except malignancy,12,Diseases and Disorders of the Male Reproductive System,2,Moderate,Minor,Medical,Medicaid,,,,N,Y,31837.35,4441.51
Long Island,Suffolk,5123000,000885,Brookhaven Memorial Hospital Medical Center Inc,50 to 69,117,M,Other Race,Not Span/Hispanic,4,Emergency,Home or Self Care,2017,165,Inflammatory conditions of male genital organs,000,NO PROC,501,Male reproductive system diagnoses except malignancy,12,Diseases and Disorders of the Male Reproductive System,2,Moderate,Minor,Medical,Private Health Insurance,,,,N,Y,31053.69,5951.29
Long Island,Suffolk,5123000,000885,Brookhaven Memorial Hospital Medical Center Inc,18 to 29,117,M,White,Not Span/Hispanic,2,Emergency,Home w/ Home Health Services,2017,165,Inflammatory conditions of male genital organs,117,OT NON-OR THER PRCS; M,501,Male reproductive system diagnoses except malignancy,12,Diseases and Disorders of the Male Reproductive System,1,Minor,Minor,Medical,Private Health Insurance,Medicaid,,,N,Y,25564.47,5349.68
Long Island,Suffolk,5123000,000885,Brookhaven Memorial Hospital Medical Center Inc,70 or Older,117,M,White,Not Span/Hispanic,7,Emergency,Home w/ Home Health Services,2017,004,Mycoses,000,NO PROC,501,Male reproductive system diagnoses except malignancy,12,Diseases and Disorders of the Male Reproductive System,3,Major,Major,Medical,Medicare,Medicare,Medicaid,,N,Y,43498.25,8891.85
Long Island,Suffolk,5123000,000885,Brookhaven Memorial Hospital Medical Center Inc,70 or Older,117,M,White,Not Span/Hispanic,2,Emergency,Home or Self Care,2017,164,Hyperplasia of prostate,219,ALCO/DRUG REHAB/DETOX,501,Male reproductive system diagnoses except malignancy,12,Diseases and Disorders of the Male Reproductive System,3,Major,Moderate,Medical,Medicare,Medicare,Private Health Insurance,,N,Y,42609.65,4059.02
Long Island,Suffolk,5123000,000885,Brookhaven Memorial Hospital Medical Center Inc,70 or Older,117,M,White,Not Span/Hispanic,6,Emergency,Home w/ Home Health Services,2017,165,Inflammatory conditions of male genital organs,070,UP GASTRO ENDOSC/BIOPSY,501,Male reproductive system diagnoses except malignancy,12,Diseases and Disorders of the Male Reproductive System,2,Moderate,Major,Medical,Medicare,Medicare,Medicaid,,N,Y,58884.18,10579.81
Long Island,Suffolk,5123000,000885,Brookhaven Memorial Hospital Medical Center Inc,70 or Older,117,M,White,Not Span/Hispanic,1,Emergency,Home w/ Home Health Services,2017,164,Hyperplasia of prostate,000,NO PROC,501,Male reproductive system diagnoses except malignancy,12,Diseases and Disorders of the Male Reproductive System,3,Major,Major,Medical,Medicare,Medicare,,,N,Y,16414.13,1805.69
Long Island,Suffolk,5123000,000885,Brookhaven Memorial Hospital Medical Center Inc,70 or Older,117,M,White,Not Span/Hispanic,1,Emergency,Home or Self Care,2017,164,Hyperplasia of prostate,000,NO PROC,501,Male reproductive system diagnoses except malignancy,12,Diseases and Disorders of the Male Reproductive System,3,Major,Major,Medical,Medicare,Medicare,,,N,Y,17651.19,1916.07
Long Island,Suffolk,5123000,000885,Brookhaven Memorial Hospital Medical Center Inc,70 or Older,117,M,White,Not Span/Hispanic,5,Emergency,Skilled Nursing Home,2017,165,Inflammatory conditions of male genital organs,000,NO PROC,501,Male reproductive system diagnoses except malignancy,12,Diseases and Disorders of the Male Reproductive System,3,Major,Moderate,Medical,Medicare,Medicare,Blue Cross/Blue Shield,,N,Y,43939.46,6960.97
Long Island,Suffolk,5123000,000885,Brookhaven Memorial Hospital Medical Center Inc,70 or Older,117,M,White,Not Span/Hispanic,5,Emergency,Home w/ Home Health Services,2017,165,Inflammatory conditions of male genital organs,108,INDWELLING CATHETER,501,Male reproductive system diagnoses except malignancy,12,Diseases and Disorders of the Male Reproductive System,3,Major,Major,Medical,Medicare,Medicare,,,N,Y,52088.94,9855.31
