Hospital Service Area,Hospital County,Operating Certificate Number,Permanent Facility Id,Facility Name,Age Group,Zip Code - 3 digits,Gender,Race,Ethnicity,Length of Stay,Type of Admission,Patient Disposition,Discharge Year,CCS Diagnosis Code,CCS Diagnosis Description,CCS Procedure Code,CCS Procedure Description,APR DRG Code,APR DRG Description,APR MDC Code,APR MDC Description,APR Severity of Illness Code,APR Severity of Illness Description,APR Risk of Mortality,APR Medical Surgical Description,Payment Typology 1,Payment Typology 2,Payment Typology 3,Birth Weight,Abortion Edit Indicator,Emergency Department Indicator,Total Charges,Total Costs
New York City,Kings,7001020,001305,Maimonides Medical Center,70 or Older,112,M,Other Race,Not Span/Hispanic,4,Emergency,Home or Self Care,2018,GEN013,INFLAMMATORY CONDITIONS OF MALE GENITAL ORGANS,ADM015,ADMINISTRATION OF ANTIBIOTICS,501,MALE REPRODUCTIVE SYSTEM DIAGNOSES EXCEPT MALIGNANCY,12,DISEASES AND DISORDERS OF THE MALE REPRODUCTIVE SYSTEM,3,Major,Major,Medical,Medicare,Medicaid,Self-Pay,,,false,23752.02,6475.87
New York City,Kings,7001035,001318,Wyckoff Heights Medical Center,0 to 17,112,M,Other Race,Not Span/Hispanic,1,Emergency,Home or Self Care,2018,GEN013,INFLAMMATORY CONDITIONS OF MALE GENITAL ORGANS,,,501,MALE REPRODUCTIVE SYSTEM DIAGNOSES EXCEPT MALIGNANCY,12,DISEASES AND DISORDERS OF THE MALE REPRODUCTIVE SYSTEM,2,Moderate,Minor,Medical,Medicaid,Miscellaneous/Other,,,,true,5146.67,3256.42
New York City,Manhattan,7002054,001437,New York-Presbyterian/Lower Manhattan Hospital,70 or Older,100,M,Other Race,Not Span/Hispanic,2,Emergency,Home w/ Home Health Services,2018,GEN012,HYPERPLASIA OF PROSTATE,ADM021,"ADMINISTRATION OF THERAPEUTIC SUBSTANCES, NEC",501,MALE REPRODUCTIVE SYSTEM DIAGNOSES EXCEPT MALIGNANCY,12,DISEASES AND DISORDERS OF THE MALE REPRODUCTIVE SYSTEM,3,Major,Major,Medical,Medicare,Medicaid,Self-Pay,,,true,24556.16,5633.91
Long Island,Suffolk,5123000,000885,Long Island Community Hospital,18 to 29,117,M,White,Not Span/Hispanic,3,Emergency,Home or Self Care,2018,GEN013,INFLAMMATORY CONDITIONS OF MALE GENITAL ORGANS,MRS007,"MALE REPRODUCTIVE SYSTEM PROCEDURES, NEC",501,MALE REPRODUCTIVE SYSTEM DIAGNOSES EXCEPT MALIGNANCY,12,DISEASES AND DISORDERS OF THE MALE REPRODUCTIVE SYSTEM,1,Minor,Minor,Medical,Medicaid,,,,,true,31900.28,6935.18
Long Island,Nassau,2950001,000527,Mount Sinai South Nassau,50 to 69,115,M,White,Spanish/Hispanic,2,Emergency,Home or Self Care,2018,GEN013,INFLAMMATORY CONDITIONS OF MALE GENITAL ORGANS,,,501,MALE REPRODUCTIVE SYSTEM DIAGNOSES EXCEPT MALIGNANCY,12,DISEASES AND DISORDERS OF THE MALE REPRODUCTIVE SYSTEM,2,Moderate,Minor,Medical,Medicaid,,,,,true,25865.12,3265.08
New York City,Bronx,7000008,001172,Lincoln Medical & Mental Health Center,18 to 29,104,M,Black/African American,Not Span/Hispanic,1,Emergency,Home or Self Care,2018,INF010,SEXUALLY TRANSMITTED INFECTIONS (EXCLUDING HIV AND HEPATITIS),,,501,MALE REPRODUCTIVE SYSTEM DIAGNOSES EXCEPT MALIGNANCY,12,DISEASES AND DISORDERS OF THE MALE REPRODUCTIVE SYSTEM,2,Moderate,Minor,Medical,Private Health Insurance,Medicaid,,,,true,8259.73,4877.84
New York City,Bronx,7000008,001172,Lincoln Medical & Mental Health Center,50 to 69,104,M,Other Race,Spanish/Hispanic,2,Emergency,Home or Self Care,2018,GEN012,HYPERPLASIA OF PROSTATE,ADM015,ADMINISTRATION OF ANTIBIOTICS,501,MALE REPRODUCTIVE SYSTEM DIAGNOSES EXCEPT MALIGNANCY,12,DISEASES AND DISORDERS OF THE MALE REPRODUCTIVE SYSTEM,2,Moderate,Minor,Medical,Medicaid,,,,,false,13164.17,7774.19
Long Island,Suffolk,5151001,000245,Stony Brook University Hospital,70 or Older,117,M,Other Race,Unknown,4,Emergency,Home or Self Care,2018,GEN013,INFLAMMATORY CONDITIONS OF MALE GENITAL ORGANS,,,501,MALE REPRODUCTIVE SYSTEM DIAGNOSES EXCEPT MALIGNANCY,12,DISEASES AND DISORDERS OF THE MALE REPRODUCTIVE SYSTEM,2,Moderate,Moderate,Medical,Medicare,Medicare,,,,true,37248.2,10906.63
New York City,Bronx,7000008,001172,Lincoln Medical & Mental Health Center,50 to 69,104,M,Black/African American,Not Span/Hispanic,3,Emergency,Home or Self Care,2018,GEN013,INFLAMMATORY CONDITIONS OF MALE GENITAL ORGANS,,,501,MALE REPRODUCTIVE SYSTEM DIAGNOSES EXCEPT MALIGNANCY,12,DISEASES AND DISORDERS OF THE MALE REPRODUCTIVE SYSTEM,2,Moderate,Minor,Medical,Medicaid,,,,,true,18980.83,11209.26
Hudson Valley,Westchester,5902001,001045,White Plains Hospital Center,70 or Older,105,M,Other Race,Not Span/Hispanic,3,Emergency,Home or Self Care,2018,INJ013,"OPEN WOUNDS OF TRUNK, INITIAL ENCOUNTER",MRS007,"MALE REPRODUCTIVE SYSTEM PROCEDURES, NEC",501,MALE REPRODUCTIVE SYSTEM DIAGNOSES EXCEPT MALIGNANCY,12,DISEASES AND DISORDERS OF THE MALE REPRODUCTIVE SYSTEM,3,Major,Major,Medical,Medicare,,,,,true,36229,9249.35
Central NY,Onondaga,3301003,000630,St. Joseph's Hospital Health Center,50 to 69,132,M,Other Race,Not Span/Hispanic,6,Emergency,Hospice - Medical Facility,2018,GEN012,HYPERPLASIA OF PROSTATE,,,501,MALE REPRODUCTIVE SYSTEM DIAGNOSES EXCEPT MALIGNANCY,12,DISEASES AND DISORDERS OF THE MALE REPRODUCTIVE SYSTEM,3,Major,Major,Medical,Medicaid,,,,,true,13982.77,5347.12
New York City,Kings,7002002,001324,Mount Sinai Brooklyn,50 to 69,112,M,White,Spanish/Hispanic,5,Emergency,Home or Self Care,2018,GEN013,INFLAMMATORY CONDITIONS OF MALE GENITAL ORGANS,ADM015,ADMINISTRATION OF ANTIBIOTICS,501,MALE REPRODUCTIVE SYSTEM DIAGNOSES EXCEPT MALIGNANCY,12,DISEASES AND DISORDERS OF THE MALE REPRODUCTIVE SYSTEM,3,Major,Moderate,Medical,Medicaid,Self-Pay,,,,true,59870.22,10831.2
Long Island,Nassau,2909000,000513,Mercy Hospital,50 to 69,115,M,Other Race,Spanish/Hispanic,2,Emergency,Home or Self Care,2018,GEN013,INFLAMMATORY CONDITIONS OF MALE GENITAL ORGANS,ADM010,VACCINATIONS,501,MALE REPRODUCTIVE SYSTEM DIAGNOSES EXCEPT MALIGNANCY,12,DISEASES AND DISORDERS OF THE MALE REPRODUCTIVE SYSTEM,1,Minor,Minor,Medical,Medicaid,Medicaid,,,,true,27053,4182.56
Western NY,Erie,1401008,000213,Mercy Hospital of Buffalo,70 or Older,142,M,White,Not Span/Hispanic,2,Emergency,Home or Self Care,2018,GEN012,HYPERPLASIA OF PROSTATE,,,501,MALE REPRODUCTIVE SYSTEM DIAGNOSES EXCEPT MALIGNANCY,12,DISEASES AND DISORDERS OF THE MALE REPRODUCTIVE SYSTEM,1,Minor,Minor,Medical,Medicare,Medicare,Blue Cross/Blue Shield,,,true,9573.66,3144.8
Hudson Valley,Dutchess,5957001,000180,Mid-Hudson Valley Division of Westchester Medical Center,30 to 49,125,M,White,Not Span/Hispanic,5,Emergency,Home w/ Home Health Services,2018,GEN013,INFLAMMATORY CONDITIONS OF MALE GENITAL ORGANS,MRS007,"MALE REPRODUCTIVE SYSTEM PROCEDURES, NEC",501,MALE REPRODUCTIVE SYSTEM DIAGNOSES EXCEPT MALIGNANCY,12,DISEASES AND DISORDERS OF THE MALE REPRODUCTIVE SYSTEM,2,Moderate,Minor,Medical,Private Health Insurance,,,,,true,143750.68,37549.41
New York City,Queens,7003004,001630,Long Island Jewish Medical Center,70 or Older,114,M,Other Race,Spanish/Hispanic,1,Emergency,Home or Self Care,2018,GEN013,INFLAMMATORY CONDITIONS OF MALE GENITAL ORGANS,,,501,MALE REPRODUCTIVE SYSTEM DIAGNOSES EXCEPT MALIGNANCY,12,DISEASES AND DISORDERS OF THE MALE REPRODUCTIVE SYSTEM,2,Moderate,Minor,Medical,Self-Pay,,,,,true,14090.95,2640.58
Capital/Adirond,Otsego,3824000,000746,Mary Imogene Bassett Hospital,50 to 69,133,M,White,Not Span/Hispanic,3,Trauma,Home w/ Home Health Services,2018,GEN012,HYPERPLASIA OF PROSTATE,ADM018,IRRIGATION (DIAGNOSTIC AND THERAPEUTIC),501,MALE REPRODUCTIVE SYSTEM DIAGNOSES EXCEPT MALIGNANCY,12,DISEASES AND DISORDERS OF THE MALE REPRODUCTIVE SYSTEM,2,Moderate,Moderate,Medical,Medicare,Medicaid,,,,false,13272.31,7316.96
Western NY,Erie,1401013,000292,Sisters of Charity Hospital - St. Joseph Campus,50 to 69,142,M,White,Not Span/Hispanic,5,Emergency,Skilled Nursing Home,2018,GEN013,INFLAMMATORY CONDITIONS OF MALE GENITAL ORGANS,URN006,BLADDER CATHETERIZATION AND DRAINAGE,501,MALE REPRODUCTIVE SYSTEM DIAGNOSES EXCEPT MALIGNANCY,12,DISEASES AND DISORDERS OF THE MALE REPRODUCTIVE SYSTEM,3,Major,Moderate,Medical,Medicare,Medicare,Medicaid,,,true,20754.61,9360.34
New York City,Bronx,7000006,001169,Montefiore Medical Center - Henry & Lucy Moses Div,70 or Older,104,M,Other Race,Spanish/Hispanic,2,Emergency,Home or Self Care,2018,GEN013,INFLAMMATORY CONDITIONS OF MALE GENITAL ORGANS,ADM015,ADMINISTRATION OF ANTIBIOTICS,501,MALE REPRODUCTIVE SYSTEM DIAGNOSES EXCEPT MALIGNANCY,12,DISEASES AND DISORDERS OF THE MALE REPRODUCTIVE SYSTEM,2,Moderate,Moderate,Medical,Blue Cross/Blue Shield,,,,,true,25938.24,4470.33
New York City,Manhattan,7002054,001437,New York-Presbyterian/Lower Manhattan Hospital,50 to 69,112,M,Other Race,Not Span/Hispanic,2,Emergency,Home w/ Home Health Services,2018,GEN012,HYPERPLASIA OF PROSTATE,URN006,BLADDER CATHETERIZATION AND DRAINAGE,501,MALE REPRODUCTIVE SYSTEM DIAGNOSES EXCEPT MALIGNANCY,12,DISEASES AND DISORDERS OF THE MALE REPRODUCTIVE SYSTEM,1,Minor,Minor,Medical,"Managed Care, Unspecified",Medicaid,Self-Pay,,,true,21578.38,4765.2
Capital/Adirond,Schenectady,4601001,000829,Ellis Hospital,50 to 69,123,M,Other Race,Not Span/Hispanic,3,Emergency,Home or Self Care,2018,GEN016,OTHER SPECIFIED MALE GENITAL DISORDERS,MRS001,CIRCUMCISION,501,MALE REPRODUCTIVE SYSTEM DIAGNOSES EXCEPT MALIGNANCY,12,DISEASES AND DISORDERS OF THE MALE REPRODUCTIVE SYSTEM,2,Moderate,Minor,Medical,Medicaid,Medicaid,,,,true,19777.86,5823.31
Finger Lakes,Monroe,2701005,000413,Strong Memorial Hospital,50 to 69,144,M,White,Not Span/Hispanic,2,Emergency,Home or Self Care,2018,GEN013,INFLAMMATORY CONDITIONS OF MALE GENITAL ORGANS,,,501,MALE REPRODUCTIVE SYSTEM DIAGNOSES EXCEPT MALIGNANCY,12,DISEASES AND DISORDERS OF THE MALE REPRODUCTIVE SYSTEM,1,Minor,Minor,Medical,Blue Cross/Blue Shield,Self-Pay,,,,true,8258.7,3147.52
Western NY,Erie,1401005,000210,Erie County Medical Center,70 or Older,142,M,White,Not Span/Hispanic,2,Emergency,Home or Self Care,2018,GEN012,HYPERPLASIA OF PROSTATE,,,501,MALE REPRODUCTIVE SYSTEM DIAGNOSES EXCEPT MALIGNANCY,12,DISEASES AND DISORDERS OF THE MALE REPRODUCTIVE SYSTEM,2,Moderate,Major,Medical,Medicare,Medicare,,,,true,7271.15,3368.63
New York City,Manhattan,7002009,001445,Harlem Hospital Center,50 to 69,100,M,Black/African American,Not Span/Hispanic,9,Emergency,Left Against Medical Advice,2018,GEN012,HYPERPLASIA OF PROSTATE,,,501,MALE REPRODUCTIVE SYSTEM DIAGNOSES EXCEPT MALIGNANCY,12,DISEASES AND DISORDERS OF THE MALE REPRODUCTIVE SYSTEM,3,Major,Moderate,Medical,Medicaid,,,,,true,43790.21,32541.86
New York City,Queens,7003004,001638,Long Island Jewish Forest Hills,50 to 69,114,M,Black/African American,Not Span/Hispanic,5,Emergency,Home or Self Care,2018,GEN013,INFLAMMATORY CONDITIONS OF MALE GENITAL ORGANS,,,501,MALE REPRODUCTIVE SYSTEM DIAGNOSES EXCEPT MALIGNANCY,12,DISEASES AND DISORDERS OF THE MALE REPRODUCTIVE SYSTEM,3,Major,Moderate,Medical,Medicaid,Medicaid,,,,true,65324.98,10647.85
New York City,Queens,7003004,001638,Long Island Jewish Forest Hills,70 or Older,113,M,White,Not Span/Hispanic,6,Emergency,Home w/ Home Health Services,2018,GEN012,HYPERPLASIA OF PROSTATE,,,501,MALE REPRODUCTIVE SYSTEM DIAGNOSES EXCEPT MALIGNANCY,12,DISEASES AND DISORDERS OF THE MALE REPRODUCTIVE SYSTEM,3,Major,Major,Medical,Medicare,Medicaid,,,,true,59021.79,9896.19
New York City,Manhattan,7002002,001439,Mount Sinai Beth Israel,70 or Older,100,M,Other Race,Unknown,5,Emergency,Home w/ Home Health Services,2018,GEN012,HYPERPLASIA OF PROSTATE,ADM001,TRANSFUSION OF BLOOD AND BLOOD PRODUCTS,501,MALE REPRODUCTIVE SYSTEM DIAGNOSES EXCEPT MALIGNANCY,12,DISEASES AND DISORDERS OF THE MALE REPRODUCTIVE SYSTEM,3,Major,Major,Medical,Medicare,Miscellaneous/Other,Medicaid,,,false,52345.9,13598.09
Finger Lakes,Monroe,2701001,000409,Highland Hospital,18 to 29,146,M,White,Not Span/Hispanic,2,Emergency,Home or Self Care,2018,GEN013,INFLAMMATORY CONDITIONS OF MALE GENITAL ORGANS,,,501,MALE REPRODUCTIVE SYSTEM DIAGNOSES EXCEPT MALIGNANCY,12,DISEASES AND DISORDERS OF THE MALE REPRODUCTIVE SYSTEM,1,Minor,Minor,Medical,Blue Cross/Blue Shield,,,,,true,11897.64,3536.72
New York City,Bronx,7000006,001169,Montefiore Medical Center - Henry & Lucy Moses Div,70 or Older,104,M,Other Race,Spanish/Hispanic,2,Emergency,Home or Self Care,2018,GEN013,INFLAMMATORY CONDITIONS OF MALE GENITAL ORGANS,ADM015,ADMINISTRATION OF ANTIBIOTICS,501,MALE REPRODUCTIVE SYSTEM DIAGNOSES EXCEPT MALIGNANCY,12,DISEASES AND DISORDERS OF THE MALE REPRODUCTIVE SYSTEM,2,Moderate,Minor,Medical,Medicare,,,,,true,28711.31,4597.11
New York City,Queens,7003000,001626,Elmhurst Hospital Center,30 to 49,113,M,Other Race,Not Span/Hispanic,3,Emergency,Home or Self Care,2018,GEN013,INFLAMMATORY CONDITIONS OF MALE GENITAL ORGANS,,,501,MALE REPRODUCTIVE SYSTEM DIAGNOSES EXCEPT MALIGNANCY,12,DISEASES AND DISORDERS OF THE MALE REPRODUCTIVE SYSTEM,2,Moderate,Moderate,Medical,Medicaid,Medicaid,,,,true,19614.71,11670.09
Long Island,Nassau,2952005,000552,Plainview Hospital,70 or Older,117,M,White,Not Span/Hispanic,2,Emergency,Home or Self Care,2018,GEN012,HYPERPLASIA OF PROSTATE,URN006,BLADDER CATHETERIZATION AND DRAINAGE,501,MALE REPRODUCTIVE SYSTEM DIAGNOSES EXCEPT MALIGNANCY,12,DISEASES AND DISORDERS OF THE MALE REPRODUCTIVE SYSTEM,2,Moderate,Minor,Medical,Medicare,,,,,true,18767.35,5451.63
New York City,Bronx,7000008,001172,Lincoln Medical & Mental Health Center,70 or Older,104,M,Black/African American,Not Span/Hispanic,2,Emergency,Home or Self Care,2018,GEN012,HYPERPLASIA OF PROSTATE,,,501,MALE REPRODUCTIVE SYSTEM DIAGNOSES EXCEPT MALIGNANCY,12,DISEASES AND DISORDERS OF THE MALE REPRODUCTIVE SYSTEM,2,Moderate,Minor,Medical,Medicare,Medicare,Medicaid,,,true,12582.63,7430.76
Hudson Valley,Rockland,4329000,000779,Good Samaritan Hospital of Suffern,70 or Older,109,M,White,Not Span/Hispanic,1,Emergency,Home or Self Care,2018,GEN012,HYPERPLASIA OF PROSTATE,,,501,MALE REPRODUCTIVE SYSTEM DIAGNOSES EXCEPT MALIGNANCY,12,DISEASES AND DISORDERS OF THE MALE REPRODUCTIVE SYSTEM,3,Major,Major,Medical,Medicare,Private Health Insurance,,,,true,26225.54,2955.09
Hudson Valley,Westchester,5904001,001072,Montefiore New Rochelle Hospital,70 or Older,108,M,Other Race,Unknown,1,Emergency,Home or Self Care,2018,GEN013,INFLAMMATORY CONDITIONS OF MALE GENITAL ORGANS,ADM015,ADMINISTRATION OF ANTIBIOTICS,501,MALE REPRODUCTIVE SYSTEM DIAGNOSES EXCEPT MALIGNANCY,12,DISEASES AND DISORDERS OF THE MALE REPRODUCTIVE SYSTEM,2,Moderate,Major,Medical,Medicare,Medicare,Private Health Insurance,,,true,13396.82,2517.5
New York City,Bronx,7000006,003058,Montefiore Med Center - Jack D Weiler Hosp of A Einstein College Div,70 or Older,104,M,White,Not Span/Hispanic,9,Emergency,Skilled Nursing Home,2018,GEN012,HYPERPLASIA OF PROSTATE,,,501,MALE REPRODUCTIVE SYSTEM DIAGNOSES EXCEPT MALIGNANCY,12,DISEASES AND DISORDERS OF THE MALE REPRODUCTIVE SYSTEM,3,Major,Major,Medical,Medicare,,,,,true,104239.19,19564.6
Long Island,Nassau,7003004,000518,Long Island Jewish Valley Stream,50 to 69,114,M,Black/African American,Not Span/Hispanic,1,Emergency,Home or Self Care,2018,GEN013,INFLAMMATORY CONDITIONS OF MALE GENITAL ORGANS,,,501,MALE REPRODUCTIVE SYSTEM DIAGNOSES EXCEPT MALIGNANCY,12,DISEASES AND DISORDERS OF THE MALE REPRODUCTIVE SYSTEM,2,Moderate,Minor,Medical,Medicaid,Medicaid,,,,true,26568.21,3734.81
New York City,Kings,7001008,001293,"New York Community Hospital of Brooklyn, Inc",70 or Older,112,M,White,Not Span/Hispanic,8,Emergency,Home w/ Home Health Services,2018,GEN013,INFLAMMATORY CONDITIONS OF MALE GENITAL ORGANS,,,501,MALE REPRODUCTIVE SYSTEM DIAGNOSES EXCEPT MALIGNANCY,12,DISEASES AND DISORDERS OF THE MALE REPRODUCTIVE SYSTEM,3,Major,Major,Medical,Medicare,Medicaid,Self-Pay,,,true,27244.1,11562.32
New York City,Bronx,7000014,001176,SBH Health System,50 to 69,104,M,Black/African American,Not Span/Hispanic,4,Emergency,Skilled Nursing Home,2018,GEN012,HYPERPLASIA OF PROSTATE,URN006,BLADDER CATHETERIZATION AND DRAINAGE,501,MALE REPRODUCTIVE SYSTEM DIAGNOSES EXCEPT MALIGNANCY,12,DISEASES AND DISORDERS OF THE MALE REPRODUCTIVE SYSTEM,2,Moderate,Moderate,Medical,Medicaid,,,,,true,24876.92,8485.59
New York City,Bronx,7000001,001178,BronxCare Hospital Center,18 to 29,104,M,Other Race,Unknown,5,Emergency,Home or Self Care,2018,INF010,SEXUALLY TRANSMITTED INFECTIONS (EXCLUDING HIV AND HEPATITIS),GIS002,COLONOSCOPY AND PROCTOSCOPY WITH BIOPSY,501,MALE REPRODUCTIVE SYSTEM DIAGNOSES EXCEPT MALIGNANCY,12,DISEASES AND DISORDERS OF THE MALE REPRODUCTIVE SYSTEM,1,Minor,Minor,Medical,Medicaid,Medicaid,,,,true,16333.54,19810.77
Long Island,Suffolk,5151001,000889,Stony Brook Southampton Hospital,70 or Older,119,M,White,Not Span/Hispanic,5,Emergency,Home or Self Care,2018,GEN012,HYPERPLASIA OF PROSTATE,,,501,MALE REPRODUCTIVE SYSTEM DIAGNOSES EXCEPT MALIGNANCY,12,DISEASES AND DISORDERS OF THE MALE REPRODUCTIVE SYSTEM,3,Major,Major,Medical,Medicare,Blue Cross/Blue Shield,,,,true,35935.41,11245.65
New York City,Kings,7001003,001288,Brooklyn Hospital Center - Downtown Campus,70 or Older,112,M,Black/African American,Not Span/Hispanic,3,Emergency,Home or Self Care,2018,GEN012,HYPERPLASIA OF PROSTATE,URN001,CYSTOSCOPY AND URETEROSCOPY (INCLUDING BIOPSY),501,MALE REPRODUCTIVE SYSTEM DIAGNOSES EXCEPT MALIGNANCY,12,DISEASES AND DISORDERS OF THE MALE REPRODUCTIVE SYSTEM,2,Moderate,Moderate,Medical,Medicare,Medicare,Self-Pay,,,true,36125.89,6430.62
New York City,Kings,7002002,001324,Mount Sinai Brooklyn,70 or Older,112,M,Black/African American,Unknown,5,Emergency,Home w/ Home Health Services,2018,GEN012,HYPERPLASIA OF PROSTATE,IMG008,ULTRASONOGRAPHY,501,MALE REPRODUCTIVE SYSTEM DIAGNOSES EXCEPT MALIGNANCY,12,DISEASES AND DISORDERS OF THE MALE REPRODUCTIVE SYSTEM,2,Moderate,Moderate,Medical,Medicare,Miscellaneous/Other,Self-Pay,,,true,62552.87,8982.55
New York City,Kings,7001003,001288,Brooklyn Hospital Center - Downtown Campus,70 or Older,112,M,Black/African American,Unknown,1,Emergency,Left Against Medical Advice,2018,GEN012,HYPERPLASIA OF PROSTATE,URN006,BLADDER CATHETERIZATION AND DRAINAGE,501,MALE REPRODUCTIVE SYSTEM DIAGNOSES EXCEPT MALIGNANCY,12,DISEASES AND DISORDERS OF THE MALE REPRODUCTIVE SYSTEM,3,Major,Major,Medical,Medicare,Medicare,Self-Pay,,,true,14135.5,3533.09
Central NY,Onondaga,3301007,000635,University Hospital SUNY Health Science Center,50 to 69,132,M,White,Not Span/Hispanic,1,Emergency,Home or Self Care,2018,GEN016,OTHER SPECIFIED MALE GENITAL DISORDERS,MRS002,PENIS PROCEDURES (EXCLUDING CIRCUMCISION),501,MALE REPRODUCTIVE SYSTEM DIAGNOSES EXCEPT MALIGNANCY,12,DISEASES AND DISORDERS OF THE MALE REPRODUCTIVE SYSTEM,2,Moderate,Minor,Medical,Medicare,Medicaid,,,,true,15591.6,3988.13
New York City,Bronx,7000006,001169,Montefiore Medical Center - Henry & Lucy Moses Div,70 or Older,105,M,Black/African American,Not Span/Hispanic,4,Emergency,Home or Self Care,2018,GEN016,OTHER SPECIFIED MALE GENITAL DISORDERS,,,501,MALE REPRODUCTIVE SYSTEM DIAGNOSES EXCEPT MALIGNANCY,12,DISEASES AND DISORDERS OF THE MALE REPRODUCTIVE SYSTEM,1,Minor,Minor,Medical,Private Health Insurance,,,,,true,51105.55,9595.9
Long Island,Nassau,2951001,000541,North Shore University Hospital,30 to 49,114,M,Black/African American,Not Span/Hispanic,6,Emergency,Home or Self Care,2018,GEN016,OTHER SPECIFIED MALE GENITAL DISORDERS,,,501,MALE REPRODUCTIVE SYSTEM DIAGNOSES EXCEPT MALIGNANCY,12,DISEASES AND DISORDERS OF THE MALE REPRODUCTIVE SYSTEM,3,Major,Major,Medical,Private Health Insurance,,,,,true,76247.81,18972.24
New York City,Manhattan,7002054,001458,New York-Presbyterian Hospital - New York Weill Cornell Center,70 or Older,OOS,M,Other Race,Not Span/Hispanic,3,Emergency,Home w/ Home Health Services,2018,GEN013,INFLAMMATORY CONDITIONS OF MALE GENITAL ORGANS,ADM015,ADMINISTRATION OF ANTIBIOTICS,501,MALE REPRODUCTIVE SYSTEM DIAGNOSES EXCEPT MALIGNANCY,12,DISEASES AND DISORDERS OF THE MALE REPRODUCTIVE SYSTEM,1,Minor,Minor,Medical,Medicare,Medicare,Self-Pay,,,true,39528.03,8903.43
New York City,Bronx,7000006,003058,Montefiore Med Center - Jack D Weiler Hosp of A Einstein College Div,50 to 69,104,M,Other Race,Spanish/Hispanic,4,Emergency,Home or Self Care,2018,GEN013,INFLAMMATORY CONDITIONS OF MALE GENITAL ORGANS,ADM015,ADMINISTRATION OF ANTIBIOTICS,501,MALE REPRODUCTIVE SYSTEM DIAGNOSES EXCEPT MALIGNANCY,12,DISEASES AND DISORDERS OF THE MALE REPRODUCTIVE SYSTEM,2,Moderate,Major,Medical,Medicaid,,,,,true,44665.05,7843.95
New York City,Kings,7001008,001293,"New York Community Hospital of Brooklyn, Inc",50 to 69,112,M,Black/African American,Not Span/Hispanic,7,Emergency,Home w/ Home Health Services,2018,GEN013,INFLAMMATORY CONDITIONS OF MALE GENITAL ORGANS,CAR024,VENOUS AND ARTERIAL CATHETER PLACEMENT,501,MALE REPRODUCTIVE SYSTEM DIAGNOSES EXCEPT MALIGNANCY,12,DISEASES AND DISORDERS OF THE MALE REPRODUCTIVE SYSTEM,2,Moderate,Moderate,Medical,Medicare,Medicare,Self-Pay,,,true,24804.61,13463.02
New York City,Kings,7001008,001293,"New York Community Hospital of Brooklyn, Inc",50 to 69,112,M,White,Not Span/Hispanic,4,Emergency,Inpatient Rehabilitation Facility,2018,GEN016,OTHER SPECIFIED MALE GENITAL DISORDERS,,,501,MALE REPRODUCTIVE SYSTEM DIAGNOSES EXCEPT MALIGNANCY,12,DISEASES AND DISORDERS OF THE MALE REPRODUCTIVE SYSTEM,3,Major,Minor,Medical,"Managed Care, Unspecified",Medicaid,Self-Pay,,,true,24635.5,8708.84
Long Island,Nassau,2951001,000541,North Shore University Hospital,50 to 69,114,M,White,Not Span/Hispanic,8,Emergency,Home w/ Home Health Services,2018,GEN013,INFLAMMATORY CONDITIONS OF MALE GENITAL ORGANS,,,501,MALE REPRODUCTIVE SYSTEM DIAGNOSES EXCEPT MALIGNANCY,12,DISEASES AND DISORDERS OF THE MALE REPRODUCTIVE SYSTEM,2,Moderate,Minor,Medical,Medicaid,Medicaid,,,,true,121597.59,20612.59
New York City,Queens,7001024,001635,St Johns Episcopal Hospital So Shore,70 or Older,116,M,Black/African American,Not Span/Hispanic,2,Emergency,Home or Self Care,2018,GEN012,HYPERPLASIA OF PROSTATE,,,501,MALE REPRODUCTIVE SYSTEM DIAGNOSES EXCEPT MALIGNANCY,12,DISEASES AND DISORDERS OF THE MALE REPRODUCTIVE SYSTEM,2,Moderate,Moderate,Medical,Medicare,Private Health Insurance,,,,true,12673.74,3654.3
New York City,Kings,7001008,001293,"New York Community Hospital of Brooklyn, Inc",50 to 69,112,M,White,Not Span/Hispanic,2,Emergency,Home or Self Care,2018,GEN013,INFLAMMATORY CONDITIONS OF MALE GENITAL ORGANS,,,501,MALE REPRODUCTIVE SYSTEM DIAGNOSES EXCEPT MALIGNANCY,12,DISEASES AND DISORDERS OF THE MALE REPRODUCTIVE SYSTEM,1,Minor,Minor,Medical,"Managed Care, Unspecified",Medicaid,Self-Pay,,,true,6527.89,3036.03
Long Island,Nassau,2951001,000550,Syosset Hospital,50 to 69,117,M,White,Not Span/Hispanic,2,Emergency,Home w/ Home Health Services,2018,GEN012,HYPERPLASIA OF PROSTATE,,,501,MALE REPRODUCTIVE SYSTEM DIAGNOSES EXCEPT MALIGNANCY,12,DISEASES AND DISORDERS OF THE MALE REPRODUCTIVE SYSTEM,2,Moderate,Minor,Medical,Medicaid,,,,,true,28065.32,4320.47
Capital/Adirond,Albany,0101000,000001,Albany Medical Center Hospital,50 to 69,128,M,White,Not Span/Hispanic,6,Emergency,Home or Self Care,2018,GEN013,INFLAMMATORY CONDITIONS OF MALE GENITAL ORGANS,MRS007,"MALE REPRODUCTIVE SYSTEM PROCEDURES, NEC",501,MALE REPRODUCTIVE SYSTEM DIAGNOSES EXCEPT MALIGNANCY,12,DISEASES AND DISORDERS OF THE MALE REPRODUCTIVE SYSTEM,2,Moderate,Moderate,Medical,Private Health Insurance,,,,,true,38575.49,10912.46
Hudson Valley,Westchester,5907002,001098,St. Joseph's Medical Center,70 or Older,107,M,Other Race,Unknown,7,Emergency,Home or Self Care,2018,GEN013,INFLAMMATORY CONDITIONS OF MALE GENITAL ORGANS,,,501,MALE REPRODUCTIVE SYSTEM DIAGNOSES EXCEPT MALIGNANCY,12,DISEASES AND DISORDERS OF THE MALE REPRODUCTIVE SYSTEM,3,Major,Moderate,Medical,Medicare,Medicare,Medicaid,,,true,28461.48,15114.24
Hudson Valley,Westchester,5957001,001139,Westchester Medical Center,50 to 69,109,M,Black/African American,Not Span/Hispanic,8,Emergency,Home w/ Home Health Services,2018,GEN013,INFLAMMATORY CONDITIONS OF MALE GENITAL ORGANS,CAR024,VENOUS AND ARTERIAL CATHETER PLACEMENT,501,MALE REPRODUCTIVE SYSTEM DIAGNOSES EXCEPT MALIGNANCY,12,DISEASES AND DISORDERS OF THE MALE REPRODUCTIVE SYSTEM,2,Moderate,Minor,Medical,Private Health Insurance,,,,,true,122892.07,21791.61