Hospital Service Area,Hospital County,Operating Certificate Number,Permanent Facility Id,Facility Name,Age Group,Zip Code - 3 digits,Gender,Race,Ethnicity,Length of Stay,Type of Admission,Patient Disposition,Discharge Year,CCS Diagnosis Code,CCS Diagnosis Description,CCS Procedure Code,CCS Procedure Description,APR DRG Code,APR DRG Description,APR MDC Code,APR MDC Description,APR Severity of Illness Code,APR Severity of Illness Description,APR Risk of Mortality,APR Medical Surgical Description,Payment Typology 1,Payment Typology 2,Payment Typology 3,Birth Weight,Abortion Edit Indicator,Emergency Department Indicator,Total Charges,Total Costs
New York City,Kings,7001021,001306,New York - Presbyterian Brooklyn Methodist Hospital,0 to 17,112,F,Other Race,Not Span/Hispanic,4,Emergency,Home or Self Care,2017,076,Meningitis (except that caused by tuberculosis or sexually transmitted disease),199,ELECTROENCEPHALOGRAM,051,Viral meningitis,01,Diseases and Disorders of the Nervous System,2,Moderate,Minor,Medical,Private Health Insurance,Self-Pay,,,N,Y,42019.42,16839.78
New York City,Manhattan,7002054,001464,New York Presbyterian Hospital - Columbia Presbyterian Center,70 or Older,114,M,Black/African American,Not Span/Hispanic,15,Urgent,Home or Self Care,2017,076,Meningitis (except that caused by tuberculosis or sexually transmitted disease),004,DIAGNOSTIC SPINAL TAP,051,Viral meningitis,01,Diseases and Disorders of the Nervous System,3,Major,Major,Medical,Medicare,Private Health Insurance,Self-Pay,,N,N,165517.02,41269.13
Western NY,Erie,1401014,000208,Women And Children's Hospital Of Buffalo,0 to 17,141,M,White,Not Span/Hispanic,3,Emergency,Home or Self Care,2017,076,Meningitis (except that caused by tuberculosis or sexually transmitted disease),231,OTHER THERAPEUTIC PRCS,051,Viral meningitis,01,Diseases and Disorders of the Nervous System,1,Minor,Minor,Medical,Medicaid,Self-Pay,,,N,Y,11942.30,6384.46
Western NY,Erie,1401014,003067,Millard Fillmore Suburban Hospital,30 to 49,140,F,White,Not Span/Hispanic,1,Emergency,Home or Self Care,2017,076,Meningitis (except that caused by tuberculosis or sexually transmitted disease),004,DIAGNOSTIC SPINAL TAP,051,Viral meningitis,01,Diseases and Disorders of the Nervous System,1,Minor,Minor,Medical,Private Health Insurance,Self-Pay,,,N,Y,9324.78,2797.89
New York City,Kings,7001033,001315,Kingsbrook Jewish Medical Center,18 to 29,112,F,Black/African American,Not Span/Hispanic,5,Emergency,Home or Self Care,2017,076,Meningitis (except that caused by tuberculosis or sexually transmitted disease),004,DIAGNOSTIC SPINAL TAP,051,Viral meningitis,01,Diseases and Disorders of the Nervous System,2,Moderate,Minor,Medical,Private Health Insurance,Self-Pay,,,N,Y,42441.00,11492.05
Western NY,Niagara,3102000,000574,Niagara Falls Memorial Medical Center,30 to 49,143,F,White,Not Span/Hispanic,3,Urgent,Home or Self Care,2017,076,Meningitis (except that caused by tuberculosis or sexually transmitted disease),004,DIAGNOSTIC SPINAL TAP,051,Viral meningitis,01,Diseases and Disorders of the Nervous System,2,Moderate,Minor,Medical,Medicaid,,,,N,Y,9157.99,3193.30
Finger Lakes,Monroe,2701001,000409,Highland Hospital,18 to 29,146,M,White,Not Span/Hispanic,2,Emergency,Home or Self Care,2017,076,Meningitis (except that caused by tuberculosis or sexually transmitted disease),004,DIAGNOSTIC SPINAL TAP,051,Viral meningitis,01,Diseases and Disorders of the Nervous System,1,Minor,Minor,Medical,Blue Cross/Blue Shield,,,,N,Y,7526.19,2682.09
New York City,Kings,7001020,001305,Maimonides Medical Center,0 to 17,112,M,White,Not Span/Hispanic,3,Emergency,Home or Self Care,2017,076,Meningitis (except that caused by tuberculosis or sexually transmitted disease),004,DIAGNOSTIC SPINAL TAP,051,Viral meningitis,01,Diseases and Disorders of the Nervous System,1,Minor,Minor,Medical,Medicaid,,Self-Pay,03900,N,Y,22996.56,10902.13
New York City,Kings,7001021,001306,New York - Presbyterian Brooklyn Methodist Hospital,70 or Older,112,M,White,Not Span/Hispanic,13,Emergency,Skilled Nursing Home,2017,076,Meningitis (except that caused by tuberculosis or sexually transmitted disease),004,DIAGNOSTIC SPINAL TAP,051,Viral meningitis,01,Diseases and Disorders of the Nervous System,3,Major,Major,Medical,Medicare,Medicaid,Self-Pay,,N,Y,73521.59,22887.16
New York City,Manhattan,7002054,001464,New York Presbyterian Hospital - Columbia Presbyterian Center,0 to 17,109,M,White,Not Span/Hispanic,1,Emergency,Home or Self Care,2017,076,Meningitis (except that caused by tuberculosis or sexually transmitted disease),004,DIAGNOSTIC SPINAL TAP,051,Viral meningitis,01,Diseases and Disorders of the Nervous System,1,Minor,Minor,Medical,Medicaid,Self-Pay,,,N,Y,15627.60,3803.53
New York City,Manhattan,7002054,001464,New York Presbyterian Hospital - Columbia Presbyterian Center,0 to 17,112,F,Other Race,Not Span/Hispanic,2,Emergency,Home or Self Care,2017,076,Meningitis (except that caused by tuberculosis or sexually transmitted disease),004,DIAGNOSTIC SPINAL TAP,051,Viral meningitis,01,Diseases and Disorders of the Nervous System,1,Minor,Minor,Medical,Medicaid,Medicaid,Self-Pay,,N,Y,25160.16,7293.46
New York City,Manhattan,7002054,001464,New York Presbyterian Hospital - Columbia Presbyterian Center,0 to 17,109,M,Other Race,Not Span/Hispanic,1,Emergency,Home or Self Care,2017,076,Meningitis (except that caused by tuberculosis or sexually transmitted disease),004,DIAGNOSTIC SPINAL TAP,051,Viral meningitis,01,Diseases and Disorders of the Nervous System,1,Minor,Minor,Medical,Private Health Insurance,Self-Pay,,,N,Y,16594.08,4000.00
Western NY,Erie,1401013,000218,Sisters of Charity Hospital,30 to 49,142,F,Black/African American,Not Span/Hispanic,4,Emergency,Home or Self Care,2017,076,Meningitis (except that caused by tuberculosis or sexually transmitted disease),231,OTHER THERAPEUTIC PRCS,051,Viral meningitis,01,Diseases and Disorders of the Nervous System,2,Moderate,Moderate,Medical,Federal/State/Local/VA,,,,N,Y,16061.87,7248.46
Hudson Valley,Ulster,5501001,000990,HealthAlliance Hospital Broadway Campus,30 to 49,124,M,White,Not Span/Hispanic,6,Emergency,Home or Self Care,2017,076,Meningitis (except that caused by tuberculosis or sexually transmitted disease),004,DIAGNOSTIC SPINAL TAP,051,Viral meningitis,01,Diseases and Disorders of the Nervous System,2,Moderate,Moderate,Medical,Medicaid,,,,N,Y,61962.31,17113.29
New York City,Bronx,7000006,003058,Montefiore Med Center - Jack D Weiler Hosp of A Einstein College Div,18 to 29,OOS,M,Other Race,Spanish/Hispanic,8,Emergency,Home or Self Care,2017,076,Meningitis (except that caused by tuberculosis or sexually transmitted disease),231,OTHER THERAPEUTIC PRCS,051,Viral meningitis,01,Diseases and Disorders of the Nervous System,2,Moderate,Moderate,Medical,Private Health Insurance,,,,N,Y,102953.00,19093.46
New York City,Manhattan,7002001,001438,Bellevue Hospital Center,30 to 49,113,F,Other Race,Spanish/Hispanic,6,Emergency,Home or Self Care,2017,076,Meningitis (except that caused by tuberculosis or sexually transmitted disease),004,DIAGNOSTIC SPINAL TAP,051,Viral meningitis,01,Diseases and Disorders of the Nervous System,2,Moderate,Minor,Medical,Medicaid,,,,N,Y,33823.55,21807.67
New York City,Manhattan,7002017,001450,Lenox Hill Hospital,50 to 69,105,M,White,Unknown,8,Elective,Skilled Nursing Home,2017,076,Meningitis (except that caused by tuberculosis or sexually transmitted disease),054,OT VASC CATH; NOT HEART,051,Viral meningitis,01,Diseases and Disorders of the Nervous System,3,Major,Extreme,Medical,Medicare,Medicaid,,,N,N,121383.24,29545.49
Long Island,Suffolk,5151001,000245,University Hospital,50 to 69,119,F,White,Not Span/Hispanic,1,Emergency,Home or Self Care,2017,076,Meningitis (except that caused by tuberculosis or sexually transmitted disease),000,NO PROC,051,Viral meningitis,01,Diseases and Disorders of the Nervous System,1,Minor,Minor,Medical,Blue Cross/Blue Shield,,,,N,Y,17507.85,3882.85
Long Island,Suffolk,5123000,000885,Brookhaven Memorial Hospital Medical Center Inc,70 or Older,117,M,White,Not Span/Hispanic,8,Emergency,Home or Self Care,2017,076,Meningitis (except that caused by tuberculosis or sexually transmitted disease),004,DIAGNOSTIC SPINAL TAP,051,Viral meningitis,01,Diseases and Disorders of the Nervous System,2,Moderate,Minor,Medical,Medicare,Medicare,Private Health Insurance,,N,Y,52641.64,10692.25
Long Island,Suffolk,5123000,000885,Brookhaven Memorial Hospital Medical Center Inc,30 to 49,117,M,White,Not Span/Hispanic,4,Emergency,Home or Self Care,2017,076,Meningitis (except that caused by tuberculosis or sexually transmitted disease),199,ELECTROENCEPHALOGRAM,051,Viral meningitis,01,Diseases and Disorders of the Nervous System,2,Moderate,Moderate,Medical,Blue Cross/Blue Shield,,,,N,Y,59188.79,7544.30
Finger Lakes,Monroe,2701003,000411,Rochester General Hospital,30 to 49,146,M,Black/African American,Not Span/Hispanic,1,Emergency,Home or Self Care,2017,076,Meningitis (except that caused by tuberculosis or sexually transmitted disease),000,NO PROC,051,Viral meningitis,01,Diseases and Disorders of the Nervous System,2,Moderate,Minor,Medical,Self-Pay,,,,N,Y,9438.34,2871.12
Southern Tier,Broome,0303001,000042,United Health Services Hospitals Inc. - Binghamton General Hospital,70 or Older,137,M,White,Not Span/Hispanic,14,Emergency,Skilled Nursing Home,2017,076,Meningitis (except that caused by tuberculosis or sexually transmitted disease),004,DIAGNOSTIC SPINAL TAP,051,Viral meningitis,01,Diseases and Disorders of the Nervous System,3,Major,Major,Medical,Medicare,Medicare,Medicaid,,N,Y,38826.69,18373.09
Southern Tier,Broome,0303001,000058,United Health Services Hospitals Inc. - Wilson Medical Center,30 to 49,139,F,Black/African American,Not Span/Hispanic,4,Emergency,Home or Self Care,2017,076,Meningitis (except that caused by tuberculosis or sexually transmitted disease),004,DIAGNOSTIC SPINAL TAP,051,Viral meningitis,01,Diseases and Disorders of the Nervous System,2,Moderate,Minor,Medical,Medicaid,Medicaid,,,N,Y,14148.66,5881.94
Hudson Valley,Orange,3535001,000708,Bon Secours Community Hospital,30 to 49,127,F,White,Not Span/Hispanic,4,Emergency,Home or Self Care,2017,076,Meningitis (except that caused by tuberculosis or sexually transmitted disease),004,DIAGNOSTIC SPINAL TAP,051,Viral meningitis,01,Diseases and Disorders of the Nervous System,2,Moderate,Minor,Medical,Private Health Insurance,,,,N,Y,41571.72,17568.32
Long Island,Nassau,2908000,000511,NYU Winthrop Hospital,50 to 69,117,F,White,Not Span/Hispanic,7,Emergency,Home or Self Care,2017,076,Meningitis (except that caused by tuberculosis or sexually transmitted disease),000,NO PROC,051,Viral meningitis,01,Diseases and Disorders of the Nervous System,2,Moderate,Minor,Medical,Medicare,Medicare,Private Health Insurance,,N,Y,85531.04,14701.06
Long Island,Nassau,2953000,000563,St Francis Hospital,30 to 49,110,M,White,Not Span/Hispanic,2,Emergency,Home or Self Care,2017,076,Meningitis (except that caused by tuberculosis or sexually transmitted disease),000,NO PROC,051,Viral meningitis,01,Diseases and Disorders of the Nervous System,2,Moderate,Moderate,Medical,Private Health Insurance,,,,N,Y,13444.00,2508.42
Long Island,Suffolk,5154001,000925,Good Samaritan Hospital Medical Center,50 to 69,117,M,Other Race,Not Span/Hispanic,4,Emergency,Home or Self Care,2017,076,Meningitis (except that caused by tuberculosis or sexually transmitted disease),004,DIAGNOSTIC SPINAL TAP,051,Viral meningitis,01,Diseases and Disorders of the Nervous System,3,Major,Major,Medical,Private Health Insurance,,,,N,Y,55271.00,12301.82
Long Island,Suffolk,5154001,000925,Good Samaritan Hospital Medical Center,30 to 49,117,M,Other Race,Spanish/Hispanic,6,Emergency,Home or Self Care,2017,076,Meningitis (except that caused by tuberculosis or sexually transmitted disease),004,DIAGNOSTIC SPINAL TAP,051,Viral meningitis,01,Diseases and Disorders of the Nervous System,2,Moderate,Minor,Medical,Medicaid,Medicaid,,,N,Y,42252.00,7498.12
Western NY,Erie,1401014,000207,Buffalo General Medical Center,18 to 29,141,F,White,Not Span/Hispanic,4,Emergency,Home or Self Care,2017,076,Meningitis (except that caused by tuberculosis or sexually transmitted disease),004,DIAGNOSTIC SPINAL TAP,051,Viral meningitis,01,Diseases and Disorders of the Nervous System,2,Moderate,Minor,Medical,Medicaid,Self-Pay,,,N,Y,12442.13,6090.50
Western NY,Genesee,1801000,000339,United Memorial Medical Center North Street Campus,50 to 69,140,M,Other Race,Unknown,6,Emergency,Home or Self Care,2017,076,Meningitis (except that caused by tuberculosis or sexually transmitted disease),004,DIAGNOSTIC SPINAL TAP,051,Viral meningitis,01,Diseases and Disorders of the Nervous System,2,Moderate,Moderate,Medical,Federal/State/Local/VA,Medicare,,,N,Y,20301.53,7243.32
Central NY,Cortland,1101000,000158,Cortland Regional Medical Center Inc,70 or Older,131,M,White,Not Span/Hispanic,10,Emergency,Skilled Nursing Home,2017,076,Meningitis (except that caused by tuberculosis or sexually transmitted disease),004,DIAGNOSTIC SPINAL TAP,051,Viral meningitis,01,Diseases and Disorders of the Nervous System,3,Major,Major,Medical,Medicare,Private Health Insurance,,,N,Y,25837.66,12740.40
Central NY,Onondaga,3301007,000635,University Hospital SUNY Health Science Center,50 to 69,130,M,White,Not Span/Hispanic,2,Emergency,Home or Self Care,2017,076,Meningitis (except that caused by tuberculosis or sexually transmitted disease),004,DIAGNOSTIC SPINAL TAP,051,Viral meningitis,01,Diseases and Disorders of the Nervous System,2,Moderate,Minor,Medical,Blue Cross/Blue Shield,Medicare,,,N,Y,17009.80,5443.28
Central NY,Onondaga,3301007,000635,University Hospital SUNY Health Science Center,50 to 69,136,M,White,Not Span/Hispanic,3,Emergency,Home or Self Care,2017,076,Meningitis (except that caused by tuberculosis or sexually transmitted disease),199,ELECTROENCEPHALOGRAM,051,Viral meningitis,01,Diseases and Disorders of the Nervous System,3,Major,Moderate,Medical,Medicare,,,,N,N,30322.69,11492.03
Hudson Valley,Orange,3523000,000699,Orange Regional Medical Center,50 to 69,109,M,White,Not Span/Hispanic,11,Elective,Home or Self Care,2017,076,Meningitis (except that caused by tuberculosis or sexually transmitted disease),174,OT NON-OR THER PRC SKIN,051,Viral meningitis,01,Diseases and Disorders of the Nervous System,2,Moderate,Moderate,Medical,Medicare,,,,N,N,60828.93,15850.04
Hudson Valley,Orange,3523000,000699,Orange Regional Medical Center,50 to 69,125,F,White,Not Span/Hispanic,5,Emergency,Home or Self Care,2017,076,Meningitis (except that caused by tuberculosis or sexually transmitted disease),004,DIAGNOSTIC SPINAL TAP,051,Viral meningitis,01,Diseases and Disorders of the Nervous System,1,Minor,Minor,Medical,Medicaid,,,,N,Y,34690.58,8215.33
Hudson Valley,Westchester,5902001,001045,White Plains Hospital Center,50 to 69,106,F,Other Race,Not Span/Hispanic,6,Emergency,Home or Self Care,2017,076,Meningitis (except that caused by tuberculosis or sexually transmitted disease),000,NO PROC,051,Viral meningitis,01,Diseases and Disorders of the Nervous System,2,Moderate,Minor,Medical,Private Health Insurance,Self-Pay,Self-Pay,,N,Y,29343.00,9720.85
Hudson Valley,Westchester,5922000,001122,New York-Presbyterian/Lawrence Hospital,18 to 29,104,F,White,Not Span/Hispanic,4,Emergency,Home or Self Care,2017,076,Meningitis (except that caused by tuberculosis or sexually transmitted disease),004,DIAGNOSTIC SPINAL TAP,051,Viral meningitis,01,Diseases and Disorders of the Nervous System,1,Minor,Minor,Medical,Medicaid,Self-Pay,Self-Pay,,N,Y,40879.95,13463.76
New York City,Manhattan,7002032,001466,Mount Sinai West,30 to 49,100,F,White,Not Span/Hispanic,2,Emergency,Home or Self Care,2017,076,Meningitis (except that caused by tuberculosis or sexually transmitted disease),177,COMP AXIAL TOMOGR (CT),051,Viral meningitis,01,Diseases and Disorders of the Nervous System,1,Minor,Minor,Medical,Private Health Insurance,Self-Pay,,,N,Y,23073.67,6164.45
New York City,Queens,7003004,003376,Cohen Children's Medical Center,0 to 17,117,F,Other Race,Unknown,6,Urgent,Home or Self Care,2017,076,Meningitis (except that caused by tuberculosis or sexually transmitted disease),216,RESP INTUB/MECH VENTIL,051,Viral meningitis,01,Diseases and Disorders of the Nervous System,4,Extreme,Extreme,Medical,Medicaid,Medicaid,Self-Pay,,N,N,108039.74,28377.54
Long Island,Suffolk,5153000,000913,Huntington Hospital,30 to 49,117,M,White,Not Span/Hispanic,2,Emergency,Home w/ Home Health Services,2017,076,Meningitis (except that caused by tuberculosis or sexually transmitted disease),004,DIAGNOSTIC SPINAL TAP,051,Viral meningitis,01,Diseases and Disorders of the Nervous System,2,Moderate,Minor,Medical,Blue Cross/Blue Shield,,,,N,Y,19627.04,4492.12
Hudson Valley,Westchester,5920000,001117,Northern Westchester Hospital,30 to 49,105,M,Other Race,Unknown,4,Emergency,Home or Self Care,2017,076,Meningitis (except that caused by tuberculosis or sexually transmitted disease),008,OT NON-OR THER NERV SYS,051,Viral meningitis,01,Diseases and Disorders of the Nervous System,2,Moderate,Minor,Medical,Private Health Insurance,,,,N,Y,27895.75,13872.73
New York City,Kings,7001009,001294,Coney Island Hospital,30 to 49,112,F,Other Race,Spanish/Hispanic,12,Emergency,Short-term Hospital,2017,076,Meningitis (except that caused by tuberculosis or sexually transmitted disease),231,OTHER THERAPEUTIC PRCS,051,Viral meningitis,01,Diseases and Disorders of the Nervous System,1,Minor,Minor,Medical,Medicaid,,,,N,Y,67377.70,33073.76
New York City,Kings,7001021,001306,New York - Presbyterian Brooklyn Methodist Hospital,30 to 49,112,M,White,Spanish/Hispanic,6,Emergency,Home or Self Care,2017,076,Meningitis (except that caused by tuberculosis or sexually transmitted disease),004,DIAGNOSTIC SPINAL TAP,051,Viral meningitis,01,Diseases and Disorders of the Nervous System,1,Minor,Minor,Medical,Blue Cross/Blue Shield,Self-Pay,,,N,Y,47576.59,14874.74
New York City,Kings,7001037,001320,University Hospital of Brooklyn,30 to 49,112,F,White,Not Span/Hispanic,6,Emergency,Home or Self Care,2017,076,Meningitis (except that caused by tuberculosis or sexually transmitted disease),004,DIAGNOSTIC SPINAL TAP,051,Viral meningitis,01,Diseases and Disorders of the Nervous System,2,Moderate,Minor,Medical,Medicaid,Medicaid,Self-Pay,,N,Y,32329.30,20979.66
New York City,Manhattan,7002054,001458,New York Presbyterian Hospital - New York Weill Cornell Center,50 to 69,100,M,Other Race,Not Span/Hispanic,1,Emergency,Home or Self Care,2017,076,Meningitis (except that caused by tuberculosis or sexually transmitted disease),004,DIAGNOSTIC SPINAL TAP,051,Viral meningitis,01,Diseases and Disorders of the Nervous System,2,Moderate,Minor,Medical,Private Health Insurance,Self-Pay,,,N,Y,19617.23,4721.57
New York City,Manhattan,7002054,003975,New York Presbyterian Hospital - Allen Hospital,50 to 69,104,M,Other Race,Not Span/Hispanic,9,Emergency,Home w/ Home Health Services,2017,076,Meningitis (except that caused by tuberculosis or sexually transmitted disease),004,DIAGNOSTIC SPINAL TAP,051,Viral meningitis,01,Diseases and Disorders of the Nervous System,2,Moderate,Minor,Medical,Blue Cross/Blue Shield,Self-Pay,,,N,Y,102520.58,25434.81
Western NY,Niagara,3121001,000583,Mount St Marys Hospital and Health Center,50 to 69,140,M,White,Not Span/Hispanic,8,Emergency,Home w/ Home Health Services,2017,076,Meningitis (except that caused by tuberculosis or sexually transmitted disease),054,OT VASC CATH; NOT HEART,051,Viral meningitis,01,Diseases and Disorders of the Nervous System,2,Moderate,Moderate,Medical,Medicare,Blue Cross/Blue Shield,,,N,Y,19178.44,14087.61
New York City,Kings,7001016,001301,Kings County Hospital Center,18 to 29,112,M,Other Race,Spanish/Hispanic,2,Emergency,Left Against Medical Advice,2017,076,Meningitis (except that caused by tuberculosis or sexually transmitted disease),004,DIAGNOSTIC SPINAL TAP,051,Viral meningitis,01,Diseases and Disorders of the Nervous System,1,Minor,Minor,Medical,Medicaid,Medicaid,,,N,Y,14871.07,8938.66
New York City,Manhattan,7002053,001463,NYU Langone Hospitals,18 to 29,,M,Black/African American,Spanish/Hispanic,6,Emergency,Home or Self Care,2017,076,Meningitis (except that caused by tuberculosis or sexually transmitted disease),004,DIAGNOSTIC SPINAL TAP,051,Viral meningitis,01,Diseases and Disorders of the Nervous System,2,Moderate,Minor,Medical,Medicaid,,,,N,Y,65472.08,24676.68
New York City,Manhattan,7002032,001466,Mount Sinai West,30 to 49,OOS,F,White,Unknown,2,Emergency,Home or Self Care,2017,076,Meningitis (except that caused by tuberculosis or sexually transmitted disease),004,DIAGNOSTIC SPINAL TAP,051,Viral meningitis,01,Diseases and Disorders of the Nervous System,2,Moderate,Minor,Medical,Private Health Insurance,Self-Pay,,,N,Y,19995.34,5397.54
Long Island,Suffolk,5151001,000245,University Hospital,0 to 17,117,M,White,Not Span/Hispanic,2,Emergency,Home or Self Care,2017,076,Meningitis (except that caused by tuberculosis or sexually transmitted disease),000,NO PROC,051,Viral meningitis,01,Diseases and Disorders of the Nervous System,3,Major,Minor,Medical,Blue Cross/Blue Shield,,,,N,Y,32563.32,7475.92
Long Island,Nassau,2951001,000541,North Shore University Hospital,50 to 69,110,F,White,Not Span/Hispanic,9,Emergency,Home or Self Care,2017,076,Meningitis (except that caused by tuberculosis or sexually transmitted disease),004,DIAGNOSTIC SPINAL TAP,051,Viral meningitis,01,Diseases and Disorders of the Nervous System,1,Minor,Minor,Medical,Blue Cross/Blue Shield,,,,N,Y,109141.96,17702.97
Long Island,Nassau,2951001,000541,North Shore University Hospital,18 to 29,115,F,White,Not Span/Hispanic,3,Emergency,Home or Self Care,2017,076,Meningitis (except that caused by tuberculosis or sexually transmitted disease),000,NO PROC,051,Viral meningitis,01,Diseases and Disorders of the Nervous System,2,Moderate,Minor,Medical,Private Health Insurance,,,,N,Y,42524.92,7748.21
Long Island,Suffolk,5155000,000938,Peconic Bay Medical Center,70 or Older,119,M,White,Spanish/Hispanic,18,Emergency,Short-term Hospital,2017,076,Meningitis (except that caused by tuberculosis or sexually transmitted disease),004,DIAGNOSTIC SPINAL TAP,051,Viral meningitis,01,Diseases and Disorders of the Nervous System,3,Major,Extreme,Medical,Medicare,Medicare,,,N,Y,177370.48,48760.51
Capital/Adirond,Albany,0101000,000001,Albany Medical Center Hospital,30 to 49,128,M,White,Not Span/Hispanic,6,Emergency,Home or Self Care,2017,076,Meningitis (except that caused by tuberculosis or sexually transmitted disease),000,NO PROC,051,Viral meningitis,01,Diseases and Disorders of the Nervous System,2,Moderate,Moderate,Medical,"Managed Care, Unspecified",,,,N,Y,29960.34,9101.65
Capital/Adirond,Franklin,1624000,000325,Alice Hyde Medical Center,0 to 17,129,M,White,Not Span/Hispanic,3,Emergency,Home or Self Care,2017,076,Meningitis (except that caused by tuberculosis or sexually transmitted disease),004,DIAGNOSTIC SPINAL TAP,051,Viral meningitis,01,Diseases and Disorders of the Nervous System,1,Minor,Minor,Medical,Self-Pay,,,,N,Y,11778.36,23365.17
Capital/Adirond,Montgomery,2801001,000484,St. Mary's Healthcare,50 to 69,120,M,White,Not Span/Hispanic,15,Emergency,Expired,2017,076,Meningitis (except that caused by tuberculosis or sexually transmitted disease),058,HEMODIALYSIS,051,Viral meningitis,01,Diseases and Disorders of the Nervous System,2,Moderate,Moderate,Medical,Medicare,Medicaid,,,N,Y,73492.28,32474.55
New York City,Bronx,7000002,001165,Jacobi Medical Center,30 to 49,104,F,Other Race,Not Span/Hispanic,4,Emergency,Home or Self Care,2017,076,Meningitis (except that caused by tuberculosis or sexually transmitted disease),004,DIAGNOSTIC SPINAL TAP,051,Viral meningitis,01,Diseases and Disorders of the Nervous System,1,Minor,Minor,Medical,Medicaid,Medicaid,,,N,Y,27334.78,16140.61