Hospital Service Area,Hospital County,Operating Certificate Number,Permanent Facility Id,Facility Name,Age Group,Zip Code - 3 digits,Gender,Race,Ethnicity,Length of Stay,Type of Admission,Patient Disposition,Discharge Year,CCS Diagnosis Code,CCS Diagnosis Description,CCS Procedure Code,CCS Procedure Description,APR DRG Code,APR DRG Description,APR MDC Code,APR MDC Description,APR Severity of Illness Code,APR Severity of Illness Description,APR Risk of Mortality,APR Medical Surgical Description,Payment Typology 1,Payment Typology 2,Payment Typology 3,Birth Weight,Abortion Edit Indicator,Emergency Department Indicator,Total Charges,Total Costs
New York City,Queens,7003010,001637,New York - Presbyterian/Queens,0 to 17,113,F,Other Race,Not Span/Hispanic,2,Emergency,Short-term Hospital,2020,NVS001,MENINGITIS,CNS002,LUMBAR PUNCTURE,051,VIRAL MENINGITIS,01,DISEASES AND DISORDERS OF THE NERVOUS SYSTEM,1,Minor,Minor,Medical,"Managed Care, Unspecified",Medicaid,Self-Pay,,,Y,31100.24,7005.24
New York City,Manhattan,7002054,001458,New York-Presbyterian Hospital - New York Weill Cornell Center,30 to 49,100,M,White,Not Span/Hispanic,3,Emergency,Home w/ Home Health Services,2020,NVS001,MENINGITIS,CNS002,LUMBAR PUNCTURE,051,VIRAL MENINGITIS,01,DISEASES AND DISORDERS OF THE NERVOUS SYSTEM,2,Moderate,Minor,Medical,Private Health Insurance,Self-Pay,,,,Y,57177.62,11742.47
Long Island,Nassau,2950002,000528,Nassau University Medical Center,50 to 69,115,F,White,Not Span/Hispanic,5,Emergency,Home or Self Care,2020,NVS001,MENINGITIS,CNS002,LUMBAR PUNCTURE,051,VIRAL MENINGITIS,01,DISEASES AND DISORDERS OF THE NERVOUS SYSTEM,2,Moderate,Minor,Medical,Medicare,Blue Cross/Blue Shield,Self-Pay,,,N,37531.16,14065.39
Finger Lakes,Monroe,2701005,000413,Strong Memorial Hospital,50 to 69,145,F,White,Not Span/Hispanic,7,Emergency,Home or Self Care,2020,NVS001,MENINGITIS,CNS002,LUMBAR PUNCTURE,051,VIRAL MENINGITIS,01,DISEASES AND DISORDERS OF THE NERVOUS SYSTEM,2,Moderate,Moderate,Medical,Medicare,Medicaid,,,,Y,29005.29,13368.98
Finger Lakes,Monroe,2701005,000413,Strong Memorial Hospital,70 or Older,144,M,White,Not Span/Hispanic,6,Emergency,Home or Self Care,2020,NVS001,MENINGITIS,CNS002,LUMBAR PUNCTURE,051,VIRAL MENINGITIS,01,DISEASES AND DISORDERS OF THE NERVOUS SYSTEM,3,Major,Major,Medical,Medicare,,,,,Y,45509.11,18808.38
Capital/Adirond,Albany,0101000,000001,Albany Medical Center Hospital,18 to 29,120,F,White,Not Span/Hispanic,2,Emergency,Home or Self Care,2020,NVS001,MENINGITIS,,,051,VIRAL MENINGITIS,01,DISEASES AND DISORDERS OF THE NERVOUS SYSTEM,2,Moderate,Minor,Medical,"Managed Care, Unspecified",,,,,Y,25581.39,4582.08
Capital/Adirond,Albany,0101000,000001,Albany Medical Center Hospital,0 to 17,123,M,Other Race,Unknown,3,Emergency,Home or Self Care,2020,NVS001,MENINGITIS,,,051,VIRAL MENINGITIS,01,DISEASES AND DISORDERS OF THE NERVOUS SYSTEM,1,Minor,Minor,Medical,"Managed Care, Unspecified",,,,,Y,11563.43,4225.51
New York City,Bronx,7000006,003058,Montefiore Med Center - Jack D Weiler Hosp of A Einstein College Div,30 to 49,104,M,Other Race,Spanish/Hispanic,5,Emergency,Home or Self Care,2020,NVS001,MENINGITIS,CNS002,LUMBAR PUNCTURE,051,VIRAL MENINGITIS,01,DISEASES AND DISORDERS OF THE NERVOUS SYSTEM,1,Minor,Minor,Medical,Private Health Insurance,,,,,Y,83784.43,13032.68
New York City,Manhattan,7002054,001458,New York-Presbyterian Hospital - New York Weill Cornell Center,50 to 69,100,F,Multi-racial,Not Span/Hispanic,1,Emergency,Home or Self Care,2020,NVS001,MENINGITIS,CNS002,LUMBAR PUNCTURE,051,VIRAL MENINGITIS,01,DISEASES AND DISORDERS OF THE NERVOUS SYSTEM,4,Extreme,Major,Medical,Private Health Insurance,Self-Pay,,,,Y,18404.71,3820.15
New York City,Manhattan,7002053,001463,NYU Langone Hospitals,18 to 29,112,M,White,Not Span/Hispanic,1,Emergency,Home or Self Care,2020,NVS001,MENINGITIS,CNS002,LUMBAR PUNCTURE,051,VIRAL MENINGITIS,01,DISEASES AND DISORDERS OF THE NERVOUS SYSTEM,2,Moderate,Minor,Medical,Medicaid,,,,,Y,33488.42,6580.4
Finger Lakes,Monroe,2701003,000411,Rochester General Hospital,18 to 29,146,F,Black/African American,Not Span/Hispanic,4,Emergency,Home or Self Care,2020,NVS001,MENINGITIS,,,051,VIRAL MENINGITIS,01,DISEASES AND DISORDERS OF THE NERVOUS SYSTEM,1,Minor,Moderate,Medical,Medicaid,,,,,Y,19002.68,7917.48
Finger Lakes,Monroe,2754001,000471,The Unity Hospital of Rochester,30 to 49,145,M,White,Not Span/Hispanic,6,Emergency,Home or Self Care,2020,NVS001,MENINGITIS,CNS002,LUMBAR PUNCTURE,051,VIRAL MENINGITIS,01,DISEASES AND DISORDERS OF THE NERVOUS SYSTEM,4,Extreme,Major,Medical,Blue Cross/Blue Shield,,,,,Y,25215.99,12193.67
Capital/Adirond,Albany,0101000,000001,Albany Medical Center Hospital,0 to 17,121,M,White,Not Span/Hispanic,3,Emergency,Home or Self Care,2020,NVS001,MENINGITIS,CNS002,LUMBAR PUNCTURE,051,VIRAL MENINGITIS,01,DISEASES AND DISORDERS OF THE NERVOUS SYSTEM,2,Moderate,Minor,Medical,"Managed Care, Unspecified",,,,,Y,33206.36,8249.63
Central NY,Onondaga,3301003,000630,St. Joseph's Hospital Health Center,30 to 49,132,M,White,Not Span/Hispanic,2,Emergency,Home or Self Care,2020,NVS001,MENINGITIS,CNS002,LUMBAR PUNCTURE,051,VIRAL MENINGITIS,01,DISEASES AND DISORDERS OF THE NERVOUS SYSTEM,1,Minor,Minor,Medical,Medicare,Medicaid,,,,Y,9731.99,3342.05
New York City,Kings,7002053,001304,NYU Langone Hospital-Brooklyn,70 or Older,112,M,Other Race,Not Span/Hispanic,17,Elective,Home w/ Home Health Services,2020,NVS001,MENINGITIS,RHB002,"PHYSICAL, OCCUPATIONAL, AND RESPIRATORY THERAPY TREATMENT",051,VIRAL MENINGITIS,01,DISEASES AND DISORDERS OF THE NERVOUS SYSTEM,3,Major,Major,Medical,Medicare,Medicaid,,,,N,172639.59,52752.86
New York City,Bronx,7000006,001168,Montefiore Medical Center-Wakefield Hospital,30 to 49,104,M,Other Race,Not Span/Hispanic,2,Emergency,Home or Self Care,2020,NVS001,MENINGITIS,CNS002,LUMBAR PUNCTURE,051,VIRAL MENINGITIS,01,DISEASES AND DISORDERS OF THE NERVOUS SYSTEM,1,Minor,Minor,Medical,Blue Cross/Blue Shield,,,,,Y,46748.88,6145.88
Central NY,Onondaga,3301007,000628,UPSTATE University Hospital at Community General,18 to 29,136,F,White,Not Span/Hispanic,1,Emergency,Home or Self Care,2020,NVS001,MENINGITIS,CNS002,LUMBAR PUNCTURE,051,VIRAL MENINGITIS,01,DISEASES AND DISORDERS OF THE NERVOUS SYSTEM,1,Minor,Minor,Medical,Blue Cross/Blue Shield,,,,,Y,15043.1,3132.71
New York City,Queens,7003004,003376,Cohen Children's Medical Center,0 to 17,110,F,Black/African American,Not Span/Hispanic,2,Emergency,Home or Self Care,2020,NVS001,MENINGITIS,IMG008,ULTRASONOGRAPHY,051,VIRAL MENINGITIS,01,DISEASES AND DISORDERS OF THE NERVOUS SYSTEM,2,Moderate,Minor,Medical,Blue Cross/Blue Shield,Self-Pay,,05400,,Y,35866.25,5728.74
Hudson Valley,Westchester,5907001,001097,SJRH - St Johns Division,30 to 49,107,F,Black/African American,Not Span/Hispanic,8,Emergency,Home or Self Care,2020,NVS001,MENINGITIS,,,051,VIRAL MENINGITIS,01,DISEASES AND DISORDERS OF THE NERVOUS SYSTEM,2,Moderate,Minor,Medical,Medicare,Medicare,Medicaid,,,Y,53706.1,15848.05
New York City,Manhattan,7002054,001458,New York-Presbyterian Hospital - New York Weill Cornell Center,30 to 49,100,F,Other Race,Spanish/Hispanic,1,Emergency,Home or Self Care,2020,NVS001,MENINGITIS,ADM015,ADMINISTRATION OF ANTIBIOTICS,051,VIRAL MENINGITIS,01,DISEASES AND DISORDERS OF THE NERVOUS SYSTEM,2,Moderate,Minor,Medical,Private Health Insurance,,,,,Y,22536.05,4441.85
New York City,Queens,7003010,001637,New York - Presbyterian/Queens,30 to 49,113,M,White,Spanish/Hispanic,5,Emergency,Home or Self Care,2020,NVS001,MENINGITIS,CNS002,LUMBAR PUNCTURE,051,VIRAL MENINGITIS,01,DISEASES AND DISORDERS OF THE NERVOUS SYSTEM,2,Moderate,Minor,Medical,Medicaid,Self-Pay,,,,Y,43995.14,9625.83
Hudson Valley,Rockland,4324000,000776,Montefiore Nyack,30 to 49,109,M,White,Not Span/Hispanic,4,Emergency,Left Against Medical Advice,2020,NVS001,MENINGITIS,CNS002,LUMBAR PUNCTURE,051,VIRAL MENINGITIS,01,DISEASES AND DISORDERS OF THE NERVOUS SYSTEM,2,Moderate,Minor,Medical,Medicaid,,,,,N,26723.67,7056.83
Hudson Valley,Rockland,4324000,000776,Montefiore Nyack,50 to 69,109,F,White,Not Span/Hispanic,4,Emergency,Short-term Hospital,2020,NVS001,MENINGITIS,CNS002,LUMBAR PUNCTURE,051,VIRAL MENINGITIS,01,DISEASES AND DISORDERS OF THE NERVOUS SYSTEM,4,Extreme,Major,Medical,Medicare,Medicare,,,,N,38897.15,8753.54
Finger Lakes,Wayne,5820000,001028,Newark-Wayne Community Hospital,50 to 69,145,F,White,Not Span/Hispanic,5,Emergency,Skilled Nursing Home,2020,NVS001,MENINGITIS,,,051,VIRAL MENINGITIS,01,DISEASES AND DISORDERS OF THE NERVOUS SYSTEM,2,Moderate,Moderate,Medical,Medicare,Private Health Insurance,,,,Y,19763.32,7114.2
New York City,Richmond,7004003,001740,Staten Island University Hosp-North,0 to 17,103,F,Black/African American,Not Span/Hispanic,2,Emergency,Home or Self Care,2020,NVS001,MENINGITIS,CNS002,LUMBAR PUNCTURE,051,VIRAL MENINGITIS,01,DISEASES AND DISORDERS OF THE NERVOUS SYSTEM,1,Minor,Minor,Medical,Blue Cross/Blue Shield,,,,,Y,15983.26,14536.14
Hudson Valley,Westchester,5902001,001045,White Plains Hospital Center,70 or Older,104,M,Black/African American,Not Span/Hispanic,26,Emergency,Inpatient Rehabilitation Facility,2020,NVS001,MENINGITIS,MAM011,ELECTROENCEPHALOGRAM (EEG),051,VIRAL MENINGITIS,01,DISEASES AND DISORDERS OF THE NERVOUS SYSTEM,3,Major,Major,Medical,Self-Pay,,,,,Y,184323.06,40813.55
New York City,Manhattan,7002009,001445,Harlem Hospital Center,0 to 17,100,F,Black/African American,Not Span/Hispanic,5,Emergency,Home or Self Care,2020,NVS001,MENINGITIS,CNS002,LUMBAR PUNCTURE,051,VIRAL MENINGITIS,01,DISEASES AND DISORDERS OF THE NERVOUS SYSTEM,1,Minor,Minor,Medical,Medicaid,,,,,Y,35848.45,27503.72
New York City,Kings,7001016,001301,Kings County Hospital Center,0 to 17,112,F,Black/African American,Not Span/Hispanic,1,Emergency,Short-term Hospital,2020,NVS001,MENINGITIS,,,051,VIRAL MENINGITIS,01,DISEASES AND DISORDERS OF THE NERVOUS SYSTEM,3,Major,Moderate,Medical,Medicaid,,,,,Y,19251.57,13897.05
Finger Lakes,Monroe,2701005,000413,Strong Memorial Hospital,18 to 29,145,F,White,Not Span/Hispanic,2,Emergency,Home or Self Care,2020,NVS001,MENINGITIS,CNS002,LUMBAR PUNCTURE,051,VIRAL MENINGITIS,01,DISEASES AND DISORDERS OF THE NERVOUS SYSTEM,2,Moderate,Moderate,Medical,Blue Cross/Blue Shield,,,,,Y,8630.26,3513.02
Long Island,Nassau,2951001,000541,North Shore University Hospital,30 to 49,117,F,White,Not Span/Hispanic,2,Emergency,Home or Self Care,2020,NVS001,MENINGITIS,,,051,VIRAL MENINGITIS,01,DISEASES AND DISORDERS OF THE NERVOUS SYSTEM,2,Moderate,Moderate,Medical,Private Health Insurance,Medicaid,Medicaid,,,Y,23504.18,4019.92
Long Island,Nassau,2951001,000541,North Shore University Hospital,70 or Older,114,M,White,Not Span/Hispanic,11,Emergency,Skilled Nursing Home,2020,NVS001,MENINGITIS,CNS002,LUMBAR PUNCTURE,051,VIRAL MENINGITIS,01,DISEASES AND DISORDERS OF THE NERVOUS SYSTEM,3,Major,Major,Medical,Medicare,Blue Cross/Blue Shield,,,,Y,135935.92,22932.57
New York City,Kings,7001008,001293,"New York Community Hospital of Brooklyn, Inc",50 to 69,112,F,Black/African American,Not Span/Hispanic,4,Emergency,Home or Self Care,2020,NVS001,MENINGITIS,,,051,VIRAL MENINGITIS,01,DISEASES AND DISORDERS OF THE NERVOUS SYSTEM,1,Minor,Minor,Medical,"Managed Care, Unspecified",Self-Pay,,,,Y,20539.42,9073.6
New York City,Bronx,7000008,001172,Lincoln Medical & Mental Health Center,50 to 69,104,F,Other Race,Spanish/Hispanic,3,Emergency,Home or Self Care,2020,NVS001,MENINGITIS,ADM021,"ADMINISTRATION OF THERAPEUTIC SUBSTANCES, NEC",051,VIRAL MENINGITIS,01,DISEASES AND DISORDERS OF THE NERVOUS SYSTEM,2,Moderate,Minor,Medical,Private Health Insurance,,,,,Y,23601.08,15084.04
New York City,Queens,7003004,003376,Cohen Children's Medical Center,0 to 17,115,M,Other Race,Spanish/Hispanic,9,Urgent,Facility w/ Custodial/Supportive Care,2020,NVS001,MENINGITIS,CNS002,LUMBAR PUNCTURE,051,VIRAL MENINGITIS,01,DISEASES AND DISORDERS OF THE NERVOUS SYSTEM,3,Major,Major,Medical,Medicaid,Medicaid,Self-Pay,,,N,109061.07,24610.67
New York City,Queens,7003004,003376,Cohen Children's Medical Center,0 to 17,114,F,Black/African American,Not Span/Hispanic,2,Urgent,Home or Self Care,2020,NVS001,MENINGITIS,,,051,VIRAL MENINGITIS,01,DISEASES AND DISORDERS OF THE NERVOUS SYSTEM,1,Minor,Minor,Medical,Medicaid,Self-Pay,,,,N,17782.03,3154.61
Hudson Valley,Westchester,5957001,001139,Westchester Medical Center,0 to 17,109,M,White,Not Span/Hispanic,2,Emergency,Home or Self Care,2020,NVS001,MENINGITIS,,,051,VIRAL MENINGITIS,01,DISEASES AND DISORDERS OF THE NERVOUS SYSTEM,1,Minor,Minor,Medical,Medicaid,Medicaid,,,,Y,38615.18,6359.24
New York City,Kings,7001020,001305,Maimonides Medical Center,0 to 17,112,F,White,Not Span/Hispanic,3,Emergency,Home or Self Care,2020,NVS001,MENINGITIS,CAR024,VENOUS AND ARTERIAL CATHETER PLACEMENT,051,VIRAL MENINGITIS,01,DISEASES AND DISORDERS OF THE NERVOUS SYSTEM,4,Extreme,Extreme,Medical,Medicaid,Medicaid,Self-Pay,,,Y,55304.17,23708.03
Hudson Valley,Orange,3522000,000694,St Luke's Cornwall Hospital/Newburgh,30 to 49,125,F,White,Not Span/Hispanic,4,Emergency,Home or Self Care,2020,NVS001,MENINGITIS,CNS002,LUMBAR PUNCTURE,051,VIRAL MENINGITIS,01,DISEASES AND DISORDERS OF THE NERVOUS SYSTEM,2,Moderate,Minor,Medical,Private Health Insurance,,,,,Y,49667.83,10011.07
Hudson Valley,Westchester,7002054,001122,New York - Presbyterian Hospital,30 to 49,107,F,Black/African American,Not Span/Hispanic,4,Emergency,Home or Self Care,2020,NVS001,MENINGITIS,CNS002,LUMBAR PUNCTURE,051,VIRAL MENINGITIS,01,DISEASES AND DISORDERS OF THE NERVOUS SYSTEM,2,Moderate,Minor,Medical,Blue Cross/Blue Shield,Medicaid,Medicaid,,,N,54969.73,13290.14
Hudson Valley,Westchester,5920000,001117,Northern Westchester Hospital,30 to 49,105,M,White,Not Span/Hispanic,7,Emergency,Home or Self Care,2020,NVS001,MENINGITIS,CAR024,VENOUS AND ARTERIAL CATHETER PLACEMENT,051,VIRAL MENINGITIS,01,DISEASES AND DISORDERS OF THE NERVOUS SYSTEM,2,Moderate,Moderate,Medical,Private Health Insurance,,,,,Y,41740.81,20153.33
Hudson Valley,Westchester,5902002,001046,Winifred Masterson Burke Rehabilitation Hospital,30 to 49,104,F,Other Race,Spanish/Hispanic,21,Elective,Home or Self Care,2020,NVS001,MENINGITIS,,,051,VIRAL MENINGITIS,01,DISEASES AND DISORDERS OF THE NERVOUS SYSTEM,4,Extreme,Extreme,Medical,Self-Pay,,,,,N,76629.96,33951.9
New York City,Kings,7002053,001304,NYU Langone Hospital-Brooklyn,18 to 29,OOS,M,Other Race,Not Span/Hispanic,2,Emergency,Home or Self Care,2020,NVS001,MENINGITIS,CNS002,LUMBAR PUNCTURE,051,VIRAL MENINGITIS,01,DISEASES AND DISORDERS OF THE NERVOUS SYSTEM,2,Moderate,Minor,Medical,Blue Cross/Blue Shield,,,,,Y,34526.05,8496.66
Western NY,Allegany,0228000,000039,Memorial Hosp of Wm F & Gertrude F Jones A/K/A Jones Memorial Hosp,18 to 29,148,F,White,Not Span/Hispanic,3,Emergency,Home or Self Care,2020,NVS001,MENINGITIS,CNS002,LUMBAR PUNCTURE,051,VIRAL MENINGITIS,01,DISEASES AND DISORDERS OF THE NERVOUS SYSTEM,1,Minor,Minor,Medical,Private Health Insurance,,,,,Y,11474.6,4160.41
New York City,Manhattan,7002024,001456,Mount Sinai Hospital,30 to 49,113,M,Other Race,Spanish/Hispanic,23,Urgent,Short-term Hospital,2020,NVS001,MENINGITIS,CNS014,"CNS PROCEDURES, NEC",051,VIRAL MENINGITIS,01,DISEASES AND DISORDERS OF THE NERVOUS SYSTEM,4,Extreme,Major,Medical,Medicaid,Medicaid,Self-Pay,,,N,413008.87,119404.63
Finger Lakes,Monroe,2701003,000411,Rochester General Hospital,30 to 49,146,F,White,Not Span/Hispanic,3,Emergency,Home or Self Care,2020,NVS001,MENINGITIS,,,051,VIRAL MENINGITIS,01,DISEASES AND DISORDERS OF THE NERVOUS SYSTEM,2,Moderate,Moderate,Medical,Blue Cross/Blue Shield,,,,,Y,15736.85,5661.8
Finger Lakes,Monroe,2701003,000411,Rochester General Hospital,0 to 17,146,F,White,Not Span/Hispanic,1,Emergency,Home or Self Care,2020,NVS001,MENINGITIS,,,051,VIRAL MENINGITIS,01,DISEASES AND DISORDERS OF THE NERVOUS SYSTEM,1,Minor,Minor,Medical,Medicaid,,,,,Y,9293.14,3210.99
Long Island,Suffolk,5154000,000924,South Shore University Hospital,18 to 29,117,M,White,Not Span/Hispanic,3,Emergency,Home or Self Care,2020,NVS001,MENINGITIS,CNS002,LUMBAR PUNCTURE,051,VIRAL MENINGITIS,01,DISEASES AND DISORDERS OF THE NERVOUS SYSTEM,1,Minor,Minor,Medical,Private Health Insurance,,,,,Y,79575.92,14774.2
Long Island,Suffolk,5154000,000924,South Shore University Hospital,18 to 29,117,M,Other Race,Spanish/Hispanic,3,Emergency,Home or Self Care,2020,NVS001,MENINGITIS,CNS002,LUMBAR PUNCTURE,051,VIRAL MENINGITIS,01,DISEASES AND DISORDERS OF THE NERVOUS SYSTEM,1,Minor,Minor,Medical,Blue Cross/Blue Shield,,,,,Y,46214.1,8506.91
Long Island,Nassau,2951001,000541,North Shore University Hospital,18 to 29,113,M,White,Not Span/Hispanic,1,Emergency,Home or Self Care,2020,NVS001,MENINGITIS,CNS002,LUMBAR PUNCTURE,051,VIRAL MENINGITIS,01,DISEASES AND DISORDERS OF THE NERVOUS SYSTEM,2,Moderate,Moderate,Medical,Medicaid,Medicaid,,,,Y,31681.31,5362.16
Long Island,Nassau,2951001,000541,North Shore University Hospital,30 to 49,110,M,Other Race,Not Span/Hispanic,6,Emergency,Home or Self Care,2020,NVS001,MENINGITIS,,,051,VIRAL MENINGITIS,01,DISEASES AND DISORDERS OF THE NERVOUS SYSTEM,2,Moderate,Moderate,Medical,Blue Cross/Blue Shield,,,,,Y,84715.57,13653.48
New York City,Bronx,7000006,001169,Montefiore Medical Center - Henry & Lucy Moses Div,18 to 29,104,M,Other Race,Spanish/Hispanic,10,Emergency,Home or Self Care,2020,NVS001,MENINGITIS,CNS002,LUMBAR PUNCTURE,051,VIRAL MENINGITIS,01,DISEASES AND DISORDERS OF THE NERVOUS SYSTEM,3,Major,Moderate,Medical,Private Health Insurance,,,,,Y,133063.54,24732.24
New York City,Kings,7002053,001304,NYU Langone Hospital-Brooklyn,70 or Older,112,M,Other Race,Not Span/Hispanic,6,Emergency,Skilled Nursing Home,2020,NVS001,MENINGITIS,OTR004,ISOLATION PROCEDURES,051,VIRAL MENINGITIS,01,DISEASES AND DISORDERS OF THE NERVOUS SYSTEM,3,Major,Moderate,Medical,Medicare,,,,,Y,179260.76,29118.25
Hudson Valley,Westchester,5957001,001139,Westchester Medical Center,18 to 29,107,F,Other Race,Unknown,4,Emergency,Home or Self Care,2020,NVS001,MENINGITIS,CNS002,LUMBAR PUNCTURE,051,VIRAL MENINGITIS,01,DISEASES AND DISORDERS OF THE NERVOUS SYSTEM,1,Minor,Minor,Medical,Medicaid,Medicaid,,,,Y,88563.82,15392.39
Hudson Valley,Westchester,5957001,001139,Westchester Medical Center,0 to 17,105,M,Black/African American,Not Span/Hispanic,4,Emergency,Home or Self Care,2020,NVS001,MENINGITIS,CNS002,LUMBAR PUNCTURE,051,VIRAL MENINGITIS,01,DISEASES AND DISORDERS OF THE NERVOUS SYSTEM,1,Minor,Minor,Medical,Medicaid,Medicaid,,,,Y,146803.33,23793.7
Hudson Valley,Westchester,5957001,001139,Westchester Medical Center,0 to 17,105,M,White,Not Span/Hispanic,6,Emergency,Home or Self Care,2020,NVS001,MENINGITIS,CNS002,LUMBAR PUNCTURE,051,VIRAL MENINGITIS,01,DISEASES AND DISORDERS OF THE NERVOUS SYSTEM,1,Minor,Minor,Medical,Blue Cross/Blue Shield,,,,,Y,97049.32,16818.38
New York City,Kings,7001021,001306,New York - Presbyterian Brooklyn Methodist Hospital,30 to 49,112,M,Black/African American,Not Span/Hispanic,11,Emergency,Home or Self Care,2020,NVS001,MENINGITIS,CNS002,LUMBAR PUNCTURE,051,VIRAL MENINGITIS,01,DISEASES AND DISORDERS OF THE NERVOUS SYSTEM,2,Moderate,Minor,Medical,Blue Cross/Blue Shield,Self-Pay,,,,Y,86066.13,19203.95
New York City,Bronx,7000006,003058,Montefiore Med Center - Jack D Weiler Hosp of A Einstein College Div,30 to 49,104,F,Other Race,Spanish/Hispanic,3,Emergency,Home or Self Care,2020,NVS001,MENINGITIS,CNS002,LUMBAR PUNCTURE,051,VIRAL MENINGITIS,01,DISEASES AND DISORDERS OF THE NERVOUS SYSTEM,2,Moderate,Minor,Medical,Private Health Insurance,,,,,Y,50900.28,8439.26
New York City,Bronx,7000014,001176,SBH Health System,0 to 17,104,M,White,Not Span/Hispanic,2,Emergency,Home or Self Care,2020,NVS001,MENINGITIS,CNS002,LUMBAR PUNCTURE,051,VIRAL MENINGITIS,01,DISEASES AND DISORDERS OF THE NERVOUS SYSTEM,2,Moderate,Moderate,Medical,Medicaid,Medicaid,,,,Y,16067.92,4665.58
Finger Lakes,Monroe,2701003,000411,Rochester General Hospital,50 to 69,146,M,Black/African American,Not Span/Hispanic,5,Emergency,Home or Self Care,2020,NVS001,MENINGITIS,CNS002,LUMBAR PUNCTURE,051,VIRAL MENINGITIS,01,DISEASES AND DISORDERS OF THE NERVOUS SYSTEM,2,Moderate,Minor,Medical,Medicaid,,,,,Y,24053.61,9834.9
Long Island,Suffolk,5151001,000245,Stony Brook University Hospital,18 to 29,117,M,Black/African American,Not Span/Hispanic,6,Emergency,Home or Self Care,2020,NVS001,MENINGITIS,CNS002,LUMBAR PUNCTURE,051,VIRAL MENINGITIS,01,DISEASES AND DISORDERS OF THE NERVOUS SYSTEM,2,Moderate,Minor,Medical,Private Health Insurance,,,,,Y,75337.36,18969.1
New York City,Kings,7001020,001305,Maimonides Medical Center,0 to 17,112,M,White,Not Span/Hispanic,9,Emergency,Home or Self Care,2020,NVS001,MENINGITIS,CNS002,LUMBAR PUNCTURE,051,VIRAL MENINGITIS,01,DISEASES AND DISORDERS OF THE NERVOUS SYSTEM,2,Moderate,Moderate,Medical,Private Health Insurance,Self-Pay,,,,Y,79544.09,37711.51
Long Island,Suffolk,5154001,000925,Good Samaritan Hospital Medical Center,0 to 17,117,M,White,Not Span/Hispanic,3,Emergency,Home or Self Care,2020,NVS001,MENINGITIS,CNS002,LUMBAR PUNCTURE,051,VIRAL MENINGITIS,01,DISEASES AND DISORDERS OF THE NERVOUS SYSTEM,1,Minor,Minor,Medical,Blue Cross/Blue Shield,,,,,Y,27997,4925.77
New York City,Bronx,7000006,003058,Montefiore Med Center - Jack D Weiler Hosp of A Einstein College Div,30 to 49,104,M,Other Race,Not Span/Hispanic,1,Emergency,Home or Self Care,2020,NVS001,MENINGITIS,IMG007,COMPUTERIZED TOMOGRAPHY (CT) WITHOUT CONTRAST,051,VIRAL MENINGITIS,01,DISEASES AND DISORDERS OF THE NERVOUS SYSTEM,1,Minor,Minor,Medical,Medicaid,,,,,Y,48540.71,4636.24
Long Island,Nassau,2950002,000528,Nassau University Medical Center,30 to 49,115,M,Black/African American,Not Span/Hispanic,7,Emergency,Home or Self Care,2020,NVS001,MENINGITIS,CNS002,LUMBAR PUNCTURE,051,VIRAL MENINGITIS,01,DISEASES AND DISORDERS OF THE NERVOUS SYSTEM,1,Minor,Minor,Medical,Medicaid,Medicaid,Self-Pay,,,N,66621.4,21137.84
New York City,Queens,7003010,001637,New York - Presbyterian/Queens,30 to 49,113,F,White,Not Span/Hispanic,6,Emergency,Home or Self Care,2020,NVS001,MENINGITIS,MAM011,ELECTROENCEPHALOGRAM (EEG),051,VIRAL MENINGITIS,01,DISEASES AND DISORDERS OF THE NERVOUS SYSTEM,2,Moderate,Minor,Medical,Private Health Insurance,Self-Pay,,,,Y,72244.73,15943.44
New York City,Bronx,7000002,001165,Jacobi Medical Center,30 to 49,,F,Black/African American,Spanish/Hispanic,5,Emergency,Home or Self Care,2020,NVS001,MENINGITIS,CNS002,LUMBAR PUNCTURE,051,VIRAL MENINGITIS,01,DISEASES AND DISORDERS OF THE NERVOUS SYSTEM,2,Moderate,Minor,Medical,Medicaid,,,,,Y,38799.24,23028.82
New York City,Bronx,7000001,001178,BronxCare Hospital Center,18 to 29,104,M,Black/African American,Not Span/Hispanic,7,Emergency,Home or Self Care,2020,NVS001,MENINGITIS,CNS002,LUMBAR PUNCTURE,051,VIRAL MENINGITIS,01,DISEASES AND DISORDERS OF THE NERVOUS SYSTEM,1,Minor,Minor,Medical,Medicaid,,,,,Y,27476.71,38701.65
Hudson Valley,Westchester,5920000,001117,Northern Westchester Hospital,30 to 49,105,F,Other Race,Not Span/Hispanic,4,Emergency,Home or Self Care,2020,NVS001,MENINGITIS,,,051,VIRAL MENINGITIS,01,DISEASES AND DISORDERS OF THE NERVOUS SYSTEM,2,Moderate,Minor,Medical,Private Health Insurance,,,,,Y,52377.25,19903.11
Hudson Valley,Westchester,5902001,001045,White Plains Hospital Center,30 to 49,105,M,Other Race,Not Span/Hispanic,3,Emergency,Home w/ Home Health Services,2020,NVS001,MENINGITIS,CNS002,LUMBAR PUNCTURE,051,VIRAL MENINGITIS,01,DISEASES AND DISORDERS OF THE NERVOUS SYSTEM,2,Moderate,Minor,Medical,Private Health Insurance,,,,,Y,28345.52,7609.75
Western NY,Erie,1401008,000213,Mercy Hospital of Buffalo,30 to 49,143,F,White,Not Span/Hispanic,6,Urgent,Home w/ Home Health Services,2020,NVS001,MENINGITIS,CAR024,VENOUS AND ARTERIAL CATHETER PLACEMENT,051,VIRAL MENINGITIS,01,DISEASES AND DISORDERS OF THE NERVOUS SYSTEM,3,Major,Extreme,Medical,Private Health Insurance,,,,,N,34941.3,16543.06