Hospital Service Area,Hospital County,Operating Certificate Number,Permanent Facility Id,Facility Name,Age Group,Zip Code - 3 digits,Gender,Race,Ethnicity,Length of Stay,Type of Admission,Patient Disposition,Discharge Year,CCS Diagnosis Code,CCS Diagnosis Description,CCS Procedure Code,CCS Procedure Description,APR DRG Code,APR DRG Description,APR MDC Code,APR MDC Description,APR Severity of Illness Code,APR Severity of Illness Description,APR Risk of Mortality,APR Medical Surgical Description,Payment Typology 1,Payment Typology 2,Payment Typology 3,Birth Weight,Abortion Edit Indicator,Emergency Department Indicator,Total Charges,Total Costs
Long Island,Nassau,2908000,000511,NYU Winthrop Hospital,50 to 69,113,F,White,Not Span/Hispanic,2,Elective,Home w/ Home Health Services,2017,027,Cancer of ovary,119,OOPHORECTOMY; UNI/BILAT,511,Uterine & adnexa procedures for ovarian & adnexal malignancy,13,Diseases and Disorders of the Female Reproductive System,2,Moderate,Moderate,Surgical,Medicare,Medicare,,,N,N,47753.31,13270.02
Long Island,Nassau,2908000,000511,NYU Winthrop Hospital,50 to 69,119,F,White,Not Span/Hispanic,2,Elective,Home or Self Care,2017,027,Cancer of ovary,124,HYSTERECTOMY; AB/VAG,511,Uterine & adnexa procedures for ovarian & adnexal malignancy,13,Diseases and Disorders of the Female Reproductive System,2,Moderate,Minor,Surgical,Private Health Insurance,,,,N,N,45788.15,12204.51
Long Island,Nassau,2908000,000511,NYU Winthrop Hospital,50 to 69,117,F,White,Not Span/Hispanic,2,Elective,Home or Self Care,2017,027,Cancer of ovary,124,HYSTERECTOMY; AB/VAG,511,Uterine & adnexa procedures for ovarian & adnexal malignancy,13,Diseases and Disorders of the Female Reproductive System,2,Moderate,Moderate,Surgical,Private Health Insurance,,,,N,N,68838.18,16146.67
Long Island,Nassau,2908000,000511,NYU Winthrop Hospital,30 to 49,117,F,White,Not Span/Hispanic,4,Elective,Home or Self Care,2017,027,Cancer of ovary,124,HYSTERECTOMY; AB/VAG,511,Uterine & adnexa procedures for ovarian & adnexal malignancy,13,Diseases and Disorders of the Female Reproductive System,2,Moderate,Moderate,Surgical,Private Health Insurance,,,,N,N,90735.52,24137.13
Long Island,Nassau,2908000,000511,NYU Winthrop Hospital,50 to 69,115,F,White,Not Span/Hispanic,3,Elective,Home or Self Care,2017,027,Cancer of ovary,124,HYSTERECTOMY; AB/VAG,511,Uterine & adnexa procedures for ovarian & adnexal malignancy,13,Diseases and Disorders of the Female Reproductive System,2,Moderate,Minor,Surgical,Private Health Insurance,,,,N,N,60735.33,15666.57
Long Island,Nassau,2908000,000511,NYU Winthrop Hospital,50 to 69,115,F,Black/African American,Not Span/Hispanic,2,Elective,Home or Self Care,2017,027,Cancer of ovary,124,HYSTERECTOMY; AB/VAG,511,Uterine & adnexa procedures for ovarian & adnexal malignancy,13,Diseases and Disorders of the Female Reproductive System,2,Moderate,Minor,Surgical,Private Health Insurance,Medicare,,,N,N,34354.96,10127.49
Long Island,Nassau,2908000,000511,NYU Winthrop Hospital,50 to 69,115,F,White,Not Span/Hispanic,2,Elective,Home or Self Care,2017,027,Cancer of ovary,124,HYSTERECTOMY; AB/VAG,511,Uterine & adnexa procedures for ovarian & adnexal malignancy,13,Diseases and Disorders of the Female Reproductive System,1,Minor,Minor,Surgical,Blue Cross/Blue Shield,,,,N,N,46110.85,11364.04
Long Island,Nassau,2908000,000511,NYU Winthrop Hospital,50 to 69,115,F,White,Not Span/Hispanic,8,Elective,Home or Self Care,2017,027,Cancer of ovary,124,HYSTERECTOMY; AB/VAG,511,Uterine & adnexa procedures for ovarian & adnexal malignancy,13,Diseases and Disorders of the Female Reproductive System,3,Major,Moderate,Surgical,Blue Cross/Blue Shield,,,,N,N,95367.25,26219.32
Long Island,Nassau,2908000,000511,NYU Winthrop Hospital,50 to 69,115,F,White,Not Span/Hispanic,4,Elective,Home or Self Care,2017,027,Cancer of ovary,124,HYSTERECTOMY; AB/VAG,511,Uterine & adnexa procedures for ovarian & adnexal malignancy,13,Diseases and Disorders of the Female Reproductive System,2,Moderate,Moderate,Surgical,Private Health Insurance,,,,N,N,87960.45,19813.56
Long Island,Nassau,2908000,000511,NYU Winthrop Hospital,30 to 49,113,F,White,Not Span/Hispanic,1,Elective,Home or Self Care,2017,027,Cancer of ovary,119,OOPHORECTOMY; UNI/BILAT,511,Uterine & adnexa procedures for ovarian & adnexal malignancy,13,Diseases and Disorders of the Female Reproductive System,2,Moderate,Moderate,Surgical,Blue Cross/Blue Shield,,,,N,N,186434.88,53306.91
Long Island,Nassau,2908000,000511,NYU Winthrop Hospital,50 to 69,111,F,White,Spanish/Hispanic,1,Elective,Home or Self Care,2017,027,Cancer of ovary,124,HYSTERECTOMY; AB/VAG,511,Uterine & adnexa procedures for ovarian & adnexal malignancy,13,Diseases and Disorders of the Female Reproductive System,1,Minor,Minor,Surgical,Private Health Insurance,,,,N,N,152204.73,40598.47
Long Island,Nassau,2908000,000511,NYU Winthrop Hospital,50 to 69,117,F,Other Race,Not Span/Hispanic,2,Elective,Home or Self Care,2017,027,Cancer of ovary,124,HYSTERECTOMY; AB/VAG,511,Uterine & adnexa procedures for ovarian & adnexal malignancy,13,Diseases and Disorders of the Female Reproductive System,2,Moderate,Moderate,Surgical,Private Health Insurance,,,,N,N,88997.75,22391.98
Long Island,Nassau,2908000,000511,NYU Winthrop Hospital,30 to 49,114,F,White,Not Span/Hispanic,4,Elective,Home or Self Care,2017,028,Cancer of other female genital organs,124,HYSTERECTOMY; AB/VAG,511,Uterine & adnexa procedures for ovarian & adnexal malignancy,13,Diseases and Disorders of the Female Reproductive System,2,Moderate,Moderate,Surgical,Private Health Insurance,,,,N,N,148819.66,44781.49
Long Island,Nassau,2908000,000511,NYU Winthrop Hospital,70 or Older,110,F,White,Not Span/Hispanic,9,Emergency,Skilled Nursing Home,2017,027,Cancer of ovary,125,OT EXC CERVIX & UTERUS,511,Uterine & adnexa procedures for ovarian & adnexal malignancy,13,Diseases and Disorders of the Female Reproductive System,3,Major,Major,Surgical,Medicare,Medicare,,,N,Y,166641.34,42539.15
Long Island,Nassau,2908000,000511,NYU Winthrop Hospital,70 or Older,127,F,White,Not Span/Hispanic,5,Elective,Home w/ Home Health Services,2017,027,Cancer of ovary,124,HYSTERECTOMY; AB/VAG,511,Uterine & adnexa procedures for ovarian & adnexal malignancy,13,Diseases and Disorders of the Female Reproductive System,3,Major,Major,Surgical,Medicare,Medicare,,,N,N,197636.62,57044.22
Long Island,Nassau,2908000,000511,NYU Winthrop Hospital,0 to 17,110,F,Black/African American,Not Span/Hispanic,3,Emergency,Home or Self Care,2017,027,Cancer of ovary,119,OOPHORECTOMY; UNI/BILAT,511,Uterine & adnexa procedures for ovarian & adnexal malignancy,13,Diseases and Disorders of the Female Reproductive System,1,Minor,Minor,Surgical,Blue Cross/Blue Shield,,,,N,Y,106402.54,23898.11
Long Island,Nassau,2908000,000511,NYU Winthrop Hospital,30 to 49,115,F,Black/African American,Not Span/Hispanic,3,Elective,Home w/ Home Health Services,2017,027,Cancer of ovary,124,HYSTERECTOMY; AB/VAG,511,Uterine & adnexa procedures for ovarian & adnexal malignancy,13,Diseases and Disorders of the Female Reproductive System,1,Minor,Minor,Surgical,Blue Cross/Blue Shield,,,,N,N,124168.93,32759.34
Long Island,Nassau,2908000,000511,NYU Winthrop Hospital,50 to 69,117,F,White,Not Span/Hispanic,3,Elective,Skilled Nursing Home,2017,027,Cancer of ovary,124,HYSTERECTOMY; AB/VAG,511,Uterine & adnexa procedures for ovarian & adnexal malignancy,13,Diseases and Disorders of the Female Reproductive System,2,Moderate,Moderate,Surgical,Private Health Insurance,,,,N,N,173943.31,45551.52
Long Island,Nassau,2908000,000511,NYU Winthrop Hospital,50 to 69,117,F,White,Not Span/Hispanic,2,Elective,Home or Self Care,2017,027,Cancer of ovary,124,HYSTERECTOMY; AB/VAG,511,Uterine & adnexa procedures for ovarian & adnexal malignancy,13,Diseases and Disorders of the Female Reproductive System,1,Minor,Minor,Surgical,Blue Cross/Blue Shield,,,,N,N,50605.24,15686.00
Long Island,Nassau,2908000,000511,NYU Winthrop Hospital,70 or Older,117,F,White,Not Span/Hispanic,4,Elective,Home w/ Home Health Services,2017,027,Cancer of ovary,124,HYSTERECTOMY; AB/VAG,511,Uterine & adnexa procedures for ovarian & adnexal malignancy,13,Diseases and Disorders of the Female Reproductive System,1,Minor,Minor,Surgical,Medicare,Medicare,Private Health Insurance,,N,N,160750.77,40829.55
Long Island,Nassau,2908000,000511,NYU Winthrop Hospital,70 or Older,117,F,White,Not Span/Hispanic,2,Elective,Home or Self Care,2017,027,Cancer of ovary,124,HYSTERECTOMY; AB/VAG,511,Uterine & adnexa procedures for ovarian & adnexal malignancy,13,Diseases and Disorders of the Female Reproductive System,3,Major,Major,Surgical,Medicare,Medicare,Private Health Insurance,,N,N,82212.62,24727.10
Long Island,Nassau,2908000,000511,NYU Winthrop Hospital,70 or Older,114,F,White,Not Span/Hispanic,4,Elective,Home or Self Care,2017,027,Cancer of ovary,124,HYSTERECTOMY; AB/VAG,511,Uterine & adnexa procedures for ovarian & adnexal malignancy,13,Diseases and Disorders of the Female Reproductive System,3,Major,Major,Surgical,Medicare,Medicare,,,N,N,133901.57,36649.96
Long Island,Nassau,2908000,000511,NYU Winthrop Hospital,50 to 69,112,F,Black/African American,Not Span/Hispanic,2,Elective,Home or Self Care,2017,027,Cancer of ovary,124,HYSTERECTOMY; AB/VAG,511,Uterine & adnexa procedures for ovarian & adnexal malignancy,13,Diseases and Disorders of the Female Reproductive System,2,Moderate,Minor,Surgical,Blue Cross/Blue Shield,Medicare,Medicare,,N,N,47611.36,15862.15
