Hospital Service Area,Hospital County,Operating Certificate Number,Permanent Facility Id,Facility Name,Age Group,Zip Code - 3 digits,Gender,Race,Ethnicity,Length of Stay,Type of Admission,Patient Disposition,Discharge Year,CCS Diagnosis Code,CCS Diagnosis Description,CCS Procedure Code,CCS Procedure Description,APR DRG Code,APR DRG Description,APR MDC Code,APR MDC Description,APR Severity of Illness Code,APR Severity of Illness Description,APR Risk of Mortality,APR Medical Surgical Description,Payment Typology 1,Payment Typology 2,Payment Typology 3,Birth Weight,Abortion Edit Indicator,Emergency Department Indicator,Total Charges,Total Costs
New York City,Manhattan,7002001,001438,Bellevue Hospital Center,50 to 69,104,F,Black/African American,Not Span/Hispanic,29,Emergency,Skilled Nursing Home,2019,NEO038,FEMALE REPRODUCTIVE SYSTEM CANCERS - ALL OTHER TYPES,ADM017,ADMINISTRATION OF NUTRITIONAL AND ELECTROLYTIC SUBSTANCES,511,UTERINE & ADNEXA PROCEDURES FOR OVARIAN & ADNEXAL MALIGNANCY,13,DISEASES AND DISORDERS OF THE FEMALE REPRODUCTIVE SYSTEM,4,Extreme,Extreme,Surgical,Medicaid,,,,,true,167201.89,111122.38
New York City,Manhattan,7002001,001438,Bellevue Hospital Center,50 to 69,104,F,Black/African American,Not Span/Hispanic,3,Elective,Home or Self Care,2019,NEO034,FEMALE REPRODUCTIVE SYSTEM CANCERS - FALLOPIAN TUBE,FRS003,SALPINGECTOMY,511,UTERINE & ADNEXA PROCEDURES FOR OVARIAN & ADNEXAL MALIGNANCY,13,DISEASES AND DISORDERS OF THE FEMALE REPRODUCTIVE SYSTEM,3,Major,Moderate,Surgical,Medicaid,Medicaid,,,,false,14503.62,9639.11
New York City,Manhattan,7002001,001438,Bellevue Hospital Center,50 to 69,113,F,Other Race,Not Span/Hispanic,2,Elective,Home or Self Care,2019,NEO033,FEMALE REPRODUCTIVE SYSTEM CANCERS - OVARY,FRS001,HYSTERECTOMY,511,UTERINE & ADNEXA PROCEDURES FOR OVARIAN & ADNEXAL MALIGNANCY,13,DISEASES AND DISORDERS OF THE FEMALE REPRODUCTIVE SYSTEM,1,Minor,Moderate,Surgical,Self-Pay,,,,,false,9857.19,6551.09
New York City,Manhattan,7002001,001438,Bellevue Hospital Center,50 to 69,114,F,Other Race,Spanish/Hispanic,2,Elective,Home or Self Care,2019,NEO033,FEMALE REPRODUCTIVE SYSTEM CANCERS - OVARY,FRS001,HYSTERECTOMY,511,UTERINE & ADNEXA PROCEDURES FOR OVARIAN & ADNEXAL MALIGNANCY,13,DISEASES AND DISORDERS OF THE FEMALE REPRODUCTIVE SYSTEM,2,Moderate,Minor,Surgical,Medicaid,,,,,false,73464.54,48824.53
New York City,Manhattan,7002001,001438,Bellevue Hospital Center,50 to 69,112,F,Other Race,Not Span/Hispanic,6,Elective,Home or Self Care,2019,NEO033,FEMALE REPRODUCTIVE SYSTEM CANCERS - OVARY,FRS002,OOPHORECTOMY,511,UTERINE & ADNEXA PROCEDURES FOR OVARIAN & ADNEXAL MALIGNANCY,13,DISEASES AND DISORDERS OF THE FEMALE REPRODUCTIVE SYSTEM,2,Moderate,Major,Surgical,Medicaid,,,,,false,77241.59,51334.76
New York City,Manhattan,7002001,001438,Bellevue Hospital Center,50 to 69,112,F,Other Race,Spanish/Hispanic,2,Elective,Home or Self Care,2019,NEO033,FEMALE REPRODUCTIVE SYSTEM CANCERS - OVARY,FRS003,SALPINGECTOMY,511,UTERINE & ADNEXA PROCEDURES FOR OVARIAN & ADNEXAL MALIGNANCY,13,DISEASES AND DISORDERS OF THE FEMALE REPRODUCTIVE SYSTEM,2,Moderate,Minor,Surgical,Medicaid,,,,,false,36904.81,24526.94
New York City,Manhattan,7002001,001438,Bellevue Hospital Center,50 to 69,100,F,Other Race,Not Span/Hispanic,8,Elective,Home or Self Care,2019,NEO033,FEMALE REPRODUCTIVE SYSTEM CANCERS - OVARY,FRS002,OOPHORECTOMY,511,UTERINE & ADNEXA PROCEDURES FOR OVARIAN & ADNEXAL MALIGNANCY,13,DISEASES AND DISORDERS OF THE FEMALE REPRODUCTIVE SYSTEM,3,Major,Major,Surgical,Private Health Insurance,,,,,false,93346.72,62038.23
New York City,Manhattan,7002001,001438,Bellevue Hospital Center,50 to 69,104,F,Other Race,Not Span/Hispanic,3,Elective,Home or Self Care,2019,NEO033,FEMALE REPRODUCTIVE SYSTEM CANCERS - OVARY,FRS010,FEMALE UPPER GENITAL TRACT EXCISION,511,UTERINE & ADNEXA PROCEDURES FOR OVARIAN & ADNEXAL MALIGNANCY,13,DISEASES AND DISORDERS OF THE FEMALE REPRODUCTIVE SYSTEM,3,Major,Major,Surgical,Medicaid,,,,,false,44522.17,29589.43
New York City,Manhattan,7002001,001438,Bellevue Hospital Center,50 to 69,103,F,White,Not Span/Hispanic,27,Elective,Home or Self Care,2019,NEO033,FEMALE REPRODUCTIVE SYSTEM CANCERS - OVARY,GIS009,COLECTOMY,511,UTERINE & ADNEXA PROCEDURES FOR OVARIAN & ADNEXAL MALIGNANCY,13,DISEASES AND DISORDERS OF THE FEMALE REPRODUCTIVE SYSTEM,4,Extreme,Extreme,Surgical,Medicaid,,,,,false,433482.91,288092.74
