Hospital Service Area,Hospital County,Operating Certificate Number,Permanent Facility Id,Facility Name,Age Group,Zip Code - 3 digits,Gender,Race,Ethnicity,Length of Stay,Type of Admission,Patient Disposition,Discharge Year,CCS Diagnosis Code,CCS Diagnosis Description,CCS Procedure Code,CCS Procedure Description,APR DRG Code,APR DRG Description,APR MDC Code,APR MDC Description,APR Severity of Illness Code,APR Severity of Illness Description,APR Risk of Mortality,APR Medical Surgical Description,Payment Typology 1,Payment Typology 2,Payment Typology 3,Birth Weight,Abortion Edit Indicator,Emergency Department Indicator,Total Charges,Total Costs
New York City,Manhattan,7002053,001463,NYU Langone Hospitals,70 or Older,112,F,White,Not Span/Hispanic,2,Elective,Home or Self Care,2020,NEO033,FEMALE REPRODUCTIVE SYSTEM CANCERS - OVARY,LYM001,LYMPH NODE BIOPSY,511,UTERINE & ADNEXA PROCEDURES FOR OVARIAN & ADNEXAL MALIGNANCY,13,DISEASES AND DISORDERS OF THE FEMALE REPRODUCTIVE SYSTEM,3,Major,Major,Surgical,Medicare,Private Health Insurance,,,,N,118973.7,17961.46
New York City,Manhattan,7002053,001463,NYU Langone Hospitals,70 or Older,100,F,White,Not Span/Hispanic,5,Elective,Home or Self Care,2020,NEO033,FEMALE REPRODUCTIVE SYSTEM CANCERS - OVARY,FRS001,HYSTERECTOMY,511,UTERINE & ADNEXA PROCEDURES FOR OVARIAN & ADNEXAL MALIGNANCY,13,DISEASES AND DISORDERS OF THE FEMALE REPRODUCTIVE SYSTEM,2,Moderate,Moderate,Surgical,Medicare,Medicare,,,,N,172854.11,30592.61
New York City,Manhattan,7002053,001463,NYU Langone Hospitals,30 to 49,112,F,White,Not Span/Hispanic,7,Elective,Home w/ Home Health Services,2020,NEO033,FEMALE REPRODUCTIVE SYSTEM CANCERS - OVARY,GIS024,OTHER PERITONEAL CAVITY PROCEDURES,511,UTERINE & ADNEXA PROCEDURES FOR OVARIAN & ADNEXAL MALIGNANCY,13,DISEASES AND DISORDERS OF THE FEMALE REPRODUCTIVE SYSTEM,3,Major,Major,Surgical,Blue Cross/Blue Shield,,,,,N,246391.07,41903.18
New York City,Manhattan,7002053,001463,NYU Langone Hospitals,50 to 69,100,F,White,Not Span/Hispanic,1,Elective,Home or Self Care,2020,NEO033,FEMALE REPRODUCTIVE SYSTEM CANCERS - OVARY,FRS002,OOPHORECTOMY,511,UTERINE & ADNEXA PROCEDURES FOR OVARIAN & ADNEXAL MALIGNANCY,13,DISEASES AND DISORDERS OF THE FEMALE REPRODUCTIVE SYSTEM,1,Minor,Moderate,Surgical,Medicare,Blue Cross/Blue Shield,,,,N,196954.96,27942.42
New York City,Manhattan,7002053,001463,NYU Langone Hospitals,50 to 69,100,F,White,Not Span/Hispanic,4,Elective,Home or Self Care,2020,NEO033,FEMALE REPRODUCTIVE SYSTEM CANCERS - OVARY,FRS001,HYSTERECTOMY,511,UTERINE & ADNEXA PROCEDURES FOR OVARIAN & ADNEXAL MALIGNANCY,13,DISEASES AND DISORDERS OF THE FEMALE REPRODUCTIVE SYSTEM,2,Moderate,Moderate,Surgical,Private Health Insurance,,,,,N,161452.3,26987.53
New York City,Manhattan,7002053,001463,NYU Langone Hospitals,30 to 49,105,F,White,Not Span/Hispanic,3,Elective,Home or Self Care,2020,NEO033,FEMALE REPRODUCTIVE SYSTEM CANCERS - OVARY,FRS002,OOPHORECTOMY,511,UTERINE & ADNEXA PROCEDURES FOR OVARIAN & ADNEXAL MALIGNANCY,13,DISEASES AND DISORDERS OF THE FEMALE REPRODUCTIVE SYSTEM,3,Major,Major,Surgical,Private Health Insurance,,,,,N,190858.32,32552.6
New York City,Manhattan,7002053,001463,NYU Langone Hospitals,30 to 49,101,F,Other Race,Not Span/Hispanic,9,Emergency,Home or Self Care,2020,NEO033,FEMALE REPRODUCTIVE SYSTEM CANCERS - OVARY,FRS002,OOPHORECTOMY,511,UTERINE & ADNEXA PROCEDURES FOR OVARIAN & ADNEXAL MALIGNANCY,13,DISEASES AND DISORDERS OF THE FEMALE REPRODUCTIVE SYSTEM,2,Moderate,Moderate,Surgical,Private Health Insurance,,,,,Y,353544.87,60248.69
New York City,Manhattan,7002053,001463,NYU Langone Hospitals,50 to 69,112,F,White,Not Span/Hispanic,4,Elective,Home or Self Care,2020,NEO033,FEMALE REPRODUCTIVE SYSTEM CANCERS - OVARY,FRS002,OOPHORECTOMY,511,UTERINE & ADNEXA PROCEDURES FOR OVARIAN & ADNEXAL MALIGNANCY,13,DISEASES AND DISORDERS OF THE FEMALE REPRODUCTIVE SYSTEM,2,Moderate,Moderate,Surgical,Medicaid,,,,,N,187195.26,30026.51
New York City,Manhattan,7002053,001463,NYU Langone Hospitals,50 to 69,115,F,White,Not Span/Hispanic,5,Elective,Home or Self Care,2020,NEO033,FEMALE REPRODUCTIVE SYSTEM CANCERS - OVARY,FRS002,OOPHORECTOMY,511,UTERINE & ADNEXA PROCEDURES FOR OVARIAN & ADNEXAL MALIGNANCY,13,DISEASES AND DISORDERS OF THE FEMALE REPRODUCTIVE SYSTEM,3,Major,Major,Surgical,Private Health Insurance,,,,,N,207244.65,35087.9
New York City,Manhattan,7002053,001463,NYU Langone Hospitals,70 or Older,103,F,White,Not Span/Hispanic,3,Elective,Home w/ Home Health Services,2020,NEO033,FEMALE REPRODUCTIVE SYSTEM CANCERS - OVARY,FRS001,HYSTERECTOMY,511,UTERINE & ADNEXA PROCEDURES FOR OVARIAN & ADNEXAL MALIGNANCY,13,DISEASES AND DISORDERS OF THE FEMALE REPRODUCTIVE SYSTEM,2,Moderate,Major,Surgical,Blue Cross/Blue Shield,,,,,N,145810.28,23691.38
New York City,Manhattan,7002053,001463,NYU Langone Hospitals,50 to 69,114,F,Other Race,Not Span/Hispanic,2,Elective,Home w/ Home Health Services,2020,NEO070,SECONDARY MALIGNANCIES,FRS002,OOPHORECTOMY,511,UTERINE & ADNEXA PROCEDURES FOR OVARIAN & ADNEXAL MALIGNANCY,13,DISEASES AND DISORDERS OF THE FEMALE REPRODUCTIVE SYSTEM,2,Moderate,Moderate,Surgical,Medicare,Medicaid,,,,N,109464.1,16085.1
New York City,Manhattan,7002053,001463,NYU Langone Hospitals,50 to 69,100,F,Other Race,Not Span/Hispanic,5,Elective,Home or Self Care,2020,NEO033,FEMALE REPRODUCTIVE SYSTEM CANCERS - OVARY,FRS003,SALPINGECTOMY,511,UTERINE & ADNEXA PROCEDURES FOR OVARIAN & ADNEXAL MALIGNANCY,13,DISEASES AND DISORDERS OF THE FEMALE REPRODUCTIVE SYSTEM,1,Minor,Moderate,Surgical,Blue Cross/Blue Shield,,,,,N,222998.68,35388.8
New York City,Manhattan,7002053,001463,NYU Langone Hospitals,30 to 49,112,F,White,Not Span/Hispanic,11,Elective,Home or Self Care,2020,NEO033,FEMALE REPRODUCTIVE SYSTEM CANCERS - OVARY,FRS001,HYSTERECTOMY,511,UTERINE & ADNEXA PROCEDURES FOR OVARIAN & ADNEXAL MALIGNANCY,13,DISEASES AND DISORDERS OF THE FEMALE REPRODUCTIVE SYSTEM,3,Major,Major,Surgical,Medicaid,,,,,N,336342.51,58610.45
New York City,Manhattan,7002053,001463,NYU Langone Hospitals,50 to 69,100,F,Other Race,Not Span/Hispanic,2,Elective,Home or Self Care,2020,NEO033,FEMALE REPRODUCTIVE SYSTEM CANCERS - OVARY,FRS001,HYSTERECTOMY,511,UTERINE & ADNEXA PROCEDURES FOR OVARIAN & ADNEXAL MALIGNANCY,13,DISEASES AND DISORDERS OF THE FEMALE REPRODUCTIVE SYSTEM,2,Moderate,Moderate,Surgical,Medicaid,,,,,N,110989.25,19061.16
New York City,Manhattan,7002053,001463,NYU Langone Hospitals,70 or Older,OOS,F,White,Not Span/Hispanic,1,Elective,Home or Self Care,2020,NEO033,FEMALE REPRODUCTIVE SYSTEM CANCERS - OVARY,GNR002,ABDOMINAL WALL REPAIR (INCLUDING HERNIA),511,UTERINE & ADNEXA PROCEDURES FOR OVARIAN & ADNEXAL MALIGNANCY,13,DISEASES AND DISORDERS OF THE FEMALE REPRODUCTIVE SYSTEM,2,Moderate,Minor,Surgical,Medicare,Private Health Insurance,,,,N,158264.61,23743.58
New York City,Manhattan,7002053,001463,NYU Langone Hospitals,30 to 49,112,F,White,Not Span/Hispanic,4,Elective,Home or Self Care,2020,NEO033,FEMALE REPRODUCTIVE SYSTEM CANCERS - OVARY,FRS010,FEMALE UPPER GENITAL TRACT EXCISION,511,UTERINE & ADNEXA PROCEDURES FOR OVARIAN & ADNEXAL MALIGNANCY,13,DISEASES AND DISORDERS OF THE FEMALE REPRODUCTIVE SYSTEM,2,Moderate,Moderate,Surgical,Blue Cross/Blue Shield,,,,,N,130181.45,25478.78
New York City,Manhattan,7002053,001463,NYU Langone Hospitals,50 to 69,112,F,White,Not Span/Hispanic,5,Elective,Home or Self Care,2020,NEO033,FEMALE REPRODUCTIVE SYSTEM CANCERS - OVARY,FRS001,HYSTERECTOMY,511,UTERINE & ADNEXA PROCEDURES FOR OVARIAN & ADNEXAL MALIGNANCY,13,DISEASES AND DISORDERS OF THE FEMALE REPRODUCTIVE SYSTEM,2,Moderate,Moderate,Surgical,Private Health Insurance,,,,,N,187208.89,34967.85
New York City,Manhattan,7002053,001463,NYU Langone Hospitals,50 to 69,112,F,White,Not Span/Hispanic,6,Elective,Home or Self Care,2020,NEO033,FEMALE REPRODUCTIVE SYSTEM CANCERS - OVARY,FRS001,HYSTERECTOMY,511,UTERINE & ADNEXA PROCEDURES FOR OVARIAN & ADNEXAL MALIGNANCY,13,DISEASES AND DISORDERS OF THE FEMALE REPRODUCTIVE SYSTEM,2,Moderate,Moderate,Surgical,Private Health Insurance,,,,,N,207580.59,40282.07
New York City,Manhattan,7002053,001463,NYU Langone Hospitals,50 to 69,112,F,Other Race,Not Span/Hispanic,5,Elective,Home or Self Care,2020,NEO033,FEMALE REPRODUCTIVE SYSTEM CANCERS - OVARY,FRS001,HYSTERECTOMY,511,UTERINE & ADNEXA PROCEDURES FOR OVARIAN & ADNEXAL MALIGNANCY,13,DISEASES AND DISORDERS OF THE FEMALE REPRODUCTIVE SYSTEM,3,Major,Major,Surgical,Medicare,Blue Cross/Blue Shield,,,,N,266167.9,47185.39
New York City,Manhattan,7002053,001463,NYU Langone Hospitals,50 to 69,100,F,White,Not Span/Hispanic,7,Elective,Home or Self Care,2020,NEO033,FEMALE REPRODUCTIVE SYSTEM CANCERS - OVARY,FRS002,OOPHORECTOMY,511,UTERINE & ADNEXA PROCEDURES FOR OVARIAN & ADNEXAL MALIGNANCY,13,DISEASES AND DISORDERS OF THE FEMALE REPRODUCTIVE SYSTEM,2,Moderate,Moderate,Surgical,Medicare,Medicare,,,,N,184718.75,39833.56
New York City,Manhattan,7002053,001463,NYU Langone Hospitals,18 to 29,104,F,Other Race,Not Span/Hispanic,3,Elective,Home or Self Care,2020,NEO033,FEMALE REPRODUCTIVE SYSTEM CANCERS - OVARY,FRS002,OOPHORECTOMY,511,UTERINE & ADNEXA PROCEDURES FOR OVARIAN & ADNEXAL MALIGNANCY,13,DISEASES AND DISORDERS OF THE FEMALE REPRODUCTIVE SYSTEM,1,Minor,Minor,Surgical,Blue Cross/Blue Shield,,,,,N,117400.98,21524.39
New York City,Manhattan,7002053,001463,NYU Langone Hospitals,50 to 69,113,F,Other Race,Not Span/Hispanic,3,Elective,Home or Self Care,2020,NEO033,FEMALE REPRODUCTIVE SYSTEM CANCERS - OVARY,FRS001,HYSTERECTOMY,511,UTERINE & ADNEXA PROCEDURES FOR OVARIAN & ADNEXAL MALIGNANCY,13,DISEASES AND DISORDERS OF THE FEMALE REPRODUCTIVE SYSTEM,2,Moderate,Minor,Surgical,Private Health Insurance,,,,,N,179308.56,28843.14
New York City,Manhattan,7002053,001463,NYU Langone Hospitals,70 or Older,112,F,White,Not Span/Hispanic,8,Elective,Home w/ Home Health Services,2020,NEO033,FEMALE REPRODUCTIVE SYSTEM CANCERS - OVARY,FRS001,HYSTERECTOMY,511,UTERINE & ADNEXA PROCEDURES FOR OVARIAN & ADNEXAL MALIGNANCY,13,DISEASES AND DISORDERS OF THE FEMALE REPRODUCTIVE SYSTEM,3,Major,Major,Surgical,Medicare,Medicare,Medicaid,,,N,300406.99,55575.56
New York City,Manhattan,7002053,001463,NYU Langone Hospitals,70 or Older,103,F,White,Not Span/Hispanic,5,Elective,Home or Self Care,2020,NEO033,FEMALE REPRODUCTIVE SYSTEM CANCERS - OVARY,FRS002,OOPHORECTOMY,511,UTERINE & ADNEXA PROCEDURES FOR OVARIAN & ADNEXAL MALIGNANCY,13,DISEASES AND DISORDERS OF THE FEMALE REPRODUCTIVE SYSTEM,2,Moderate,Moderate,Surgical,Medicare,,,,,N,197881.71,36207.6
New York City,Manhattan,7002053,001463,NYU Langone Hospitals,50 to 69,100,F,White,Not Span/Hispanic,2,Elective,Home or Self Care,2020,NEO070,SECONDARY MALIGNANCIES,FRS002,OOPHORECTOMY,511,UTERINE & ADNEXA PROCEDURES FOR OVARIAN & ADNEXAL MALIGNANCY,13,DISEASES AND DISORDERS OF THE FEMALE REPRODUCTIVE SYSTEM,2,Moderate,Moderate,Surgical,Private Health Insurance,,,,,N,110813.95,17959.85
New York City,Manhattan,7002053,001463,NYU Langone Hospitals,70 or Older,100,F,White,Not Span/Hispanic,45,Elective,Inpatient Rehabilitation Facility,2020,NEO033,FEMALE REPRODUCTIVE SYSTEM CANCERS - OVARY,FRS002,OOPHORECTOMY,511,UTERINE & ADNEXA PROCEDURES FOR OVARIAN & ADNEXAL MALIGNANCY,13,DISEASES AND DISORDERS OF THE FEMALE REPRODUCTIVE SYSTEM,4,Extreme,Extreme,Surgical,Private Health Insurance,Medicare,,,,N,1887039.47,405753.82
New York City,Manhattan,7002053,001463,NYU Langone Hospitals,50 to 69,104,F,White,Not Span/Hispanic,4,Elective,Home or Self Care,2020,NEO033,FEMALE REPRODUCTIVE SYSTEM CANCERS - OVARY,URN012,"URINARY SYSTEM PROCEDURES, NEC",511,UTERINE & ADNEXA PROCEDURES FOR OVARIAN & ADNEXAL MALIGNANCY,13,DISEASES AND DISORDERS OF THE FEMALE REPRODUCTIVE SYSTEM,2,Moderate,Moderate,Surgical,Blue Cross/Blue Shield,,,,,N,159657.74,28781.77
New York City,Manhattan,7002053,001463,NYU Langone Hospitals,0 to 17,100,F,White,Not Span/Hispanic,3,Emergency,Home or Self Care,2020,NEO033,FEMALE REPRODUCTIVE SYSTEM CANCERS - OVARY,FRS002,OOPHORECTOMY,511,UTERINE & ADNEXA PROCEDURES FOR OVARIAN & ADNEXAL MALIGNANCY,13,DISEASES AND DISORDERS OF THE FEMALE REPRODUCTIVE SYSTEM,2,Moderate,Minor,Surgical,Private Health Insurance,,,,,Y,129152.58,29309.52
