Hospital Service Area,Hospital County,Operating Certificate Number,Permanent Facility Id,Facility Name,Age Group,Zip Code - 3 digits,Gender,Race,Ethnicity,Length of Stay,Type of Admission,Patient Disposition,Discharge Year,CCS Diagnosis Code,CCS Diagnosis Description,CCS Procedure Code,CCS Procedure Description,APR DRG Code,APR DRG Description,APR MDC Code,APR MDC Description,APR Severity of Illness Code,APR Severity of Illness Description,APR Risk of Mortality,APR Medical Surgical Description,Payment Typology 1,Payment Typology 2,Payment Typology 3,Birth Weight,Abortion Edit Indicator,Emergency Department Indicator,Total Charges,Total Costs
New York City,Manhattan,7002001,001438,Bellevue Hospital Center,30 to 49,111,F,Other Race,Not Span/Hispanic,3,Elective,Home or Self Care,2020,NEO032,FEMALE REPRODUCTIVE SYSTEM CANCERS - CERVIX,FRS001,HYSTERECTOMY,512,UTERINE & ADNEXA PROCEDURES FOR NON-OVARIAN & NON-ADNEXAL MALIG,13,DISEASES AND DISORDERS OF THE FEMALE REPRODUCTIVE SYSTEM,1,Minor,Minor,Surgical,Medicaid,,,,,N,48561.72,27927.07
New York City,Manhattan,7002001,001438,Bellevue Hospital Center,50 to 69,100,F,Other Race,Spanish/Hispanic,1,Elective,Home or Self Care,2020,NEO035,FEMALE REPRODUCTIVE SYSTEM CANCERS - ENDOMETRIUM,FRS001,HYSTERECTOMY,512,UTERINE & ADNEXA PROCEDURES FOR NON-OVARIAN & NON-ADNEXAL MALIG,13,DISEASES AND DISORDERS OF THE FEMALE REPRODUCTIVE SYSTEM,2,Moderate,Moderate,Surgical,Medicare,Private Health Insurance,,,,N,27753.67,15960.69
New York City,Manhattan,7002001,001438,Bellevue Hospital Center,70 or Older,112,F,Other Race,Not Span/Hispanic,1,Elective,Home or Self Care,2020,NEO035,FEMALE REPRODUCTIVE SYSTEM CANCERS - ENDOMETRIUM,FRS001,HYSTERECTOMY,512,UTERINE & ADNEXA PROCEDURES FOR NON-OVARIAN & NON-ADNEXAL MALIG,13,DISEASES AND DISORDERS OF THE FEMALE REPRODUCTIVE SYSTEM,2,Moderate,Minor,Surgical,Medicaid,,,,,N,68818.89,39576.64
New York City,Manhattan,7002001,001438,Bellevue Hospital Center,50 to 69,113,F,Other Race,Not Span/Hispanic,1,Elective,Home or Self Care,2020,NEO035,FEMALE REPRODUCTIVE SYSTEM CANCERS - ENDOMETRIUM,FRS001,HYSTERECTOMY,512,UTERINE & ADNEXA PROCEDURES FOR NON-OVARIAN & NON-ADNEXAL MALIG,13,DISEASES AND DISORDERS OF THE FEMALE REPRODUCTIVE SYSTEM,1,Minor,Minor,Surgical,Self-Pay,,,,,N,64911.57,37329.61
New York City,Manhattan,7002001,001438,Bellevue Hospital Center,50 to 69,112,F,Other Race,Not Span/Hispanic,1,Elective,Home or Self Care,2020,NEO035,FEMALE REPRODUCTIVE SYSTEM CANCERS - ENDOMETRIUM,FRS001,HYSTERECTOMY,512,UTERINE & ADNEXA PROCEDURES FOR NON-OVARIAN & NON-ADNEXAL MALIG,13,DISEASES AND DISORDERS OF THE FEMALE REPRODUCTIVE SYSTEM,2,Moderate,Moderate,Surgical,Medicaid,,,,,N,42456.59,24416.11
New York City,Manhattan,7002001,001438,Bellevue Hospital Center,70 or Older,112,F,Other Race,Spanish/Hispanic,1,Elective,Home or Self Care,2020,NEO035,FEMALE REPRODUCTIVE SYSTEM CANCERS - ENDOMETRIUM,FRS001,HYSTERECTOMY,512,UTERINE & ADNEXA PROCEDURES FOR NON-OVARIAN & NON-ADNEXAL MALIG,13,DISEASES AND DISORDERS OF THE FEMALE REPRODUCTIVE SYSTEM,1,Minor,Minor,Surgical,Medicare,Medicaid,,,,N,52624.5,30263.51
New York City,Manhattan,7002001,001438,Bellevue Hospital Center,50 to 69,111,F,Other Race,Spanish/Hispanic,2,Elective,Home w/ Home Health Services,2020,NEO032,FEMALE REPRODUCTIVE SYSTEM CANCERS - CERVIX,FRS001,HYSTERECTOMY,512,UTERINE & ADNEXA PROCEDURES FOR NON-OVARIAN & NON-ADNEXAL MALIG,13,DISEASES AND DISORDERS OF THE FEMALE REPRODUCTIVE SYSTEM,1,Minor,Minor,Surgical,Medicaid,,,,,N,44120.19,25372.82
New York City,Manhattan,7002001,001438,Bellevue Hospital Center,70 or Older,100,F,Other Race,Spanish/Hispanic,1,Elective,Home or Self Care,2020,NEO035,FEMALE REPRODUCTIVE SYSTEM CANCERS - ENDOMETRIUM,FRS001,HYSTERECTOMY,512,UTERINE & ADNEXA PROCEDURES FOR NON-OVARIAN & NON-ADNEXAL MALIG,13,DISEASES AND DISORDERS OF THE FEMALE REPRODUCTIVE SYSTEM,2,Moderate,Minor,Surgical,Medicare,Medicaid,,,,N,61949.97,35626.44
New York City,Manhattan,7002001,001438,Bellevue Hospital Center,50 to 69,100,F,Other Race,Spanish/Hispanic,1,Elective,Home or Self Care,2020,NEO035,FEMALE REPRODUCTIVE SYSTEM CANCERS - ENDOMETRIUM,FRS001,HYSTERECTOMY,512,UTERINE & ADNEXA PROCEDURES FOR NON-OVARIAN & NON-ADNEXAL MALIG,13,DISEASES AND DISORDERS OF THE FEMALE REPRODUCTIVE SYSTEM,2,Moderate,Minor,Surgical,Private Health Insurance,,,,,N,59015.37,33938.8
New York City,Manhattan,7002001,001438,Bellevue Hospital Center,30 to 49,112,F,Other Race,Not Span/Hispanic,1,Elective,Home or Self Care,2020,NEO035,FEMALE REPRODUCTIVE SYSTEM CANCERS - ENDOMETRIUM,FRS002,OOPHORECTOMY,512,UTERINE & ADNEXA PROCEDURES FOR NON-OVARIAN & NON-ADNEXAL MALIG,13,DISEASES AND DISORDERS OF THE FEMALE REPRODUCTIVE SYSTEM,1,Minor,Minor,Surgical,Medicaid,,,,,N,101412.47,58320.69
New York City,Manhattan,7002001,001438,Bellevue Hospital Center,50 to 69,100,F,Other Race,Spanish/Hispanic,1,Elective,Home or Self Care,2020,NEO035,FEMALE REPRODUCTIVE SYSTEM CANCERS - ENDOMETRIUM,URN001,CYSTOSCOPY AND URETEROSCOPY (INCLUDING BIOPSY),512,UTERINE & ADNEXA PROCEDURES FOR NON-OVARIAN & NON-ADNEXAL MALIG,13,DISEASES AND DISORDERS OF THE FEMALE REPRODUCTIVE SYSTEM,1,Minor,Minor,Surgical,Private Health Insurance,,,,,N,70498.94,40542.81
New York City,Manhattan,7002001,001438,Bellevue Hospital Center,50 to 69,112,F,White,Not Span/Hispanic,6,Elective,Home or Self Care,2020,NEO035,FEMALE REPRODUCTIVE SYSTEM CANCERS - ENDOMETRIUM,FRS003,SALPINGECTOMY,512,UTERINE & ADNEXA PROCEDURES FOR NON-OVARIAN & NON-ADNEXAL MALIG,13,DISEASES AND DISORDERS OF THE FEMALE REPRODUCTIVE SYSTEM,3,Major,Major,Surgical,Medicaid,,,,,N,126315.41,72641.97
New York City,Manhattan,7002001,001438,Bellevue Hospital Center,50 to 69,112,F,Black/African American,Not Span/Hispanic,3,Elective,Home or Self Care,2020,NEO035,FEMALE REPRODUCTIVE SYSTEM CANCERS - ENDOMETRIUM,FRS001,HYSTERECTOMY,512,UTERINE & ADNEXA PROCEDURES FOR NON-OVARIAN & NON-ADNEXAL MALIG,13,DISEASES AND DISORDERS OF THE FEMALE REPRODUCTIVE SYSTEM,1,Minor,Minor,Surgical,Private Health Insurance,,,,,N,88117.6,50675.02
New York City,Manhattan,7002001,001438,Bellevue Hospital Center,50 to 69,100,F,Black/African American,Unknown,3,Elective,Home or Self Care,2020,NEO031,FEMALE REPRODUCTIVE SYSTEM CANCERS - UTERUS,FRS001,HYSTERECTOMY,512,UTERINE & ADNEXA PROCEDURES FOR NON-OVARIAN & NON-ADNEXAL MALIG,13,DISEASES AND DISORDERS OF THE FEMALE REPRODUCTIVE SYSTEM,1,Minor,Moderate,Surgical,Medicaid,,,,,N,46978.72,27016.71
New York City,Manhattan,7002001,001438,Bellevue Hospital Center,50 to 69,113,F,Other Race,Spanish/Hispanic,4,Elective,Home or Self Care,2020,NEO035,FEMALE REPRODUCTIVE SYSTEM CANCERS - ENDOMETRIUM,FRS001,HYSTERECTOMY,512,UTERINE & ADNEXA PROCEDURES FOR NON-OVARIAN & NON-ADNEXAL MALIG,13,DISEASES AND DISORDERS OF THE FEMALE REPRODUCTIVE SYSTEM,2,Moderate,Moderate,Surgical,Medicaid,,,,,N,69149.9,39767
New York City,Manhattan,7002001,001438,Bellevue Hospital Center,50 to 69,112,F,Black/African American,Not Span/Hispanic,3,Elective,Home or Self Care,2020,NEO035,FEMALE REPRODUCTIVE SYSTEM CANCERS - ENDOMETRIUM,FRS001,HYSTERECTOMY,512,UTERINE & ADNEXA PROCEDURES FOR NON-OVARIAN & NON-ADNEXAL MALIG,13,DISEASES AND DISORDERS OF THE FEMALE REPRODUCTIVE SYSTEM,1,Minor,Minor,Surgical,Medicaid,,,,,N,43939.34,25268.81
New York City,Manhattan,7002001,001438,Bellevue Hospital Center,50 to 69,112,F,Black/African American,Spanish/Hispanic,1,Elective,Home or Self Care,2020,NEO035,FEMALE REPRODUCTIVE SYSTEM CANCERS - ENDOMETRIUM,FRS001,HYSTERECTOMY,512,UTERINE & ADNEXA PROCEDURES FOR NON-OVARIAN & NON-ADNEXAL MALIG,13,DISEASES AND DISORDERS OF THE FEMALE REPRODUCTIVE SYSTEM,1,Minor,Minor,Surgical,Medicaid,,,,,N,54257.09,31202.38
New York City,Manhattan,7002001,001438,Bellevue Hospital Center,50 to 69,100,F,Other Race,Unknown,2,Elective,Home or Self Care,2020,NEO035,FEMALE REPRODUCTIVE SYSTEM CANCERS - ENDOMETRIUM,FRS001,HYSTERECTOMY,512,UTERINE & ADNEXA PROCEDURES FOR NON-OVARIAN & NON-ADNEXAL MALIG,13,DISEASES AND DISORDERS OF THE FEMALE REPRODUCTIVE SYSTEM,2,Moderate,Moderate,Surgical,Medicaid,,,,,N,54841.73,31538.6
New York City,Manhattan,7002001,001438,Bellevue Hospital Center,70 or Older,112,F,Other Race,Spanish/Hispanic,1,Elective,Home or Self Care,2020,NEO035,FEMALE REPRODUCTIVE SYSTEM CANCERS - ENDOMETRIUM,FRS001,HYSTERECTOMY,512,UTERINE & ADNEXA PROCEDURES FOR NON-OVARIAN & NON-ADNEXAL MALIG,13,DISEASES AND DISORDERS OF THE FEMALE REPRODUCTIVE SYSTEM,1,Minor,Moderate,Surgical,Medicare,Medicaid,,,,N,55822.47,32102.61
New York City,Manhattan,7002001,001438,Bellevue Hospital Center,30 to 49,104,F,Other Race,Spanish/Hispanic,3,Elective,Home or Self Care,2020,NEO031,FEMALE REPRODUCTIVE SYSTEM CANCERS - UTERUS,FRS002,OOPHORECTOMY,512,UTERINE & ADNEXA PROCEDURES FOR NON-OVARIAN & NON-ADNEXAL MALIG,13,DISEASES AND DISORDERS OF THE FEMALE REPRODUCTIVE SYSTEM,3,Major,Major,Surgical,Medicaid,,,,,N,59103.77,33989.63
New York City,Manhattan,7002001,001438,Bellevue Hospital Center,30 to 49,112,F,Black/African American,Unknown,3,Elective,Home or Self Care,2020,NEO031,FEMALE REPRODUCTIVE SYSTEM CANCERS - UTERUS,FRS010,FEMALE UPPER GENITAL TRACT EXCISION,512,UTERINE & ADNEXA PROCEDURES FOR NON-OVARIAN & NON-ADNEXAL MALIG,13,DISEASES AND DISORDERS OF THE FEMALE REPRODUCTIVE SYSTEM,2,Moderate,Major,Surgical,Self-Pay,,,,,N,75599,43475.78
