Hospital Service Area,Hospital County,Operating Certificate Number,Permanent Facility Id,Facility Name,Age Group,Zip Code - 3 digits,Gender,Race,Ethnicity,Length of Stay,Type of Admission,Patient Disposition,Discharge Year,CCS Diagnosis Code,CCS Diagnosis Description,CCS Procedure Code,CCS Procedure Description,APR DRG Code,APR DRG Description,APR MDC Code,APR MDC Description,APR Severity of Illness Code,APR Severity of Illness Description,APR Risk of Mortality,APR Medical Surgical Description,Payment Typology 1,Payment Typology 2,Payment Typology 3,Birth Weight,Abortion Edit Indicator,Emergency Department Indicator,Total Charges,Total Costs
Hudson Valley,Westchester,5904001,001072,Montefiore New Rochelle Hospital,70 or Older,104,F,Black/African American,Not Span/Hispanic,2,Elective,Home or Self Care,2017,170,Prolapse of female genital organs,171,SUTURE SKIN/SUBCUT TISS,514,Female reproductive system reconstructive procedures,13,Diseases and Disorders of the Female Reproductive System,1,Minor,Minor,Surgical,Medicare,Medicare,Blue Cross/Blue Shield,,N,N,12549.00,6868.12
New York City,Bronx,7000006,001168,Montefiore Medical Center-Wakefield Hospital,70 or Older,100,F,Other Race,Not Span/Hispanic,1,Emergency,Home or Self Care,2017,170,Prolapse of female genital organs,129,REPAIR CYST-/RECT-OCELE,514,Female reproductive system reconstructive procedures,13,Diseases and Disorders of the Female Reproductive System,1,Minor,Minor,Surgical,Medicare,Medicaid,,,N,N,34478.39,8737.34
New York City,Bronx,7000006,001168,Montefiore Medical Center-Wakefield Hospital,70 or Older,104,F,Other Race,Not Span/Hispanic,1,Emergency,Home or Self Care,2017,238,Complications of surgical procedures or medical care,171,SUTURE SKIN/SUBCUT TISS,514,Female reproductive system reconstructive procedures,13,Diseases and Disorders of the Female Reproductive System,1,Minor,Moderate,Surgical,Medicare,Private Health Insurance,,,N,N,34542.45,8639.84
New York City,Kings,7001003,001288,Brooklyn Hospital Center - Downtown Campus,50 to 69,112,F,Black/African American,Unknown,1,Elective,Home or Self Care,2017,170,Prolapse of female genital organs,171,SUTURE SKIN/SUBCUT TISS,514,Female reproductive system reconstructive procedures,13,Diseases and Disorders of the Female Reproductive System,1,Minor,Minor,Surgical,Medicare,Private Health Insurance,Self-Pay,,N,N,36767.99,11989.84
New York City,Kings,7001003,001288,Brooklyn Hospital Center - Downtown Campus,30 to 49,112,F,Black/African American,Unknown,1,Urgent,Home or Self Care,2017,170,Prolapse of female genital organs,132,OT OR THER PRC; FEM ORG,514,Female reproductive system reconstructive procedures,13,Diseases and Disorders of the Female Reproductive System,2,Moderate,Minor,Surgical,Private Health Insurance,Self-Pay,,,N,N,36648.63,11267.66
New York City,Kings,7001037,001320,University Hospital of Brooklyn,70 or Older,112,F,Black/African American,Not Span/Hispanic,1,Elective,Home or Self Care,2017,170,Prolapse of female genital organs,132,OT OR THER PRC; FEM ORG,514,Female reproductive system reconstructive procedures,13,Diseases and Disorders of the Female Reproductive System,2,Moderate,Minor,Surgical,Medicare,Medicare,Medicaid,,N,N,37393.00,22524.16
New York City,Kings,7001021,001306,New York - Presbyterian Brooklyn Methodist Hospital,50 to 69,112,F,White,Spanish/Hispanic,1,Emergency,Home or Self Care,2017,163,Genitourinary symptoms and ill-defined conditions,109,PRCS ON THE URETHRA,514,Female reproductive system reconstructive procedures,13,Diseases and Disorders of the Female Reproductive System,1,Minor,Minor,Surgical,Medicaid,Medicaid,Self-Pay,,N,N,17112.75,8400.83
New York City,Kings,7001021,001306,New York - Presbyterian Brooklyn Methodist Hospital,30 to 49,103,F,White,Not Span/Hispanic,1,Emergency,Home or Self Care,2017,163,Genitourinary symptoms and ill-defined conditions,109,PRCS ON THE URETHRA,514,Female reproductive system reconstructive procedures,13,Diseases and Disorders of the Female Reproductive System,1,Minor,Minor,Surgical,Blue Cross/Blue Shield,Self-Pay,,,N,N,14293.28,8159.02
New York City,Manhattan,7002024,001456,Mount Sinai Hospital,50 to 69,105,F,White,Not Span/Hispanic,2,Elective,Home or Self Care,2017,170,Prolapse of female genital organs,131,OT NON-OR THER PRC; FEM,514,Female reproductive system reconstructive procedures,13,Diseases and Disorders of the Female Reproductive System,2,Moderate,Minor,Surgical,Medicare,Private Health Insurance,Self-Pay,,N,N,28533.45,12989.25
New York City,Manhattan,7002054,001464,New York Presbyterian Hospital - Columbia Presbyterian Center,50 to 69,OOS,F,Other Race,Not Span/Hispanic,1,Elective,Home or Self Care,2017,170,Prolapse of female genital organs,132,OT OR THER PRC; FEM ORG,514,Female reproductive system reconstructive procedures,13,Diseases and Disorders of the Female Reproductive System,2,Moderate,Minor,Surgical,Blue Cross/Blue Shield,Self-Pay,,,N,N,31776.55,7504.11
New York City,Manhattan,7002054,001464,New York Presbyterian Hospital - Columbia Presbyterian Center,70 or Older,104,F,Multi-racial,Spanish/Hispanic,2,Elective,Home or Self Care,2017,170,Prolapse of female genital organs,132,OT OR THER PRC; FEM ORG,514,Female reproductive system reconstructive procedures,13,Diseases and Disorders of the Female Reproductive System,1,Minor,Minor,Surgical,Medicare,Medicare,Self-Pay,,N,N,37485.99,11236.99
New York City,Manhattan,7002054,001464,New York Presbyterian Hospital - Columbia Presbyterian Center,30 to 49,100,F,White,Not Span/Hispanic,1,Elective,Home or Self Care,2017,170,Prolapse of female genital organs,096,OT OR LOW GI THER PRCS,514,Female reproductive system reconstructive procedures,13,Diseases and Disorders of the Female Reproductive System,1,Minor,Minor,Surgical,Private Health Insurance,Self-Pay,,,N,N,11428.50,2697.38
New York City,Manhattan,7002054,003975,New York Presbyterian Hospital - Allen Hospital,50 to 69,100,F,White,Spanish/Hispanic,1,Urgent,Home or Self Care,2017,170,Prolapse of female genital organs,175,OT OR THER PRC SKN/BRST,514,Female reproductive system reconstructive procedures,13,Diseases and Disorders of the Female Reproductive System,2,Moderate,Minor,Surgical,Medicare,Medicare,Medicaid,,N,N,44631.09,12871.04
New York City,Manhattan,7002054,003975,New York Presbyterian Hospital - Allen Hospital,30 to 49,100,F,White,Spanish/Hispanic,2,Urgent,Home or Self Care,2017,163,Genitourinary symptoms and ill-defined conditions,109,PRCS ON THE URETHRA,514,Female reproductive system reconstructive procedures,13,Diseases and Disorders of the Female Reproductive System,1,Minor,Minor,Surgical,Medicaid,Medicaid,Self-Pay,,N,N,34973.06,11068.83
New York City,Manhattan,7002002,001439,Mount Sinai Beth Israel,70 or Older,100,F,Other Race,Not Span/Hispanic,1,Elective,Home w/ Home Health Services,2017,238,Complications of surgical procedures or medical care,132,OT OR THER PRC; FEM ORG,514,Female reproductive system reconstructive procedures,13,Diseases and Disorders of the Female Reproductive System,1,Minor,Minor,Surgical,Medicare,Medicaid,Self-Pay,,N,N,20648.45,7339.36
New York City,Manhattan,7002053,001463,NYU Langone Hospitals,50 to 69,118,F,White,Not Span/Hispanic,4,Elective,Home w/ Home Health Services,2017,237,Complication of device; implant or graft,098,OT NON-OR GI THER PRCS,514,Female reproductive system reconstructive procedures,13,Diseases and Disorders of the Female Reproductive System,2,Moderate,Minor,Surgical,Medicare,,,,N,N,81100.35,21118.93
New York City,Manhattan,7002053,001463,NYU Langone Hospitals,50 to 69,112,F,Other Race,Not Span/Hispanic,1,Elective,Home or Self Care,2017,170,Prolapse of female genital organs,109,PRCS ON THE URETHRA,514,Female reproductive system reconstructive procedures,13,Diseases and Disorders of the Female Reproductive System,1,Minor,Minor,Surgical,Private Health Insurance,,,,N,N,151069.15,29044.91
Western NY,Erie,1401014,000207,Buffalo General Medical Center,70 or Older,140,F,Other Race,Not Span/Hispanic,2,Elective,Home or Self Care,2017,170,Prolapse of female genital organs,175,OT OR THER PRC SKN/BRST,514,Female reproductive system reconstructive procedures,13,Diseases and Disorders of the Female Reproductive System,2,Moderate,Minor,Surgical,Medicare,Self-Pay,,,N,N,35031.71,12782.17
Western NY,Erie,1401014,000207,Buffalo General Medical Center,70 or Older,141,F,White,Not Span/Hispanic,1,Elective,Skilled Nursing Home,2017,170,Prolapse of female genital organs,129,REPAIR CYST-/RECT-OCELE,514,Female reproductive system reconstructive procedures,13,Diseases and Disorders of the Female Reproductive System,1,Minor,Minor,Surgical,Medicare,Self-Pay,,,N,N,33940.70,9423.48
New York City,Bronx,7000006,001168,Montefiore Medical Center-Wakefield Hospital,50 to 69,100,F,Other Race,Spanish/Hispanic,1,Emergency,Home or Self Care,2017,238,Complications of surgical procedures or medical care,132,OT OR THER PRC; FEM ORG,514,Female reproductive system reconstructive procedures,13,Diseases and Disorders of the Female Reproductive System,2,Moderate,Minor,Surgical,Medicare,,,,N,N,48990.02,13615.80
New York City,Bronx,7000006,003058,Montefiore Med Center - Jack D Weiler Hosp of A Einstein College Div,50 to 69,104,F,Other Race,Not Span/Hispanic,23,Elective,Home or Self Care,2017,028,Cancer of other female genital organs,132,OT OR THER PRC; FEM ORG,514,Female reproductive system reconstructive procedures,13,Diseases and Disorders of the Female Reproductive System,2,Moderate,Moderate,Surgical,Medicaid,,,,N,N,303900.03,61109.87
New York City,Bronx,7000006,003058,Montefiore Med Center - Jack D Weiler Hosp of A Einstein College Div,50 to 69,104,F,Other Race,Not Span/Hispanic,3,Elective,Home w/ Home Health Services,2017,170,Prolapse of female genital organs,171,SUTURE SKIN/SUBCUT TISS,514,Female reproductive system reconstructive procedures,13,Diseases and Disorders of the Female Reproductive System,2,Moderate,Minor,Surgical,Medicaid,,,,N,N,44342.97,10017.41
New York City,Manhattan,7002053,001463,NYU Langone Hospitals,70 or Older,103,F,White,Not Span/Hispanic,1,Elective,Home or Self Care,2017,238,Complications of surgical procedures or medical care,132,OT OR THER PRC; FEM ORG,514,Female reproductive system reconstructive procedures,13,Diseases and Disorders of the Female Reproductive System,2,Moderate,Minor,Surgical,Blue Cross/Blue Shield,,,,N,N,97474.91,19575.31
New York City,Manhattan,7002053,001463,NYU Langone Hospitals,50 to 69,115,F,Other Race,Spanish/Hispanic,2,Elective,Home or Self Care,2017,238,Complications of surgical procedures or medical care,132,OT OR THER PRC; FEM ORG,514,Female reproductive system reconstructive procedures,13,Diseases and Disorders of the Female Reproductive System,2,Moderate,Minor,Surgical,Blue Cross/Blue Shield,,,,N,N,120543.03,25780.13
New York City,Manhattan,7002053,001463,NYU Langone Hospitals,50 to 69,109,F,White,Not Span/Hispanic,1,Elective,Home or Self Care,2017,170,Prolapse of female genital organs,132,OT OR THER PRC; FEM ORG,514,Female reproductive system reconstructive procedures,13,Diseases and Disorders of the Female Reproductive System,1,Minor,Minor,Surgical,Private Health Insurance,,,,N,N,127350.10,24844.88
Hudson Valley,Rockland,4324000,000776,Nyack Hospital,30 to 49,109,F,Black/African American,Not Span/Hispanic,4,Elective,Home or Self Care,2017,168,Inflammatory diseases of female pelvic organs,132,OT OR THER PRC; FEM ORG,514,Female reproductive system reconstructive procedures,13,Diseases and Disorders of the Female Reproductive System,1,Minor,Minor,Surgical,Medicaid,,,,N,N,35832.77,8905.82
New York City,Kings,7001003,001288,Brooklyn Hospital Center - Downtown Campus,50 to 69,112,F,Black/African American,Not Span/Hispanic,2,Elective,Home or Self Care,2017,170,Prolapse of female genital organs,106,GENI INCONTINENCE PRCS,514,Female reproductive system reconstructive procedures,13,Diseases and Disorders of the Female Reproductive System,2,Moderate,Moderate,Surgical,Medicare,Medicaid,Self-Pay,,N,N,49887.98,14793.55
New York City,Kings,7001020,001305,Maimonides Medical Center,70 or Older,112,F,White,Spanish/Hispanic,1,Elective,Home or Self Care,2017,170,Prolapse of female genital organs,132,OT OR THER PRC; FEM ORG,514,Female reproductive system reconstructive procedures,13,Diseases and Disorders of the Female Reproductive System,2,Moderate,Minor,Surgical,Medicaid,,Self-Pay,,N,N,29002.00,9277.21
New York City,Kings,7001021,001306,New York - Presbyterian Brooklyn Methodist Hospital,70 or Older,112,F,Black/African American,Not Span/Hispanic,1,Elective,Home or Self Care,2017,238,Complications of surgical procedures or medical care,132,OT OR THER PRC; FEM ORG,514,Female reproductive system reconstructive procedures,13,Diseases and Disorders of the Female Reproductive System,1,Minor,Minor,Surgical,Medicare,Medicare,Medicaid,,N,N,20479.62,10132.22
New York City,Kings,7001021,001306,New York - Presbyterian Brooklyn Methodist Hospital,50 to 69,112,F,Other Race,Spanish/Hispanic,2,Elective,Home or Self Care,2017,238,Complications of surgical procedures or medical care,132,OT OR THER PRC; FEM ORG,514,Female reproductive system reconstructive procedures,13,Diseases and Disorders of the Female Reproductive System,2,Moderate,Minor,Surgical,Private Health Insurance,Self-Pay,,,N,N,29657.01,15238.77
New York City,Kings,7001021,001306,New York - Presbyterian Brooklyn Methodist Hospital,70 or Older,112,F,Other Race,Not Span/Hispanic,1,Elective,Home or Self Care,2017,238,Complications of surgical procedures or medical care,132,OT OR THER PRC; FEM ORG,514,Female reproductive system reconstructive procedures,13,Diseases and Disorders of the Female Reproductive System,1,Minor,Minor,Surgical,Medicare,Medicare,Self-Pay,,N,N,22537.66,11979.88
New York City,Queens,7003010,001637,New York - Presbyterian/Queens,50 to 69,114,F,Other Race,Not Span/Hispanic,1,Urgent,Home or Self Care,2017,238,Complications of surgical procedures or medical care,132,OT OR THER PRC; FEM ORG,514,Female reproductive system reconstructive procedures,13,Diseases and Disorders of the Female Reproductive System,1,Minor,Minor,Surgical,Blue Cross/Blue Shield,Self-Pay,,,N,N,17074.02,6571.01
New York City,Bronx,7000001,001178,Bronx-Lebanon Hospital Center - Concourse Division,50 to 69,104,F,Other Race,Spanish/Hispanic,1,Elective,Home or Self Care,2017,170,Prolapse of female genital organs,109,PRCS ON THE URETHRA,514,Female reproductive system reconstructive procedures,13,Diseases and Disorders of the Female Reproductive System,1,Minor,Minor,Surgical,Medicare,Medicare,Medicaid,,N,N,12890.42,16722.56
New York City,Bronx,7000001,001178,Bronx-Lebanon Hospital Center - Concourse Division,50 to 69,104,F,Other Race,Spanish/Hispanic,2,Elective,Home or Self Care,2017,238,Complications of surgical procedures or medical care,175,OT OR THER PRC SKN/BRST,514,Female reproductive system reconstructive procedures,13,Diseases and Disorders of the Female Reproductive System,2,Moderate,Minor,Surgical,Medicaid,Medicaid,,,N,N,13620.29,16931.39
New York City,Bronx,7000006,003058,Montefiore Med Center - Jack D Weiler Hosp of A Einstein College Div,50 to 69,104,F,Other Race,Spanish/Hispanic,1,Emergency,Home or Self Care,2017,170,Prolapse of female genital organs,132,OT OR THER PRC; FEM ORG,514,Female reproductive system reconstructive procedures,13,Diseases and Disorders of the Female Reproductive System,2,Moderate,Minor,Surgical,Medicare,,,,N,N,36966.87,9265.41
New York City,Manhattan,7002017,001450,Lenox Hill Hospital,70 or Older,107,F,White,Not Span/Hispanic,2,Elective,Home w/ Home Health Services,2017,170,Prolapse of female genital organs,175,OT OR THER PRC SKN/BRST,514,Female reproductive system reconstructive procedures,13,Diseases and Disorders of the Female Reproductive System,1,Minor,Minor,Surgical,Medicare,Blue Cross/Blue Shield,,,N,N,46547.74,11275.94
New York City,Manhattan,7002017,001450,Lenox Hill Hospital,70 or Older,105,F,Other Race,Not Span/Hispanic,1,Elective,Home or Self Care,2017,170,Prolapse of female genital organs,175,OT OR THER PRC SKN/BRST,514,Female reproductive system reconstructive procedures,13,Diseases and Disorders of the Female Reproductive System,1,Minor,Minor,Surgical,Medicare,Blue Cross/Blue Shield,,,N,N,38286.06,10436.47
New York City,Manhattan,7002024,001456,Mount Sinai Hospital,70 or Older,112,F,Other Race,Not Span/Hispanic,1,Elective,Home or Self Care,2017,238,Complications of surgical procedures or medical care,132,OT OR THER PRC; FEM ORG,514,Female reproductive system reconstructive procedures,13,Diseases and Disorders of the Female Reproductive System,2,Moderate,Minor,Surgical,Medicare,Medicare,Medicaid,,N,N,21743.34,9486.78
New York City,Queens,7003004,001638,Long Island Jewish Forest Hills,50 to 69,113,F,White,Spanish/Hispanic,1,Elective,Home or Self Care,2017,170,Prolapse of female genital organs,175,OT OR THER PRC SKN/BRST,514,Female reproductive system reconstructive procedures,13,Diseases and Disorders of the Female Reproductive System,1,Minor,Minor,Surgical,Medicaid,Medicaid,,,N,N,31276.84,8730.37
Long Island,Suffolk,5151001,000245,University Hospital,50 to 69,119,F,White,Not Span/Hispanic,1,Elective,Home or Self Care,2017,238,Complications of surgical procedures or medical care,231,OTHER THERAPEUTIC PRCS,514,Female reproductive system reconstructive procedures,13,Diseases and Disorders of the Female Reproductive System,2,Moderate,Minor,Surgical,Medicare,Blue Cross/Blue Shield,,,N,N,36215.72,18567.98
Long Island,Suffolk,5151001,000245,University Hospital,50 to 69,119,F,White,Not Span/Hispanic,1,Elective,Home or Self Care,2017,170,Prolapse of female genital organs,132,OT OR THER PRC; FEM ORG,514,Female reproductive system reconstructive procedures,13,Diseases and Disorders of the Female Reproductive System,2,Moderate,Minor,Surgical,Medicaid,Medicaid,,,N,N,46222.40,23042.29
Long Island,Suffolk,5151001,000245,University Hospital,50 to 69,117,F,White,Not Span/Hispanic,1,Elective,Home or Self Care,2017,238,Complications of surgical procedures or medical care,130,OT DX PRCS; FEMALE ORGN,514,Female reproductive system reconstructive procedures,13,Diseases and Disorders of the Female Reproductive System,2,Moderate,Minor,Surgical,Medicare,Blue Cross/Blue Shield,,,N,N,18251.77,7769.85
Long Island,Suffolk,5151001,000245,University Hospital,30 to 49,117,F,White,Spanish/Hispanic,1,Urgent,Home or Self Care,2017,170,Prolapse of female genital organs,171,SUTURE SKIN/SUBCUT TISS,514,Female reproductive system reconstructive procedures,13,Diseases and Disorders of the Female Reproductive System,1,Minor,Minor,Surgical,Medicaid,Medicaid,,,N,N,19723.75,8649.72
Long Island,Nassau,2951001,000541,North Shore University Hospital,50 to 69,110,F,White,Spanish/Hispanic,2,Elective,Home or Self Care,2017,170,Prolapse of female genital organs,132,OT OR THER PRC; FEM ORG,514,Female reproductive system reconstructive procedures,13,Diseases and Disorders of the Female Reproductive System,2,Moderate,Minor,Surgical,Medicaid,Medicaid,,,N,N,65782.19,19209.42
Long Island,Suffolk,5154000,000924,Southside Hospital,70 or Older,117,F,Other Race,Spanish/Hispanic,1,Elective,Home or Self Care,2017,238,Complications of surgical procedures or medical care,109,PRCS ON THE URETHRA,514,Female reproductive system reconstructive procedures,13,Diseases and Disorders of the Female Reproductive System,1,Minor,Minor,Surgical,Medicaid,Medicaid,,,N,N,21653.49,8647.79
Long Island,Suffolk,5155000,000938,Peconic Bay Medical Center,50 to 69,119,F,White,Spanish/Hispanic,2,Elective,Home or Self Care,2017,170,Prolapse of female genital organs,175,OT OR THER PRC SKN/BRST,514,Female reproductive system reconstructive procedures,13,Diseases and Disorders of the Female Reproductive System,1,Minor,Minor,Surgical,"Managed Care, Unspecified",,,,N,N,56050.24,18712.98
Long Island,Suffolk,5155000,000938,Peconic Bay Medical Center,70 or Older,119,F,White,Spanish/Hispanic,1,Elective,Home or Self Care,2017,170,Prolapse of female genital organs,109,PRCS ON THE URETHRA,514,Female reproductive system reconstructive procedures,13,Diseases and Disorders of the Female Reproductive System,1,Minor,Minor,Surgical,Medicare,Medicare,,,N,N,29250.57,9564.93
Long Island,Suffolk,5155000,000938,Peconic Bay Medical Center,50 to 69,119,F,White,Spanish/Hispanic,2,Elective,Home or Self Care,2017,170,Prolapse of female genital organs,175,OT OR THER PRC SKN/BRST,514,Female reproductive system reconstructive procedures,13,Diseases and Disorders of the Female Reproductive System,1,Minor,Minor,Surgical,Medicare,Blue Cross/Blue Shield,,,N,N,43045.10,14093.45
Finger Lakes,Chemung,0701000,000116,Arnot Ogden Medical Center,50 to 69,148,F,White,Not Span/Hispanic,1,Elective,Home or Self Care,2017,170,Prolapse of female genital organs,131,OT NON-OR THER PRC; FEM,514,Female reproductive system reconstructive procedures,13,Diseases and Disorders of the Female Reproductive System,2,Moderate,Minor,Surgical,Medicare,Medicare,Private Health Insurance,,N,N,12029.81,3753.74
Finger Lakes,Monroe,2701005,000413,Strong Memorial Hospital,70 or Older,148,F,White,Not Span/Hispanic,1,Elective,Home or Self Care,2017,170,Prolapse of female genital organs,132,OT OR THER PRC; FEM ORG,514,Female reproductive system reconstructive procedures,13,Diseases and Disorders of the Female Reproductive System,2,Moderate,Minor,Surgical,Medicare,Medicare,Self-Pay,,N,N,10098.34,5439.91
Finger Lakes,Monroe,2701005,000413,Strong Memorial Hospital,70 or Older,146,F,White,Not Span/Hispanic,1,Elective,Home or Self Care,2017,238,Complications of surgical procedures or medical care,132,OT OR THER PRC; FEM ORG,514,Female reproductive system reconstructive procedures,13,Diseases and Disorders of the Female Reproductive System,2,Moderate,Minor,Surgical,Medicare,Medicare,Self-Pay,,N,N,30263.04,16476.98
New York City,Kings,7001002,001286,Brookdale Hospital Medical Center,50 to 69,112,F,Black/African American,Not Span/Hispanic,3,Elective,Home or Self Care,2017,170,Prolapse of female genital organs,112,OT OR THER PRCS URINARY,514,Female reproductive system reconstructive procedures,13,Diseases and Disorders of the Female Reproductive System,1,Minor,Minor,Surgical,Private Health Insurance,,,,N,N,25212.35,16578.19
New York City,Kings,7001002,001286,Brookdale Hospital Medical Center,50 to 69,112,F,Black/African American,Unknown,1,Elective,Home or Self Care,2017,170,Prolapse of female genital organs,171,SUTURE SKIN/SUBCUT TISS,514,Female reproductive system reconstructive procedures,13,Diseases and Disorders of the Female Reproductive System,1,Minor,Minor,Surgical,Medicare,Medicaid,,,N,N,11726.00,9116.63
New York City,Manhattan,7002002,001439,Mount Sinai Beth Israel,70 or Older,100,F,Black/African American,Unknown,2,Urgent,Home w/ Home Health Services,2017,170,Prolapse of female genital organs,132,OT OR THER PRC; FEM ORG,514,Female reproductive system reconstructive procedures,13,Diseases and Disorders of the Female Reproductive System,2,Moderate,Minor,Surgical,Medicare,Miscellaneous/Other,Self-Pay,,N,N,61271.89,17790.10
New York City,Richmond,7004010,001738,Richmond University Medical Center,30 to 49,103,F,White,Not Span/Hispanic,3,Elective,Home or Self Care,2017,238,Complications of surgical procedures or medical care,100,ENDOSCOPY URINARY TRACT,514,Female reproductive system reconstructive procedures,13,Diseases and Disorders of the Female Reproductive System,2,Moderate,Minor,Surgical,Private Health Insurance,,,,N,N,29617.55,10095.92
Western NY,Erie,1401014,000207,Buffalo General Medical Center,70 or Older,140,F,White,Not Span/Hispanic,3,Elective,Skilled Nursing Home,2017,170,Prolapse of female genital organs,132,OT OR THER PRC; FEM ORG,514,Female reproductive system reconstructive procedures,13,Diseases and Disorders of the Female Reproductive System,2,Moderate,Moderate,Surgical,Medicare,Self-Pay,,,N,N,42252.94,14511.45