Hospital Service Area,Hospital County,Operating Certificate Number,Permanent Facility Id,Facility Name,Age Group,Zip Code - 3 digits,Gender,Race,Ethnicity,Length of Stay,Type of Admission,Patient Disposition,Discharge Year,CCS Diagnosis Code,CCS Diagnosis Description,CCS Procedure Code,CCS Procedure Description,APR DRG Code,APR DRG Description,APR MDC Code,APR MDC Description,APR Severity of Illness Code,APR Severity of Illness Description,APR Risk of Mortality,APR Medical Surgical Description,Payment Typology 1,Payment Typology 2,Payment Typology 3,Birth Weight,Abortion Edit Indicator,Emergency Department Indicator,Total Charges,Total Costs
New York City,Manhattan,7002053,001463,NYU Langone Hospitals,70 or Older,114,F,Other Race,Not Span/Hispanic,2,Elective,Home or Self Care,2019,GEN026,POSTPROCEDURAL OR POSTOPERATIVE GENITOURINARY SYSTEM COMPLICATION,FRS015,"FEMALE REPRODUCTIVE SYSTEM PROCEDURES, NEC",514,FEMALE REPRODUCTIVE SYSTEM RECONSTRUCTIVE PROCEDURES,13,DISEASES AND DISORDERS OF THE FEMALE REPRODUCTIVE SYSTEM,2,Moderate,Moderate,Surgical,Medicare,Blue Cross/Blue Shield,,,,false,105818.1,19672.48
New York City,Manhattan,7002053,001463,NYU Langone Hospitals,50 to 69,100,F,White,Not Span/Hispanic,1,Elective,Home or Self Care,2019,GEN026,POSTPROCEDURAL OR POSTOPERATIVE GENITOURINARY SYSTEM COMPLICATION,FRS015,"FEMALE REPRODUCTIVE SYSTEM PROCEDURES, NEC",514,FEMALE REPRODUCTIVE SYSTEM RECONSTRUCTIVE PROCEDURES,13,DISEASES AND DISORDERS OF THE FEMALE REPRODUCTIVE SYSTEM,2,Moderate,Minor,Surgical,Private Health Insurance,,,,,false,143422.31,23129.26
New York City,Manhattan,7002053,001463,NYU Langone Hospitals,30 to 49,,F,White,Not Span/Hispanic,2,Elective,Home or Self Care,2019,GEN020,PROLAPSE OF FEMALE GENITAL ORGANS,URN012,"URINARY SYSTEM PROCEDURES, NEC",514,FEMALE REPRODUCTIVE SYSTEM RECONSTRUCTIVE PROCEDURES,13,DISEASES AND DISORDERS OF THE FEMALE REPRODUCTIVE SYSTEM,1,Minor,Minor,Surgical,Private Health Insurance,,,,,false,132351.34,23984.53
New York City,Manhattan,7002053,001463,NYU Langone Hospitals,30 to 49,112,F,White,Not Span/Hispanic,5,Elective,Home w/ Home Health Services,2019,GEN025,OTHER SPECIFIED FEMALE GENITAL DISORDERS,FRS015,"FEMALE REPRODUCTIVE SYSTEM PROCEDURES, NEC",514,FEMALE REPRODUCTIVE SYSTEM RECONSTRUCTIVE PROCEDURES,13,DISEASES AND DISORDERS OF THE FEMALE REPRODUCTIVE SYSTEM,2,Moderate,Minor,Surgical,Medicaid,,,,,false,229668.92,43436.08
New York City,Manhattan,7002053,001463,NYU Langone Hospitals,30 to 49,100,F,White,Not Span/Hispanic,5,Elective,Home or Self Care,2019,GEN025,OTHER SPECIFIED FEMALE GENITAL DISORDERS,FRS015,"FEMALE REPRODUCTIVE SYSTEM PROCEDURES, NEC",514,FEMALE REPRODUCTIVE SYSTEM RECONSTRUCTIVE PROCEDURES,13,DISEASES AND DISORDERS OF THE FEMALE REPRODUCTIVE SYSTEM,2,Moderate,Minor,Surgical,Medicaid,,,,,false,256625,47155.1
New York City,Manhattan,7002053,001463,NYU Langone Hospitals,30 to 49,124,F,White,Not Span/Hispanic,5,Elective,Home or Self Care,2019,GEN025,OTHER SPECIFIED FEMALE GENITAL DISORDERS,FRS015,"FEMALE REPRODUCTIVE SYSTEM PROCEDURES, NEC",514,FEMALE REPRODUCTIVE SYSTEM RECONSTRUCTIVE PROCEDURES,13,DISEASES AND DISORDERS OF THE FEMALE REPRODUCTIVE SYSTEM,2,Moderate,Minor,Surgical,Private Health Insurance,,,,,false,241938.01,45221.2
New York City,Manhattan,7002053,001463,NYU Langone Hospitals,18 to 29,112,F,Other Race,Spanish/Hispanic,5,Elective,Home or Self Care,2019,GEN025,OTHER SPECIFIED FEMALE GENITAL DISORDERS,FRS015,"FEMALE REPRODUCTIVE SYSTEM PROCEDURES, NEC",514,FEMALE REPRODUCTIVE SYSTEM RECONSTRUCTIVE PROCEDURES,13,DISEASES AND DISORDERS OF THE FEMALE REPRODUCTIVE SYSTEM,2,Moderate,Minor,Surgical,Private Health Insurance,,,,,false,245000.18,45445.09
New York City,Manhattan,7002053,001463,NYU Langone Hospitals,70 or Older,100,F,White,Not Span/Hispanic,1,Elective,Home or Self Care,2019,GEN026,POSTPROCEDURAL OR POSTOPERATIVE GENITOURINARY SYSTEM COMPLICATION,FRS007,FEMALE GENITAL TRACT REPAIR (EXCLUDING VULVA),514,FEMALE REPRODUCTIVE SYSTEM RECONSTRUCTIVE PROCEDURES,13,DISEASES AND DISORDERS OF THE FEMALE REPRODUCTIVE SYSTEM,2,Moderate,Minor,Surgical,Medicare,,,,,false,138804.39,22084.48
New York City,Manhattan,7002053,001463,NYU Langone Hospitals,70 or Older,103,F,White,Not Span/Hispanic,1,Elective,Home or Self Care,2019,GEN020,PROLAPSE OF FEMALE GENITAL ORGANS,URN012,"URINARY SYSTEM PROCEDURES, NEC",514,FEMALE REPRODUCTIVE SYSTEM RECONSTRUCTIVE PROCEDURES,13,DISEASES AND DISORDERS OF THE FEMALE REPRODUCTIVE SYSTEM,2,Moderate,Minor,Surgical,Medicare,,,,,false,106288.62,17208.75
