Hospital Service Area,Hospital County,Operating Certificate Number,Permanent Facility Id,Facility Name,Age Group,Zip Code - 3 digits,Gender,Race,Ethnicity,Length of Stay,Type of Admission,Patient Disposition,Discharge Year,CCS Diagnosis Code,CCS Diagnosis Description,CCS Procedure Code,CCS Procedure Description,APR DRG Code,APR DRG Description,APR MDC Code,APR MDC Description,APR Severity of Illness Code,APR Severity of Illness Description,APR Risk of Mortality,APR Medical Surgical Description,Payment Typology 1,Payment Typology 2,Payment Typology 3,Birth Weight,Abortion Edit Indicator,Emergency Department Indicator,Total Charges,Total Costs
New York City,Queens,7003004,001630,Long Island Jewish Medical Center,30 to 49,114,F,Other Race,Not Span/Hispanic,1,Emergency,Home or Self Care,2018,GEN025,OTHER SPECIFIED FEMALE GENITAL DISORDERS,FRS015,"FEMALE REPRODUCTIVE SYSTEM PROCEDURES, NEC",517,DILATION & CURETTAGE FOR NON-OBSTETRIC DIAGNOSES,13,DISEASES AND DISORDERS OF THE FEMALE REPRODUCTIVE SYSTEM,2,Moderate,Minor,Surgical,Blue Cross/Blue Shield,Self-Pay,,,,true,34573.3,14353.78
New York City,Queens,7003010,001637,New York - Presbyterian/Queens,70 or Older,113,F,Black/African American,Not Span/Hispanic,3,Emergency,Home or Self Care,2018,GEN025,OTHER SPECIFIED FEMALE GENITAL DISORDERS,FRS015,"FEMALE REPRODUCTIVE SYSTEM PROCEDURES, NEC",517,DILATION & CURETTAGE FOR NON-OBSTETRIC DIAGNOSES,13,DISEASES AND DISORDERS OF THE FEMALE REPRODUCTIVE SYSTEM,2,Moderate,Moderate,Surgical,Medicare,Medicare,Self-Pay,,,true,32225.33,9333.23
New York City,Queens,7003004,001638,Long Island Jewish Forest Hills,70 or Older,113,F,Other Race,Spanish/Hispanic,2,Emergency,Home or Self Care,2018,GEN023,MENOPAUSAL DISORDERS,FRS010,FEMALE UPPER GENITAL TRACT EXCISION,517,DILATION & CURETTAGE FOR NON-OBSTETRIC DIAGNOSES,13,DISEASES AND DISORDERS OF THE FEMALE REPRODUCTIVE SYSTEM,2,Moderate,Moderate,Surgical,Medicare,Medicaid,,,,true,42600.7,8730.95
New York City,Queens,7003004,001638,Long Island Jewish Forest Hills,30 to 49,111,F,White,Not Span/Hispanic,2,Emergency,Home or Self Care,2018,GEN025,OTHER SPECIFIED FEMALE GENITAL DISORDERS,FRS010,FEMALE UPPER GENITAL TRACT EXCISION,517,DILATION & CURETTAGE FOR NON-OBSTETRIC DIAGNOSES,13,DISEASES AND DISORDERS OF THE FEMALE REPRODUCTIVE SYSTEM,2,Moderate,Minor,Surgical,Medicaid,Medicaid,,,,true,50224.59,14818.01
Capital/Adirond,Albany,0101004,000005,St. Peter's Hospital,50 to 69,123,F,White,Not Span/Hispanic,10,Emergency,Expired,2018,NEO032,FEMALE REPRODUCTIVE SYSTEM CANCERS - CERVIX,FRS015,"FEMALE REPRODUCTIVE SYSTEM PROCEDURES, NEC",517,DILATION & CURETTAGE FOR NON-OBSTETRIC DIAGNOSES,13,DISEASES AND DISORDERS OF THE FEMALE REPRODUCTIVE SYSTEM,4,Extreme,Extreme,Surgical,Medicare,Private Health Insurance,,,,true,93509.87,31344.8
New York City,Kings,7001021,001306,New York - Presbyterian Brooklyn Methodist Hospital,50 to 69,116,F,Black/African American,Not Span/Hispanic,3,Emergency,Skilled Nursing Home,2018,GEN025,OTHER SPECIFIED FEMALE GENITAL DISORDERS,FRS015,"FEMALE REPRODUCTIVE SYSTEM PROCEDURES, NEC",517,DILATION & CURETTAGE FOR NON-OBSTETRIC DIAGNOSES,13,DISEASES AND DISORDERS OF THE FEMALE REPRODUCTIVE SYSTEM,2,Moderate,Moderate,Surgical,"Managed Care, Unspecified",Medicaid,Self-Pay,,,true,34233.72,11566.03
Finger Lakes,Monroe,2701001,000409,Highland Hospital,30 to 49,144,F,White,Not Span/Hispanic,1,Emergency,Home or Self Care,2018,GEN025,OTHER SPECIFIED FEMALE GENITAL DISORDERS,FRS010,FEMALE UPPER GENITAL TRACT EXCISION,517,DILATION & CURETTAGE FOR NON-OBSTETRIC DIAGNOSES,13,DISEASES AND DISORDERS OF THE FEMALE REPRODUCTIVE SYSTEM,1,Minor,Minor,Surgical,Blue Cross/Blue Shield,,,,,true,13858.03,4792.14
Western NY,Erie,1401008,000213,Mercy Hospital of Buffalo,30 to 49,142,F,White,Not Span/Hispanic,5,Emergency,Home or Self Care,2018,NEO035,FEMALE REPRODUCTIVE SYSTEM CANCERS - ENDOMETRIUM,FRS015,"FEMALE REPRODUCTIVE SYSTEM PROCEDURES, NEC",517,DILATION & CURETTAGE FOR NON-OBSTETRIC DIAGNOSES,13,DISEASES AND DISORDERS OF THE FEMALE REPRODUCTIVE SYSTEM,3,Major,Major,Surgical,Medicaid,,,,,true,42601.5,16454.86
Capital/Adirond,Albany,0101000,000001,Albany Medical Center Hospital,18 to 29,123,F,Other Race,Not Span/Hispanic,1,Emergency,Home or Self Care,2018,GEN025,OTHER SPECIFIED FEMALE GENITAL DISORDERS,FRS015,"FEMALE REPRODUCTIVE SYSTEM PROCEDURES, NEC",517,DILATION & CURETTAGE FOR NON-OBSTETRIC DIAGNOSES,13,DISEASES AND DISORDERS OF THE FEMALE REPRODUCTIVE SYSTEM,2,Moderate,Minor,Surgical,Blue Cross/Blue Shield,,,,,false,14435.06,4629.92
New York City,Richmond,7004003,001740,Staten Island University Hosp-North,18 to 29,103,F,Black/African American,Not Span/Hispanic,1,Emergency,Home or Self Care,2018,GEN025,OTHER SPECIFIED FEMALE GENITAL DISORDERS,ADM001,TRANSFUSION OF BLOOD AND BLOOD PRODUCTS,517,DILATION & CURETTAGE FOR NON-OBSTETRIC DIAGNOSES,13,DISEASES AND DISORDERS OF THE FEMALE REPRODUCTIVE SYSTEM,2,Moderate,Minor,Surgical,Medicaid,Medicaid,,,,true,24793.47,6466.25
Capital/Adirond,Albany,0101004,000005,St. Peter's Hospital,50 to 69,122,F,White,Not Span/Hispanic,1,Elective,Home or Self Care,2018,NEO036,FEMALE REPRODUCTIVE SYSTEM CANCERS - VULVA,FRS015,"FEMALE REPRODUCTIVE SYSTEM PROCEDURES, NEC",517,DILATION & CURETTAGE FOR NON-OBSTETRIC DIAGNOSES,13,DISEASES AND DISORDERS OF THE FEMALE REPRODUCTIVE SYSTEM,2,Moderate,Minor,Surgical,Medicare,Blue Cross/Blue Shield,,,,false,22101.45,8066.78
New York City,Queens,7003004,001630,Long Island Jewish Medical Center,50 to 69,114,F,Other Race,Not Span/Hispanic,1,Emergency,Home or Self Care,2018,NEO073,BENIGN NEOPLASMS,FRS015,"FEMALE REPRODUCTIVE SYSTEM PROCEDURES, NEC",517,DILATION & CURETTAGE FOR NON-OBSTETRIC DIAGNOSES,13,DISEASES AND DISORDERS OF THE FEMALE REPRODUCTIVE SYSTEM,1,Minor,Minor,Surgical,Medicare,Medicare,Medicaid,,,true,25423.23,3853.58
Hudson Valley,Westchester,5903001,001061,Montefiore Mount Vernon Hospital,30 to 49,,F,Black/African American,Not Span/Hispanic,1,Emergency,Home or Self Care,2018,GEN025,OTHER SPECIFIED FEMALE GENITAL DISORDERS,FRS010,FEMALE UPPER GENITAL TRACT EXCISION,517,DILATION & CURETTAGE FOR NON-OBSTETRIC DIAGNOSES,13,DISEASES AND DISORDERS OF THE FEMALE REPRODUCTIVE SYSTEM,1,Minor,Minor,Surgical,Private Health Insurance,Self-Pay,,,,true,20361,8502.49
Finger Lakes,Monroe,2701003,000411,Rochester General Hospital,50 to 69,146,F,Other Race,Spanish/Hispanic,2,Elective,Home or Self Care,2018,GEN025,OTHER SPECIFIED FEMALE GENITAL DISORDERS,FRS015,"FEMALE REPRODUCTIVE SYSTEM PROCEDURES, NEC",517,DILATION & CURETTAGE FOR NON-OBSTETRIC DIAGNOSES,13,DISEASES AND DISORDERS OF THE FEMALE REPRODUCTIVE SYSTEM,2,Moderate,Moderate,Surgical,Medicare,Medicaid,,,,false,16675.66,5797.08
New York City,Manhattan,7002017,001450,Lenox Hill Hospital,30 to 49,100,F,White,Not Span/Hispanic,2,Emergency,Home or Self Care,2018,GEN025,OTHER SPECIFIED FEMALE GENITAL DISORDERS,FRS015,"FEMALE REPRODUCTIVE SYSTEM PROCEDURES, NEC",517,DILATION & CURETTAGE FOR NON-OBSTETRIC DIAGNOSES,13,DISEASES AND DISORDERS OF THE FEMALE REPRODUCTIVE SYSTEM,1,Minor,Minor,Surgical,Private Health Insurance,,,,,true,51216.09,13004.98
Capital/Adirond,Albany,0101000,000001,Albany Medical Center Hospital,30 to 49,135,F,Black/African American,Not Span/Hispanic,3,Urgent,Home or Self Care,2018,GEN025,OTHER SPECIFIED FEMALE GENITAL DISORDERS,FRS010,FEMALE UPPER GENITAL TRACT EXCISION,517,DILATION & CURETTAGE FOR NON-OBSTETRIC DIAGNOSES,13,DISEASES AND DISORDERS OF THE FEMALE REPRODUCTIVE SYSTEM,2,Moderate,Minor,Surgical,"Managed Care, Unspecified",,,,,false,18761.13,7611
Southern Tier,Broome,0303001,000058,United Health Services Hospitals Inc. - Wilson Medical Center,18 to 29,137,F,White,Not Span/Hispanic,2,Emergency,Home or Self Care,2018,GEN024,FEMALE INFERTILITY,FRS015,"FEMALE REPRODUCTIVE SYSTEM PROCEDURES, NEC",517,DILATION & CURETTAGE FOR NON-OBSTETRIC DIAGNOSES,13,DISEASES AND DISORDERS OF THE FEMALE REPRODUCTIVE SYSTEM,2,Moderate,Minor,Surgical,Medicaid,,,,,true,16093.1,7467.92
New York City,Queens,7002024,001639,Mount Sinai Hospital - Mount Sinai Hospital of Queens,30 to 49,113,F,Black/African American,Not Span/Hispanic,7,Emergency,Home or Self Care,2018,GEN018,INFLAMMATORY DISEASES OF FEMALE PELVIC ORGANS,FRS015,"FEMALE REPRODUCTIVE SYSTEM PROCEDURES, NEC",517,DILATION & CURETTAGE FOR NON-OBSTETRIC DIAGNOSES,13,DISEASES AND DISORDERS OF THE FEMALE REPRODUCTIVE SYSTEM,2,Moderate,Minor,Surgical,Medicaid,Medicaid,,,,true,29714.12,9224.51
Long Island,Nassau,7003004,000518,Long Island Jewish Valley Stream,70 or Older,114,F,Black/African American,Not Span/Hispanic,7,Emergency,Home or Self Care,2018,GEN023,MENOPAUSAL DISORDERS,FRS010,FEMALE UPPER GENITAL TRACT EXCISION,517,DILATION & CURETTAGE FOR NON-OBSTETRIC DIAGNOSES,13,DISEASES AND DISORDERS OF THE FEMALE REPRODUCTIVE SYSTEM,3,Major,Moderate,Surgical,Medicare,Medicare,,,,true,96995.27,18588.48
New York City,Manhattan,7002017,001450,Lenox Hill Hospital,30 to 49,100,F,White,Not Span/Hispanic,1,Emergency,Home or Self Care,2018,GEN025,OTHER SPECIFIED FEMALE GENITAL DISORDERS,FRS015,"FEMALE REPRODUCTIVE SYSTEM PROCEDURES, NEC",517,DILATION & CURETTAGE FOR NON-OBSTETRIC DIAGNOSES,13,DISEASES AND DISORDERS OF THE FEMALE REPRODUCTIVE SYSTEM,1,Minor,Minor,Surgical,Private Health Insurance,,,,,true,24459,6652.55
Long Island,Suffolk,5154001,000925,Good Samaritan Hospital Medical Center,70 or Older,117,F,White,Not Span/Hispanic,3,Emergency,Home or Self Care,2018,GEN023,MENOPAUSAL DISORDERS,FRS010,FEMALE UPPER GENITAL TRACT EXCISION,517,DILATION & CURETTAGE FOR NON-OBSTETRIC DIAGNOSES,13,DISEASES AND DISORDERS OF THE FEMALE REPRODUCTIVE SYSTEM,2,Moderate,Moderate,Surgical,Medicare,Medicaid,,,,true,34514,6656.71
New York City,Kings,7001016,001301,Kings County Hospital Center,70 or Older,112,F,Black/African American,Not Span/Hispanic,1,Emergency,Expired,2018,GEN018,INFLAMMATORY DISEASES OF FEMALE PELVIC ORGANS,GIS005,EXPLORATION OF PERITONEAL CAVITY,517,DILATION & CURETTAGE FOR NON-OBSTETRIC DIAGNOSES,13,DISEASES AND DISORDERS OF THE FEMALE REPRODUCTIVE SYSTEM,2,Moderate,Moderate,Surgical,Medicare,,,,,true,18792.09,13349.17
New York City,Manhattan,7002054,001458,New York-Presbyterian Hospital - New York Weill Cornell Center,30 to 49,104,F,Black/African American,Not Span/Hispanic,4,Emergency,Home or Self Care,2018,NEO073,BENIGN NEOPLASMS,FRS015,"FEMALE REPRODUCTIVE SYSTEM PROCEDURES, NEC",517,DILATION & CURETTAGE FOR NON-OBSTETRIC DIAGNOSES,13,DISEASES AND DISORDERS OF THE FEMALE REPRODUCTIVE SYSTEM,1,Minor,Minor,Surgical,"Managed Care, Unspecified",Medicaid,Self-Pay,,,true,43338.05,9526.49
Finger Lakes,Monroe,2754001,000471,The Unity Hospital of Rochester,70 or Older,146,F,Black/African American,Not Span/Hispanic,5,Emergency,Home or Self Care,2018,GEN025,OTHER SPECIFIED FEMALE GENITAL DISORDERS,FRS015,"FEMALE REPRODUCTIVE SYSTEM PROCEDURES, NEC",517,DILATION & CURETTAGE FOR NON-OBSTETRIC DIAGNOSES,13,DISEASES AND DISORDERS OF THE FEMALE REPRODUCTIVE SYSTEM,2,Moderate,Minor,Surgical,Medicare,,,,,true,14630.1,10823.67
New York City,Bronx,7000006,003058,Montefiore Med Center - Jack D Weiler Hosp of A Einstein College Div,70 or Older,104,F,Black/African American,Not Span/Hispanic,12,Emergency,Home w/ Home Health Services,2018,GEN018,INFLAMMATORY DISEASES OF FEMALE PELVIC ORGANS,FRS015,"FEMALE REPRODUCTIVE SYSTEM PROCEDURES, NEC",517,DILATION & CURETTAGE FOR NON-OBSTETRIC DIAGNOSES,13,DISEASES AND DISORDERS OF THE FEMALE REPRODUCTIVE SYSTEM,3,Major,Major,Surgical,Medicare,Medicaid,,,,true,167181.93,30832.13
Central NY,Onondaga,3301003,000630,St. Joseph's Hospital Health Center,30 to 49,132,F,Other Race,Not Span/Hispanic,5,Emergency,Home or Self Care,2018,GEN025,OTHER SPECIFIED FEMALE GENITAL DISORDERS,FRS015,"FEMALE REPRODUCTIVE SYSTEM PROCEDURES, NEC",517,DILATION & CURETTAGE FOR NON-OBSTETRIC DIAGNOSES,13,DISEASES AND DISORDERS OF THE FEMALE REPRODUCTIVE SYSTEM,3,Major,Moderate,Surgical,Medicaid,,,,,true,15246.15,5913.07
New York City,Richmond,7004010,001738,Richmond University Medical Center,50 to 69,103,F,White,Not Span/Hispanic,1,Emergency,Home or Self Care,2018,GEN021,MENSTRUAL DISORDERS,FRS010,FEMALE UPPER GENITAL TRACT EXCISION,517,DILATION & CURETTAGE FOR NON-OBSTETRIC DIAGNOSES,13,DISEASES AND DISORDERS OF THE FEMALE REPRODUCTIVE SYSTEM,2,Moderate,Minor,Surgical,Medicare,Medicaid,Medicaid,,,true,17551.99,5331.99
Capital/Adirond,Schenectady,4601001,000829,Ellis Hospital,70 or Older,123,F,White,Not Span/Hispanic,13,Emergency,Short-term Hospital,2018,GEN025,OTHER SPECIFIED FEMALE GENITAL DISORDERS,FRS015,"FEMALE REPRODUCTIVE SYSTEM PROCEDURES, NEC",517,DILATION & CURETTAGE FOR NON-OBSTETRIC DIAGNOSES,13,DISEASES AND DISORDERS OF THE FEMALE REPRODUCTIVE SYSTEM,4,Extreme,Extreme,Surgical,Medicare,Medicare,,,,true,74504.6,28209.55
New York City,Kings,7001021,001306,New York - Presbyterian Brooklyn Methodist Hospital,50 to 69,112,F,Black/African American,Not Span/Hispanic,3,Emergency,Home or Self Care,2018,GEN025,OTHER SPECIFIED FEMALE GENITAL DISORDERS,FRS015,"FEMALE REPRODUCTIVE SYSTEM PROCEDURES, NEC",517,DILATION & CURETTAGE FOR NON-OBSTETRIC DIAGNOSES,13,DISEASES AND DISORDERS OF THE FEMALE REPRODUCTIVE SYSTEM,3,Major,Moderate,Surgical,Private Health Insurance,Self-Pay,,,,true,32661.98,11367.22
Long Island,Suffolk,5154000,000924,South Shore University Hospital,18 to 29,117,F,Black/African American,Not Span/Hispanic,1,Emergency,Home or Self Care,2018,GEN025,OTHER SPECIFIED FEMALE GENITAL DISORDERS,FRS010,FEMALE UPPER GENITAL TRACT EXCISION,517,DILATION & CURETTAGE FOR NON-OBSTETRIC DIAGNOSES,13,DISEASES AND DISORDERS OF THE FEMALE REPRODUCTIVE SYSTEM,2,Moderate,Minor,Surgical,Medicare,Medicare,,,,true,35472.09,7765.78
New York City,Richmond,7004010,001738,Richmond University Medical Center,30 to 49,103,F,Other Race,Spanish/Hispanic,2,Emergency,Home or Self Care,2018,GEN025,OTHER SPECIFIED FEMALE GENITAL DISORDERS,FRS015,"FEMALE REPRODUCTIVE SYSTEM PROCEDURES, NEC",517,DILATION & CURETTAGE FOR NON-OBSTETRIC DIAGNOSES,13,DISEASES AND DISORDERS OF THE FEMALE REPRODUCTIVE SYSTEM,2,Moderate,Minor,Surgical,Medicaid,Medicaid,Self-Pay,,,true,20069.37,7085.69
Long Island,Nassau,2909000,000513,Mercy Hospital,30 to 49,115,F,Other Race,Spanish/Hispanic,3,Emergency,Home or Self Care,2018,GEN025,OTHER SPECIFIED FEMALE GENITAL DISORDERS,FRS015,"FEMALE REPRODUCTIVE SYSTEM PROCEDURES, NEC",517,DILATION & CURETTAGE FOR NON-OBSTETRIC DIAGNOSES,13,DISEASES AND DISORDERS OF THE FEMALE REPRODUCTIVE SYSTEM,1,Minor,Minor,Surgical,Medicaid,,,,,true,40822.73,8059.05
Long Island,Nassau,2950002,000528,Nassau University Medical Center,30 to 49,117,F,Black/African American,Not Span/Hispanic,1,Emergency,Home or Self Care,2018,GEN025,OTHER SPECIFIED FEMALE GENITAL DISORDERS,FRS015,"FEMALE REPRODUCTIVE SYSTEM PROCEDURES, NEC",517,DILATION & CURETTAGE FOR NON-OBSTETRIC DIAGNOSES,13,DISEASES AND DISORDERS OF THE FEMALE REPRODUCTIVE SYSTEM,1,Minor,Minor,Surgical,Blue Cross/Blue Shield,Self-Pay,,,,false,11060.95,7129.46
Long Island,Suffolk,5157003,000943,St Catherine of Siena Hospital,70 or Older,117,F,White,Not Span/Hispanic,3,Emergency,Home w/ Home Health Services,2018,GEN025,OTHER SPECIFIED FEMALE GENITAL DISORDERS,FRS015,"FEMALE REPRODUCTIVE SYSTEM PROCEDURES, NEC",517,DILATION & CURETTAGE FOR NON-OBSTETRIC DIAGNOSES,13,DISEASES AND DISORDERS OF THE FEMALE REPRODUCTIVE SYSTEM,2,Moderate,Minor,Surgical,Medicare,"Managed Care, Unspecified",,,,false,13108,2960.28
New York City,Manhattan,7002021,001454,Metropolitan Hospital Center,30 to 49,100,F,Other Race,Not Span/Hispanic,2,Emergency,Home or Self Care,2018,GEN021,MENSTRUAL DISORDERS,FRS015,"FEMALE REPRODUCTIVE SYSTEM PROCEDURES, NEC",517,DILATION & CURETTAGE FOR NON-OBSTETRIC DIAGNOSES,13,DISEASES AND DISORDERS OF THE FEMALE REPRODUCTIVE SYSTEM,2,Moderate,Minor,Surgical,Self-Pay,,,,,true,14599.54,11795.7
Long Island,Nassau,2908000,000511,NYU Langone Hospital-Long Island,50 to 69,117,F,White,Not Span/Hispanic,1,Elective,Home or Self Care,2018,GEN025,OTHER SPECIFIED FEMALE GENITAL DISORDERS,FRS015,"FEMALE REPRODUCTIVE SYSTEM PROCEDURES, NEC",517,DILATION & CURETTAGE FOR NON-OBSTETRIC DIAGNOSES,13,DISEASES AND DISORDERS OF THE FEMALE REPRODUCTIVE SYSTEM,1,Minor,Minor,Surgical,Medicaid,Medicaid,,,,false,44495.1,9518.89
Long Island,Suffolk,5154000,000924,South Shore University Hospital,30 to 49,117,F,Other Race,Spanish/Hispanic,1,Emergency,Home or Self Care,2018,GEN021,MENSTRUAL DISORDERS,FRS010,FEMALE UPPER GENITAL TRACT EXCISION,517,DILATION & CURETTAGE FOR NON-OBSTETRIC DIAGNOSES,13,DISEASES AND DISORDERS OF THE FEMALE REPRODUCTIVE SYSTEM,2,Moderate,Minor,Surgical,Private Health Insurance,,,,,true,35792.11,7661.57
New York City,Queens,7003000,001626,Elmhurst Hospital Center,70 or Older,113,F,White,Not Span/Hispanic,10,Emergency,Home or Self Care,2018,NEO035,FEMALE REPRODUCTIVE SYSTEM CANCERS - ENDOMETRIUM,FRS015,"FEMALE REPRODUCTIVE SYSTEM PROCEDURES, NEC",517,DILATION & CURETTAGE FOR NON-OBSTETRIC DIAGNOSES,13,DISEASES AND DISORDERS OF THE FEMALE REPRODUCTIVE SYSTEM,2,Moderate,Minor,Surgical,Private Health Insurance,,,,,true,56901.34,33854.36
New York City,Queens,7003010,001637,New York - Presbyterian/Queens,50 to 69,113,F,White,Not Span/Hispanic,26,Emergency,Home or Self Care,2018,NEO035,FEMALE REPRODUCTIVE SYSTEM CANCERS - ENDOMETRIUM,FRS015,"FEMALE REPRODUCTIVE SYSTEM PROCEDURES, NEC",517,DILATION & CURETTAGE FOR NON-OBSTETRIC DIAGNOSES,13,DISEASES AND DISORDERS OF THE FEMALE REPRODUCTIVE SYSTEM,3,Major,Major,Surgical,Medicare,Self-Pay,,,,true,180193.4,49799.44
Southern Tier,Broome,0301001,000043,Our Lady of Lourdes Memorial Hospital,70 or Older,139,F,White,Not Span/Hispanic,1,Emergency,Home or Self Care,2018,NEO032,FEMALE REPRODUCTIVE SYSTEM CANCERS - CERVIX,FRS015,"FEMALE REPRODUCTIVE SYSTEM PROCEDURES, NEC",517,DILATION & CURETTAGE FOR NON-OBSTETRIC DIAGNOSES,13,DISEASES AND DISORDERS OF THE FEMALE REPRODUCTIVE SYSTEM,2,Moderate,Moderate,Surgical,Medicare,Medicare,Private Health Insurance,,,true,15567.58,4117.32
New York City,Richmond,7004010,001738,Richmond University Medical Center,50 to 69,103,F,Black/African American,Not Span/Hispanic,9,Emergency,Home w/ Home Health Services,2018,NEO032,FEMALE REPRODUCTIVE SYSTEM CANCERS - CERVIX,FRS015,"FEMALE REPRODUCTIVE SYSTEM PROCEDURES, NEC",517,DILATION & CURETTAGE FOR NON-OBSTETRIC DIAGNOSES,13,DISEASES AND DISORDERS OF THE FEMALE REPRODUCTIVE SYSTEM,3,Major,Moderate,Surgical,Medicare,Blue Cross/Blue Shield,Self-Pay,,,true,77411.18,22224.06
Finger Lakes,Monroe,2701001,000409,Highland Hospital,30 to 49,146,F,Black/African American,Not Span/Hispanic,1,Emergency,Home or Self Care,2018,GEN018,INFLAMMATORY DISEASES OF FEMALE PELVIC ORGANS,FRS010,FEMALE UPPER GENITAL TRACT EXCISION,517,DILATION & CURETTAGE FOR NON-OBSTETRIC DIAGNOSES,13,DISEASES AND DISORDERS OF THE FEMALE REPRODUCTIVE SYSTEM,1,Minor,Minor,Surgical,Medicaid,,,,,true,11771.11,3914.5
Long Island,Nassau,2908000,000511,NYU Langone Hospital-Long Island,30 to 49,116,F,Black/African American,Not Span/Hispanic,1,Emergency,Home or Self Care,2018,NEO073,BENIGN NEOPLASMS,FRS015,"FEMALE REPRODUCTIVE SYSTEM PROCEDURES, NEC",517,DILATION & CURETTAGE FOR NON-OBSTETRIC DIAGNOSES,13,DISEASES AND DISORDERS OF THE FEMALE REPRODUCTIVE SYSTEM,2,Moderate,Minor,Surgical,Private Health Insurance,Medicaid,,,,true,39084.34,5655.98
Western NY,Erie,1401014,003067,Millard Fillmore Suburban Hospital,70 or Older,142,F,White,Not Span/Hispanic,3,Emergency,Home or Self Care,2018,NEO032,FEMALE REPRODUCTIVE SYSTEM CANCERS - CERVIX,FRS015,"FEMALE REPRODUCTIVE SYSTEM PROCEDURES, NEC",517,DILATION & CURETTAGE FOR NON-OBSTETRIC DIAGNOSES,13,DISEASES AND DISORDERS OF THE FEMALE REPRODUCTIVE SYSTEM,2,Moderate,Minor,Surgical,Medicare,Self-Pay,,,,true,18206.4,6151.88
New York City,Manhattan,7002020,001453,Memorial Hospital for Cancer and Allied Diseases,50 to 69,109,F,White,Not Span/Hispanic,3,Elective,Home or Self Care,2018,NEO032,FEMALE REPRODUCTIVE SYSTEM CANCERS - CERVIX,RAD002,BRACHYTHERAPY,517,DILATION & CURETTAGE FOR NON-OBSTETRIC DIAGNOSES,13,DISEASES AND DISORDERS OF THE FEMALE REPRODUCTIVE SYSTEM,2,Moderate,Moderate,Surgical,Private Health Insurance,,,,,false,133704.77,40970.39
Long Island,Nassau,2950002,000528,Nassau University Medical Center,30 to 49,115,F,White,Spanish/Hispanic,1,Emergency,Home or Self Care,2018,GEN025,OTHER SPECIFIED FEMALE GENITAL DISORDERS,FRS010,FEMALE UPPER GENITAL TRACT EXCISION,517,DILATION & CURETTAGE FOR NON-OBSTETRIC DIAGNOSES,13,DISEASES AND DISORDERS OF THE FEMALE REPRODUCTIVE SYSTEM,1,Minor,Minor,Surgical,Medicaid,Self-Pay,,,,false,14653.82,9151.85
New York City,Manhattan,7002024,001456,Mount Sinai Hospital,50 to 69,100,F,White,Not Span/Hispanic,1,Emergency,Home or Self Care,2018,NEO073,BENIGN NEOPLASMS,FRS015,"FEMALE REPRODUCTIVE SYSTEM PROCEDURES, NEC",517,DILATION & CURETTAGE FOR NON-OBSTETRIC DIAGNOSES,13,DISEASES AND DISORDERS OF THE FEMALE REPRODUCTIVE SYSTEM,2,Moderate,Minor,Surgical,Private Health Insurance,Self-Pay,,,,true,62133.7,19116.14
Capital/Adirond,Albany,0101000,000001,Albany Medical Center Hospital,30 to 49,121,F,Black/African American,Not Span/Hispanic,2,Emergency,Home or Self Care,2018,GEN025,OTHER SPECIFIED FEMALE GENITAL DISORDERS,FRS010,FEMALE UPPER GENITAL TRACT EXCISION,517,DILATION & CURETTAGE FOR NON-OBSTETRIC DIAGNOSES,13,DISEASES AND DISORDERS OF THE FEMALE REPRODUCTIVE SYSTEM,2,Moderate,Minor,Surgical,Medicare,Medicaid,,,,true,26142.99,7055.53
New York City,Kings,7001016,001301,Kings County Hospital Center,30 to 49,112,F,Black/African American,Not Span/Hispanic,1,Emergency,Home or Self Care,2018,GEN025,OTHER SPECIFIED FEMALE GENITAL DISORDERS,FRS015,"FEMALE REPRODUCTIVE SYSTEM PROCEDURES, NEC",517,DILATION & CURETTAGE FOR NON-OBSTETRIC DIAGNOSES,13,DISEASES AND DISORDERS OF THE FEMALE REPRODUCTIVE SYSTEM,1,Minor,Minor,Surgical,Blue Cross/Blue Shield,,,,,true,11386.47,8088.5
New York City,Manhattan,7002017,001450,Lenox Hill Hospital,18 to 29,112,F,White,Not Span/Hispanic,1,Urgent,Home or Self Care,2018,GEN019,ENDOMETRIOSIS,FRS015,"FEMALE REPRODUCTIVE SYSTEM PROCEDURES, NEC",517,DILATION & CURETTAGE FOR NON-OBSTETRIC DIAGNOSES,13,DISEASES AND DISORDERS OF THE FEMALE REPRODUCTIVE SYSTEM,1,Minor,Minor,Surgical,Blue Cross/Blue Shield,,,,,false,63317.29,17085.92
Capital/Adirond,Rensselaer,4102002,000756,Samaritan Hospital,18 to 29,121,F,Black/African American,Not Span/Hispanic,4,Emergency,Home or Self Care,2018,GEN025,OTHER SPECIFIED FEMALE GENITAL DISORDERS,FRS010,FEMALE UPPER GENITAL TRACT EXCISION,517,DILATION & CURETTAGE FOR NON-OBSTETRIC DIAGNOSES,13,DISEASES AND DISORDERS OF THE FEMALE REPRODUCTIVE SYSTEM,2,Moderate,Minor,Surgical,Medicaid,,,,,true,19980.82,4919.38
New York City,Queens,7003007,001633,Queens Hospital Center,30 to 49,114,F,Black/African American,Not Span/Hispanic,1,Emergency,Home or Self Care,2018,GEN025,OTHER SPECIFIED FEMALE GENITAL DISORDERS,ADM001,TRANSFUSION OF BLOOD AND BLOOD PRODUCTS,517,DILATION & CURETTAGE FOR NON-OBSTETRIC DIAGNOSES,13,DISEASES AND DISORDERS OF THE FEMALE REPRODUCTIVE SYSTEM,2,Moderate,Minor,Surgical,Private Health Insurance,,,,,true,11585.23,6186.15
New York City,Manhattan,7002021,001454,Metropolitan Hospital Center,30 to 49,112,F,Other Race,Not Span/Hispanic,4,Emergency,Home or Self Care,2018,GEN018,INFLAMMATORY DISEASES OF FEMALE PELVIC ORGANS,FRS005,FALLOPIAN TUBE LIGATION AND EXCISION,517,DILATION & CURETTAGE FOR NON-OBSTETRIC DIAGNOSES,13,DISEASES AND DISORDERS OF THE FEMALE REPRODUCTIVE SYSTEM,1,Minor,Minor,Surgical,Blue Cross/Blue Shield,,,,,false,25408.12,20528.49
New York City,Bronx,7000002,001165,Jacobi Medical Center,30 to 49,104,F,White,Not Span/Hispanic,2,Emergency,Home or Self Care,2018,NEO073,BENIGN NEOPLASMS,FRS015,"FEMALE REPRODUCTIVE SYSTEM PROCEDURES, NEC",517,DILATION & CURETTAGE FOR NON-OBSTETRIC DIAGNOSES,13,DISEASES AND DISORDERS OF THE FEMALE REPRODUCTIVE SYSTEM,1,Minor,Minor,Surgical,Medicaid,,,,,true,16464.85,9741.43