Hospital Service Area,Hospital County,Operating Certificate Number,Permanent Facility Id,Facility Name,Age Group,Zip Code - 3 digits,Gender,Race,Ethnicity,Length of Stay,Type of Admission,Patient Disposition,Discharge Year,CCS Diagnosis Code,CCS Diagnosis Description,CCS Procedure Code,CCS Procedure Description,APR DRG Code,APR DRG Description,APR MDC Code,APR MDC Description,APR Severity of Illness Code,APR Severity of Illness Description,APR Risk of Mortality,APR Medical Surgical Description,Payment Typology 1,Payment Typology 2,Payment Typology 3,Birth Weight,Abortion Edit Indicator,Emergency Department Indicator,Total Charges,Total Costs
New York City,Manhattan,7002001,001438,Bellevue Hospital Center,30 to 49,100,F,Other Race,Not Span/Hispanic,1,Elective,Home or Self Care,2017,046,Benign neoplasm of uterus,125,OT EXC CERVIX & UTERUS,519,Uterine & adnexa procedures for leiomyoma,13,Diseases and Disorders of the Female Reproductive System,1,Minor,Minor,Surgical,Self-Pay,,,,N,N,6493.47,4186.65
New York City,Manhattan,7002001,001438,Bellevue Hospital Center,30 to 49,104,F,Other Race,Not Span/Hispanic,2,Elective,Home or Self Care,2017,046,Benign neoplasm of uterus,123,OT OPER FALLOPIAN TUBES,519,Uterine & adnexa procedures for leiomyoma,13,Diseases and Disorders of the Female Reproductive System,1,Minor,Minor,Surgical,Self-Pay,,,,N,N,8928.92,5756.90
New York City,Manhattan,7002001,001438,Bellevue Hospital Center,30 to 49,113,F,Other Race,Spanish/Hispanic,1,Emergency,Home or Self Care,2017,046,Benign neoplasm of uterus,125,OT EXC CERVIX & UTERUS,519,Uterine & adnexa procedures for leiomyoma,13,Diseases and Disorders of the Female Reproductive System,1,Minor,Minor,Surgical,Self-Pay,,,,N,N,4419.55,2849.50
New York City,Manhattan,7002001,001438,Bellevue Hospital Center,30 to 49,103,F,Other Race,Not Span/Hispanic,1,Emergency,Left Against Medical Advice,2017,046,Benign neoplasm of uterus,132,OT OR THER PRC; FEM ORG,519,Uterine & adnexa procedures for leiomyoma,13,Diseases and Disorders of the Female Reproductive System,2,Moderate,Moderate,Surgical,Self-Pay,,,,N,Y,9007.69,5807.69
New York City,Manhattan,7002001,001438,Bellevue Hospital Center,30 to 49,112,F,Other Race,Spanish/Hispanic,1,Emergency,Home or Self Care,2017,046,Benign neoplasm of uterus,124,HYSTERECTOMY; AB/VAG,519,Uterine & adnexa procedures for leiomyoma,13,Diseases and Disorders of the Female Reproductive System,1,Minor,Minor,Surgical,Self-Pay,,,,N,N,6615.04,4265.03
New York City,Manhattan,7002001,001438,Bellevue Hospital Center,30 to 49,112,F,Other Race,Not Span/Hispanic,3,Emergency,Home or Self Care,2017,046,Benign neoplasm of uterus,125,OT EXC CERVIX & UTERUS,519,Uterine & adnexa procedures for leiomyoma,13,Diseases and Disorders of the Female Reproductive System,3,Major,Major,Surgical,Self-Pay,,,,N,N,19153.92,12349.45
New York City,Manhattan,7002001,001438,Bellevue Hospital Center,30 to 49,100,F,Other Race,Not Span/Hispanic,1,Emergency,Home or Self Care,2017,046,Benign neoplasm of uterus,124,HYSTERECTOMY; AB/VAG,519,Uterine & adnexa procedures for leiomyoma,13,Diseases and Disorders of the Female Reproductive System,1,Minor,Minor,Surgical,Medicaid,,,,N,N,7177.49,4627.67
New York City,Manhattan,7002001,001438,Bellevue Hospital Center,50 to 69,112,F,Other Race,Not Span/Hispanic,1,Emergency,Home or Self Care,2017,046,Benign neoplasm of uterus,124,HYSTERECTOMY; AB/VAG,519,Uterine & adnexa procedures for leiomyoma,13,Diseases and Disorders of the Female Reproductive System,1,Minor,Minor,Surgical,Medicaid,,,,N,N,3799.81,2449.92
New York City,Manhattan,7002001,001438,Bellevue Hospital Center,50 to 69,112,F,Black/African American,Not Span/Hispanic,1,Elective,Home or Self Care,2017,046,Benign neoplasm of uterus,124,HYSTERECTOMY; AB/VAG,519,Uterine & adnexa procedures for leiomyoma,13,Diseases and Disorders of the Female Reproductive System,2,Moderate,Minor,Surgical,Medicaid,,,,N,N,6845.58,4413.67
New York City,Manhattan,7002001,001438,Bellevue Hospital Center,30 to 49,100,F,Other Race,Not Span/Hispanic,3,Elective,Home or Self Care,2017,046,Benign neoplasm of uterus,125,OT EXC CERVIX & UTERUS,519,Uterine & adnexa procedures for leiomyoma,13,Diseases and Disorders of the Female Reproductive System,1,Minor,Minor,Surgical,Self-Pay,,,,N,N,17555.99,11319.19
New York City,Manhattan,7002001,001438,Bellevue Hospital Center,18 to 29,113,F,Other Race,Spanish/Hispanic,1,Elective,Home or Self Care,2017,046,Benign neoplasm of uterus,087,LAPAROSCOPY,519,Uterine & adnexa procedures for leiomyoma,13,Diseases and Disorders of the Female Reproductive System,1,Minor,Minor,Surgical,Medicaid,,,,N,N,6529.55,4209.91
New York City,Manhattan,7002001,001438,Bellevue Hospital Center,50 to 69,112,F,Other Race,Not Span/Hispanic,1,Emergency,Home or Self Care,2017,046,Benign neoplasm of uterus,124,HYSTERECTOMY; AB/VAG,519,Uterine & adnexa procedures for leiomyoma,13,Diseases and Disorders of the Female Reproductive System,2,Moderate,Minor,Surgical,Medicaid,Medicaid,,,N,N,3690.59,2379.50
New York City,Manhattan,7002001,001438,Bellevue Hospital Center,30 to 49,104,F,Other Race,Not Span/Hispanic,1,Emergency,Home or Self Care,2017,046,Benign neoplasm of uterus,125,OT EXC CERVIX & UTERUS,519,Uterine & adnexa procedures for leiomyoma,13,Diseases and Disorders of the Female Reproductive System,2,Moderate,Minor,Surgical,Medicaid,Medicaid,,,N,Y,7600.51,4900.41
New York City,Manhattan,7002001,001438,Bellevue Hospital Center,30 to 49,113,F,Other Race,Not Span/Hispanic,2,Emergency,Home or Self Care,2017,046,Benign neoplasm of uterus,124,HYSTERECTOMY; AB/VAG,519,Uterine & adnexa procedures for leiomyoma,13,Diseases and Disorders of the Female Reproductive System,1,Minor,Minor,Surgical,Medicaid,,,,N,N,13541.11,8730.60
New York City,Manhattan,7002001,001438,Bellevue Hospital Center,30 to 49,112,F,Other Race,Spanish/Hispanic,1,Emergency,Home or Self Care,2017,046,Benign neoplasm of uterus,125,OT EXC CERVIX & UTERUS,519,Uterine & adnexa procedures for leiomyoma,13,Diseases and Disorders of the Female Reproductive System,2,Moderate,Minor,Surgical,Medicaid,,,,N,Y,7265.66,4684.52
New York City,Manhattan,7002001,001438,Bellevue Hospital Center,30 to 49,104,F,Black/African American,Not Span/Hispanic,2,Elective,Home or Self Care,2017,046,Benign neoplasm of uterus,124,HYSTERECTOMY; AB/VAG,519,Uterine & adnexa procedures for leiomyoma,13,Diseases and Disorders of the Female Reproductive System,1,Minor,Minor,Surgical,Self-Pay,,,,N,N,13341.12,8601.66
New York City,Manhattan,7002001,001438,Bellevue Hospital Center,30 to 49,113,F,Other Race,Not Span/Hispanic,2,Emergency,Home or Self Care,2017,046,Benign neoplasm of uterus,125,OT EXC CERVIX & UTERUS,519,Uterine & adnexa procedures for leiomyoma,13,Diseases and Disorders of the Female Reproductive System,2,Moderate,Minor,Surgical,Self-Pay,,,,N,N,12870.93,8298.51
New York City,Manhattan,7002001,001438,Bellevue Hospital Center,30 to 49,114,F,Black/African American,Not Span/Hispanic,2,Emergency,Home or Self Care,2017,046,Benign neoplasm of uterus,124,HYSTERECTOMY; AB/VAG,519,Uterine & adnexa procedures for leiomyoma,13,Diseases and Disorders of the Female Reproductive System,1,Minor,Minor,Surgical,Medicaid,Medicaid,,,N,N,13409.86,8645.98
New York City,Manhattan,7002001,001438,Bellevue Hospital Center,50 to 69,105,F,Other Race,Not Span/Hispanic,1,Emergency,Home or Self Care,2017,046,Benign neoplasm of uterus,124,HYSTERECTOMY; AB/VAG,519,Uterine & adnexa procedures for leiomyoma,13,Diseases and Disorders of the Female Reproductive System,1,Minor,Minor,Surgical,Private Health Insurance,,,,N,N,7231.12,4662.25
New York City,Manhattan,7002001,001438,Bellevue Hospital Center,30 to 49,104,F,Black/African American,Not Span/Hispanic,1,Emergency,Home or Self Care,2017,046,Benign neoplasm of uterus,125,OT EXC CERVIX & UTERUS,519,Uterine & adnexa procedures for leiomyoma,13,Diseases and Disorders of the Female Reproductive System,1,Minor,Minor,Surgical,Medicaid,Medicaid,,,N,N,6565.60,4233.16
New York City,Manhattan,7002001,001438,Bellevue Hospital Center,50 to 69,113,F,Other Race,Not Span/Hispanic,1,Emergency,Home or Self Care,2017,046,Benign neoplasm of uterus,124,HYSTERECTOMY; AB/VAG,519,Uterine & adnexa procedures for leiomyoma,13,Diseases and Disorders of the Female Reproductive System,1,Minor,Minor,Surgical,Self-Pay,,,,N,N,7793.57,5024.89
New York City,Manhattan,7002001,001438,Bellevue Hospital Center,30 to 49,112,F,Other Race,Not Span/Hispanic,2,Emergency,Home or Self Care,2017,046,Benign neoplasm of uterus,125,OT EXC CERVIX & UTERUS,519,Uterine & adnexa procedures for leiomyoma,13,Diseases and Disorders of the Female Reproductive System,1,Minor,Minor,Surgical,Medicaid,Medicaid,,,N,N,12639.55,8149.32
New York City,Manhattan,7002001,001438,Bellevue Hospital Center,50 to 69,112,F,Other Race,Not Span/Hispanic,1,Elective,Home or Self Care,2017,046,Benign neoplasm of uterus,124,HYSTERECTOMY; AB/VAG,519,Uterine & adnexa procedures for leiomyoma,13,Diseases and Disorders of the Female Reproductive System,1,Minor,Minor,Surgical,Medicaid,Medicaid,,,N,N,7231.12,4662.25
New York City,Manhattan,7002001,001438,Bellevue Hospital Center,30 to 49,115,F,Other Race,Not Span/Hispanic,2,Emergency,Home or Self Care,2017,046,Benign neoplasm of uterus,124,HYSTERECTOMY; AB/VAG,519,Uterine & adnexa procedures for leiomyoma,13,Diseases and Disorders of the Female Reproductive System,1,Minor,Minor,Surgical,Medicaid,,,,N,N,13841.27,8924.13
New York City,Manhattan,7002001,001438,Bellevue Hospital Center,30 to 49,104,F,Other Race,Not Span/Hispanic,2,Emergency,Home or Self Care,2017,046,Benign neoplasm of uterus,125,OT EXC CERVIX & UTERUS,519,Uterine & adnexa procedures for leiomyoma,13,Diseases and Disorders of the Female Reproductive System,2,Moderate,Minor,Surgical,Medicaid,Medicaid,,,N,N,6643.35,4283.29
New York City,Manhattan,7002001,001438,Bellevue Hospital Center,30 to 49,111,F,White,Not Span/Hispanic,1,Emergency,Home or Self Care,2017,046,Benign neoplasm of uterus,124,HYSTERECTOMY; AB/VAG,519,Uterine & adnexa procedures for leiomyoma,13,Diseases and Disorders of the Female Reproductive System,1,Minor,Minor,Surgical,Self-Pay,,,,N,N,6867.90,4428.06
New York City,Manhattan,7002001,001438,Bellevue Hospital Center,30 to 49,104,F,Black/African American,Not Span/Hispanic,2,Emergency,Home or Self Care,2017,046,Benign neoplasm of uterus,124,HYSTERECTOMY; AB/VAG,519,Uterine & adnexa procedures for leiomyoma,13,Diseases and Disorders of the Female Reproductive System,1,Minor,Minor,Surgical,Medicaid,,,,N,N,13341.12,8601.66
New York City,Manhattan,7002001,001438,Bellevue Hospital Center,30 to 49,112,F,Black/African American,Not Span/Hispanic,2,Emergency,Home or Self Care,2017,046,Benign neoplasm of uterus,124,HYSTERECTOMY; AB/VAG,519,Uterine & adnexa procedures for leiomyoma,13,Diseases and Disorders of the Female Reproductive System,1,Minor,Minor,Surgical,Private Health Insurance,,,,N,N,13531.40,8724.34
New York City,Manhattan,7002001,001438,Bellevue Hospital Center,30 to 49,100,F,Other Race,Not Span/Hispanic,2,Emergency,Home or Self Care,2017,046,Benign neoplasm of uterus,125,OT EXC CERVIX & UTERUS,519,Uterine & adnexa procedures for leiomyoma,13,Diseases and Disorders of the Female Reproductive System,1,Minor,Minor,Surgical,Medicaid,Medicaid,,,N,N,12639.55,8149.32
New York City,Manhattan,7002001,001438,Bellevue Hospital Center,30 to 49,113,F,Other Race,Spanish/Hispanic,2,Emergency,Home or Self Care,2017,046,Benign neoplasm of uterus,124,HYSTERECTOMY; AB/VAG,519,Uterine & adnexa procedures for leiomyoma,13,Diseases and Disorders of the Female Reproductive System,1,Minor,Minor,Surgical,Self-Pay,,,,N,N,13427.35,8657.26
New York City,Manhattan,7002001,001438,Bellevue Hospital Center,50 to 69,112,F,Black/African American,Not Span/Hispanic,3,Elective,Home w/ Home Health Services,2017,046,Benign neoplasm of uterus,124,HYSTERECTOMY; AB/VAG,519,Uterine & adnexa procedures for leiomyoma,13,Diseases and Disorders of the Female Reproductive System,2,Moderate,Minor,Surgical,Medicaid,Medicaid,,,N,N,18491.32,11922.24
New York City,Manhattan,7002001,001438,Bellevue Hospital Center,30 to 49,112,F,Other Race,Not Span/Hispanic,2,Elective,Home or Self Care,2017,046,Benign neoplasm of uterus,124,HYSTERECTOMY; AB/VAG,519,Uterine & adnexa procedures for leiomyoma,13,Diseases and Disorders of the Female Reproductive System,1,Minor,Minor,Surgical,Self-Pay,,,,N,N,13018.63,8393.74
New York City,Manhattan,7002001,001438,Bellevue Hospital Center,30 to 49,113,F,Other Race,Spanish/Hispanic,1,Emergency,Home or Self Care,2017,046,Benign neoplasm of uterus,124,HYSTERECTOMY; AB/VAG,519,Uterine & adnexa procedures for leiomyoma,13,Diseases and Disorders of the Female Reproductive System,1,Minor,Minor,Surgical,Self-Pay,,,,N,N,6907.88,4453.84
New York City,Manhattan,7002001,001438,Bellevue Hospital Center,30 to 49,113,F,Other Race,Spanish/Hispanic,2,Emergency,Home or Self Care,2017,046,Benign neoplasm of uterus,124,HYSTERECTOMY; AB/VAG,519,Uterine & adnexa procedures for leiomyoma,13,Diseases and Disorders of the Female Reproductive System,1,Minor,Minor,Surgical,Medicaid,Medicaid,,,N,N,13815.84,8907.74
New York City,Manhattan,7002001,001438,Bellevue Hospital Center,30 to 49,104,F,Black/African American,Not Span/Hispanic,2,Emergency,Home or Self Care,2017,046,Benign neoplasm of uterus,125,OT EXC CERVIX & UTERUS,519,Uterine & adnexa procedures for leiomyoma,13,Diseases and Disorders of the Female Reproductive System,2,Moderate,Minor,Surgical,Medicaid,,,,N,N,13085.59,8436.91
New York City,Manhattan,7002001,001438,Bellevue Hospital Center,30 to 49,113,F,Other Race,Not Span/Hispanic,1,Elective,Home or Self Care,2017,046,Benign neoplasm of uterus,124,HYSTERECTOMY; AB/VAG,519,Uterine & adnexa procedures for leiomyoma,13,Diseases and Disorders of the Female Reproductive System,1,Minor,Minor,Surgical,Self-Pay,,,,N,N,7231.12,4662.25
New York City,Manhattan,7002001,001438,Bellevue Hospital Center,30 to 49,112,F,Black/African American,Not Span/Hispanic,1,Elective,Home or Self Care,2017,046,Benign neoplasm of uterus,124,HYSTERECTOMY; AB/VAG,519,Uterine & adnexa procedures for leiomyoma,13,Diseases and Disorders of the Female Reproductive System,1,Minor,Minor,Surgical,Medicaid,,,,N,N,7231.12,4662.25
New York City,Manhattan,7002001,001438,Bellevue Hospital Center,30 to 49,112,F,Other Race,Not Span/Hispanic,1,Elective,Home or Self Care,2017,046,Benign neoplasm of uterus,124,HYSTERECTOMY; AB/VAG,519,Uterine & adnexa procedures for leiomyoma,13,Diseases and Disorders of the Female Reproductive System,1,Minor,Minor,Surgical,Medicaid,,,,N,N,7231.12,4662.25
New York City,Manhattan,7002001,001438,Bellevue Hospital Center,30 to 49,112,F,Other Race,Spanish/Hispanic,2,Elective,Home or Self Care,2017,046,Benign neoplasm of uterus,124,HYSTERECTOMY; AB/VAG,519,Uterine & adnexa procedures for leiomyoma,13,Diseases and Disorders of the Female Reproductive System,1,Minor,Minor,Surgical,Medicaid,,,,N,N,13822.40,8911.96
New York City,Manhattan,7002001,001438,Bellevue Hospital Center,50 to 69,112,F,Black/African American,Not Span/Hispanic,2,Emergency,Home or Self Care,2017,046,Benign neoplasm of uterus,124,HYSTERECTOMY; AB/VAG,519,Uterine & adnexa procedures for leiomyoma,13,Diseases and Disorders of the Female Reproductive System,1,Minor,Minor,Surgical,Self-Pay,,,,N,N,9292.52,5991.33
New York City,Manhattan,7002001,001438,Bellevue Hospital Center,30 to 49,113,F,Other Race,Not Span/Hispanic,2,Emergency,Home or Self Care,2017,046,Benign neoplasm of uterus,124,HYSTERECTOMY; AB/VAG,519,Uterine & adnexa procedures for leiomyoma,13,Diseases and Disorders of the Female Reproductive System,1,Minor,Minor,Surgical,Medicaid,Medicaid,,,N,N,13485.74,8694.90
New York City,Manhattan,7002001,001438,Bellevue Hospital Center,30 to 49,112,F,Other Race,Not Span/Hispanic,1,Elective,Home or Self Care,2017,046,Benign neoplasm of uterus,124,HYSTERECTOMY; AB/VAG,519,Uterine & adnexa procedures for leiomyoma,13,Diseases and Disorders of the Female Reproductive System,1,Minor,Minor,Surgical,Private Health Insurance,,,,N,N,6867.90,4428.06
New York City,Manhattan,7002001,001438,Bellevue Hospital Center,50 to 69,112,F,Black/African American,Not Span/Hispanic,2,Elective,Home or Self Care,2017,046,Benign neoplasm of uterus,124,HYSTERECTOMY; AB/VAG,519,Uterine & adnexa procedures for leiomyoma,13,Diseases and Disorders of the Female Reproductive System,1,Minor,Minor,Surgical,Self-Pay,,,,N,N,12955.58,8353.08
New York City,Manhattan,7002001,001438,Bellevue Hospital Center,30 to 49,112,F,Black/African American,Not Span/Hispanic,2,Emergency,Home or Self Care,2017,046,Benign neoplasm of uterus,125,OT EXC CERVIX & UTERUS,519,Uterine & adnexa procedures for leiomyoma,13,Diseases and Disorders of the Female Reproductive System,1,Minor,Minor,Surgical,Self-Pay,,,,N,N,13225.45,8527.08
New York City,Manhattan,7002001,001438,Bellevue Hospital Center,30 to 49,112,F,Black/African American,Not Span/Hispanic,1,Elective,Home or Self Care,2017,046,Benign neoplasm of uterus,125,OT EXC CERVIX & UTERUS,519,Uterine & adnexa procedures for leiomyoma,13,Diseases and Disorders of the Female Reproductive System,1,Minor,Minor,Surgical,Medicaid,,,,N,N,6529.55,4209.91
New York City,Manhattan,7002001,001438,Bellevue Hospital Center,50 to 69,113,F,Other Race,Not Span/Hispanic,3,Emergency,Home or Self Care,2017,046,Benign neoplasm of uterus,124,HYSTERECTOMY; AB/VAG,519,Uterine & adnexa procedures for leiomyoma,13,Diseases and Disorders of the Female Reproductive System,2,Moderate,Minor,Surgical,Self-Pay,,,,N,N,18621.22,12005.99
New York City,Manhattan,7002001,001438,Bellevue Hospital Center,30 to 49,100,F,Other Race,Not Span/Hispanic,3,Elective,Home or Self Care,2017,046,Benign neoplasm of uterus,124,HYSTERECTOMY; AB/VAG,519,Uterine & adnexa procedures for leiomyoma,13,Diseases and Disorders of the Female Reproductive System,2,Moderate,Minor,Surgical,Blue Cross/Blue Shield,,,,N,N,18176.05,11718.97
New York City,Manhattan,7002001,001438,Bellevue Hospital Center,30 to 49,112,F,Other Race,Spanish/Hispanic,1,Emergency,Home or Self Care,2017,046,Benign neoplasm of uterus,124,HYSTERECTOMY; AB/VAG,519,Uterine & adnexa procedures for leiomyoma,13,Diseases and Disorders of the Female Reproductive System,1,Minor,Minor,Surgical,Self-Pay,,,,N,N,7231.12,4662.25
New York City,Manhattan,7002001,001438,Bellevue Hospital Center,30 to 49,113,F,White,Not Span/Hispanic,1,Emergency,Home or Self Care,2017,046,Benign neoplasm of uterus,125,OT EXC CERVIX & UTERUS,519,Uterine & adnexa procedures for leiomyoma,13,Diseases and Disorders of the Female Reproductive System,1,Minor,Minor,Surgical,Self-Pay,,,,N,N,4419.55,2849.50
New York City,Manhattan,7002001,001438,Bellevue Hospital Center,30 to 49,112,F,Other Race,Spanish/Hispanic,2,Emergency,Home or Self Care,2017,046,Benign neoplasm of uterus,124,HYSTERECTOMY; AB/VAG,519,Uterine & adnexa procedures for leiomyoma,13,Diseases and Disorders of the Female Reproductive System,1,Minor,Minor,Surgical,Self-Pay,,,,N,N,9863.49,6359.47
New York City,Manhattan,7002001,001438,Bellevue Hospital Center,30 to 49,100,F,Other Race,Spanish/Hispanic,1,Emergency,Home or Self Care,2017,046,Benign neoplasm of uterus,124,HYSTERECTOMY; AB/VAG,519,Uterine & adnexa procedures for leiomyoma,13,Diseases and Disorders of the Female Reproductive System,1,Minor,Minor,Surgical,Private Health Insurance,,,,N,N,7168.82,4622.08
New York City,Manhattan,7002001,001438,Bellevue Hospital Center,30 to 49,112,F,Black/African American,Not Span/Hispanic,4,Emergency,Home or Self Care,2017,046,Benign neoplasm of uterus,120,OT OPERATIONS ON OVARY,519,Uterine & adnexa procedures for leiomyoma,13,Diseases and Disorders of the Female Reproductive System,1,Minor,Minor,Surgical,Private Health Insurance,Medicaid,,,N,N,23262.09,14998.19
New York City,Manhattan,7002001,001438,Bellevue Hospital Center,30 to 49,104,F,Other Race,Not Span/Hispanic,2,Emergency,Home or Self Care,2017,046,Benign neoplasm of uterus,124,HYSTERECTOMY; AB/VAG,519,Uterine & adnexa procedures for leiomyoma,13,Diseases and Disorders of the Female Reproductive System,2,Moderate,Minor,Surgical,Self-Pay,,,,N,N,13171.99,8492.61
New York City,Manhattan,7002001,001438,Bellevue Hospital Center,30 to 49,104,F,Other Race,Spanish/Hispanic,1,Emergency,Home or Self Care,2017,046,Benign neoplasm of uterus,124,HYSTERECTOMY; AB/VAG,519,Uterine & adnexa procedures for leiomyoma,13,Diseases and Disorders of the Female Reproductive System,1,Minor,Minor,Surgical,Self-Pay,,,,N,N,7218.29,4653.98
New York City,Manhattan,7002001,001438,Bellevue Hospital Center,50 to 69,113,F,Other Race,Spanish/Hispanic,1,Emergency,Home or Self Care,2017,046,Benign neoplasm of uterus,124,HYSTERECTOMY; AB/VAG,519,Uterine & adnexa procedures for leiomyoma,13,Diseases and Disorders of the Female Reproductive System,1,Minor,Minor,Surgical,Self-Pay,,,,N,N,3563.45,2297.53
New York City,Manhattan,7002001,001438,Bellevue Hospital Center,30 to 49,100,F,Black/African American,Not Span/Hispanic,1,Emergency,Home or Self Care,2017,046,Benign neoplasm of uterus,125,OT EXC CERVIX & UTERUS,519,Uterine & adnexa procedures for leiomyoma,13,Diseases and Disorders of the Female Reproductive System,2,Moderate,Minor,Surgical,Medicaid,Medicaid,,,N,Y,7539.42,4861.03
New York City,Manhattan,7002001,001438,Bellevue Hospital Center,30 to 49,113,F,Other Race,Not Span/Hispanic,1,Emergency,Home or Self Care,2017,046,Benign neoplasm of uterus,124,HYSTERECTOMY; AB/VAG,519,Uterine & adnexa procedures for leiomyoma,13,Diseases and Disorders of the Female Reproductive System,1,Minor,Minor,Surgical,Medicaid,Medicaid,,,N,N,7569.87,4880.66
New York City,Manhattan,7002001,001438,Bellevue Hospital Center,30 to 49,112,F,Black/African American,Not Span/Hispanic,1,Elective,Home or Self Care,2017,046,Benign neoplasm of uterus,124,HYSTERECTOMY; AB/VAG,519,Uterine & adnexa procedures for leiomyoma,13,Diseases and Disorders of the Female Reproductive System,1,Minor,Minor,Surgical,Medicaid,Medicaid,,,N,N,7280.62,4694.17
New York City,Manhattan,7002001,001438,Bellevue Hospital Center,30 to 49,103,F,Other Race,Not Span/Hispanic,1,Elective,Home or Self Care,2017,046,Benign neoplasm of uterus,124,HYSTERECTOMY; AB/VAG,519,Uterine & adnexa procedures for leiomyoma,13,Diseases and Disorders of the Female Reproductive System,1,Minor,Minor,Surgical,Medicaid,Medicaid,,,N,N,6989.95,4506.76
New York City,Manhattan,7002001,001438,Bellevue Hospital Center,30 to 49,104,F,Other Race,Not Span/Hispanic,1,Emergency,Home or Self Care,2017,046,Benign neoplasm of uterus,124,HYSTERECTOMY; AB/VAG,519,Uterine & adnexa procedures for leiomyoma,13,Diseases and Disorders of the Female Reproductive System,1,Minor,Minor,Surgical,Self-Pay,,,,N,N,6970.26,4494.06
New York City,Manhattan,7002001,001438,Bellevue Hospital Center,50 to 69,112,F,Other Race,Not Span/Hispanic,1,Emergency,Home or Self Care,2017,046,Benign neoplasm of uterus,124,HYSTERECTOMY; AB/VAG,519,Uterine & adnexa procedures for leiomyoma,13,Diseases and Disorders of the Female Reproductive System,1,Minor,Minor,Surgical,Medicaid,,,,N,N,5058.82,3261.66
New York City,Manhattan,7002001,001438,Bellevue Hospital Center,50 to 69,100,F,Other Race,Spanish/Hispanic,2,Elective,Home or Self Care,2017,046,Benign neoplasm of uterus,124,HYSTERECTOMY; AB/VAG,519,Uterine & adnexa procedures for leiomyoma,13,Diseases and Disorders of the Female Reproductive System,1,Minor,Minor,Surgical,Medicaid,Medicaid,,,N,N,13213.58,8519.43
New York City,Manhattan,7002001,001438,Bellevue Hospital Center,30 to 49,112,F,Other Race,Not Span/Hispanic,1,Emergency,Home or Self Care,2017,046,Benign neoplasm of uterus,130,OT DX PRCS; FEMALE ORGN,519,Uterine & adnexa procedures for leiomyoma,13,Diseases and Disorders of the Female Reproductive System,1,Minor,Minor,Surgical,Private Health Insurance,,,,N,N,6529.55,4209.91