Hospital Service Area,Hospital County,Operating Certificate Number,Permanent Facility Id,Facility Name,Age Group,Zip Code - 3 digits,Gender,Race,Ethnicity,Length of Stay,Type of Admission,Patient Disposition,Discharge Year,CCS Diagnosis Code,CCS Diagnosis Description,CCS Procedure Code,CCS Procedure Description,APR DRG Code,APR DRG Description,APR MDC Code,APR MDC Description,APR Severity of Illness Code,APR Severity of Illness Description,APR Risk of Mortality,APR Medical Surgical Description,Payment Typology 1,Payment Typology 2,Payment Typology 3,Birth Weight,Abortion Edit Indicator,Emergency Department Indicator,Total Charges,Total Costs
New York City,Manhattan,7002053,001463,NYU Langone Hospitals,30 to 49,OOS,F,White,Not Span/Hispanic,2,Elective,Home or Self Care,2018,NEO073,BENIGN NEOPLASMS,FRS010,FEMALE UPPER GENITAL TRACT EXCISION,519,UTERINE & ADNEXA PROCEDURES FOR LEIOMYOMA,13,DISEASES AND DISORDERS OF THE FEMALE REPRODUCTIVE SYSTEM,1,Minor,Minor,Surgical,Private Health Insurance,,,,,false,63898.93,12418.87
New York City,Kings,7001020,001305,Maimonides Medical Center,30 to 49,112,F,Black/African American,Not Span/Hispanic,3,Elective,Home or Self Care,2018,NEO073,BENIGN NEOPLASMS,FRS010,FEMALE UPPER GENITAL TRACT EXCISION,519,UTERINE & ADNEXA PROCEDURES FOR LEIOMYOMA,13,DISEASES AND DISORDERS OF THE FEMALE REPRODUCTIVE SYSTEM,1,Minor,Minor,Surgical,Blue Cross/Blue Shield,Self-Pay,,,,false,46817.01,17314.64
New York City,Manhattan,7002054,001458,New York-Presbyterian Hospital - New York Weill Cornell Center,30 to 49,112,F,Other Race,Not Span/Hispanic,2,Elective,Home or Self Care,2018,NEO073,BENIGN NEOPLASMS,FRS001,HYSTERECTOMY,519,UTERINE & ADNEXA PROCEDURES FOR LEIOMYOMA,13,DISEASES AND DISORDERS OF THE FEMALE REPRODUCTIVE SYSTEM,1,Minor,Minor,Surgical,Private Health Insurance,,,,,false,43864.34,12459.32
Long Island,Suffolk,5153000,000913,Huntington Hospital,30 to 49,119,F,Other Race,Spanish/Hispanic,2,Elective,Home or Self Care,2018,NEO073,BENIGN NEOPLASMS,FRS003,SALPINGECTOMY,519,UTERINE & ADNEXA PROCEDURES FOR LEIOMYOMA,13,DISEASES AND DISORDERS OF THE FEMALE REPRODUCTIVE SYSTEM,1,Minor,Minor,Surgical,Medicaid,,,,,false,24972.55,11887.12
Western NY,Erie,1401013,000218,Sisters of Charity Hospital,30 to 49,140,F,White,Not Span/Hispanic,3,Elective,Home or Self Care,2018,NEO073,BENIGN NEOPLASMS,FRS001,HYSTERECTOMY,519,UTERINE & ADNEXA PROCEDURES FOR LEIOMYOMA,13,DISEASES AND DISORDERS OF THE FEMALE REPRODUCTIVE SYSTEM,1,Minor,Minor,Surgical,Private Health Insurance,,,,,false,16784.65,8163.14
New York City,Kings,7001021,001306,New York - Presbyterian Brooklyn Methodist Hospital,30 to 49,112,F,Black/African American,Not Span/Hispanic,1,Elective,Home or Self Care,2018,NEO073,BENIGN NEOPLASMS,FRS010,FEMALE UPPER GENITAL TRACT EXCISION,519,UTERINE & ADNEXA PROCEDURES FOR LEIOMYOMA,13,DISEASES AND DISORDERS OF THE FEMALE REPRODUCTIVE SYSTEM,1,Minor,Minor,Surgical,Blue Cross/Blue Shield,Self-Pay,,,,false,17676.56,8651.22
New York City,Kings,7001021,001306,New York - Presbyterian Brooklyn Methodist Hospital,30 to 49,112,F,Black/African American,Not Span/Hispanic,2,Elective,Home or Self Care,2018,NEO073,BENIGN NEOPLASMS,FRS001,HYSTERECTOMY,519,UTERINE & ADNEXA PROCEDURES FOR LEIOMYOMA,13,DISEASES AND DISORDERS OF THE FEMALE REPRODUCTIVE SYSTEM,1,Minor,Minor,Surgical,Blue Cross/Blue Shield,Self-Pay,,,,false,25233.53,10953.43
Long Island,Suffolk,5154001,000925,Good Samaritan Hospital Medical Center,30 to 49,117,F,Black/African American,Not Span/Hispanic,2,Elective,Home or Self Care,2018,NEO073,BENIGN NEOPLASMS,FRS001,HYSTERECTOMY,519,UTERINE & ADNEXA PROCEDURES FOR LEIOMYOMA,13,DISEASES AND DISORDERS OF THE FEMALE REPRODUCTIVE SYSTEM,1,Minor,Minor,Surgical,Private Health Insurance,,,,,false,49795.79,10087.92
Long Island,Suffolk,5154001,000925,Good Samaritan Hospital Medical Center,30 to 49,117,F,Other Race,Not Span/Hispanic,2,Elective,Home or Self Care,2018,NEO073,BENIGN NEOPLASMS,FRS001,HYSTERECTOMY,519,UTERINE & ADNEXA PROCEDURES FOR LEIOMYOMA,13,DISEASES AND DISORDERS OF THE FEMALE REPRODUCTIVE SYSTEM,1,Minor,Minor,Surgical,Private Health Insurance,Medicaid,,,,false,39825.82,8103.97
New York City,Manhattan,7002054,001458,New York-Presbyterian Hospital - New York Weill Cornell Center,30 to 49,OOS,F,Black/African American,Not Span/Hispanic,6,Emergency,Home or Self Care,2018,NEO073,BENIGN NEOPLASMS,FRS003,SALPINGECTOMY,519,UTERINE & ADNEXA PROCEDURES FOR LEIOMYOMA,13,DISEASES AND DISORDERS OF THE FEMALE REPRODUCTIVE SYSTEM,3,Major,Moderate,Surgical,Private Health Insurance,Self-Pay,,,,true,95136.05,24132.38
New York City,Kings,7001020,001305,Maimonides Medical Center,30 to 49,112,F,Black/African American,Not Span/Hispanic,1,Elective,Home or Self Care,2018,NEO073,BENIGN NEOPLASMS,FRS010,FEMALE UPPER GENITAL TRACT EXCISION,519,UTERINE & ADNEXA PROCEDURES FOR LEIOMYOMA,13,DISEASES AND DISORDERS OF THE FEMALE REPRODUCTIVE SYSTEM,1,Minor,Minor,Surgical,Medicaid,Medicaid,Self-Pay,,,false,33059.05,10391.43
Long Island,Suffolk,5154001,000925,Good Samaritan Hospital Medical Center,50 to 69,117,F,Other Race,Spanish/Hispanic,2,Elective,Home or Self Care,2018,NEO073,BENIGN NEOPLASMS,FRS001,HYSTERECTOMY,519,UTERINE & ADNEXA PROCEDURES FOR LEIOMYOMA,13,DISEASES AND DISORDERS OF THE FEMALE REPRODUCTIVE SYSTEM,1,Minor,Minor,Surgical,Blue Cross/Blue Shield,Medicaid,,,,false,42020.43,8491.72
Hudson Valley,Orange,3523000,000699,Garnet Health Medical Center,50 to 69,109,F,Black/African American,Not Span/Hispanic,2,Elective,Home or Self Care,2018,NEO073,BENIGN NEOPLASMS,FRS001,HYSTERECTOMY,519,UTERINE & ADNEXA PROCEDURES FOR LEIOMYOMA,13,DISEASES AND DISORDERS OF THE FEMALE REPRODUCTIVE SYSTEM,1,Minor,Minor,Surgical,Medicaid,,,,,false,23683.86,8171.87
New York City,Kings,7001016,001301,Kings County Hospital Center,30 to 49,112,F,Black/African American,Not Span/Hispanic,3,Elective,Home or Self Care,2018,NEO073,BENIGN NEOPLASMS,FRS001,HYSTERECTOMY,519,UTERINE & ADNEXA PROCEDURES FOR LEIOMYOMA,13,DISEASES AND DISORDERS OF THE FEMALE REPRODUCTIVE SYSTEM,1,Minor,Minor,Surgical,Medicaid,Medicaid,,,,false,17273.74,12270.59
Hudson Valley,Westchester,5904001,001072,Montefiore New Rochelle Hospital,30 to 49,104,F,White,Spanish/Hispanic,4,Elective,Home or Self Care,2018,NEO073,BENIGN NEOPLASMS,FRS010,FEMALE UPPER GENITAL TRACT EXCISION,519,UTERINE & ADNEXA PROCEDURES FOR LEIOMYOMA,13,DISEASES AND DISORDERS OF THE FEMALE REPRODUCTIVE SYSTEM,2,Moderate,Minor,Surgical,Private Health Insurance,Self-Pay,,,,false,43956.05,12243.84
New York City,Manhattan,7002024,001456,Mount Sinai Hospital,50 to 69,100,F,White,Not Span/Hispanic,1,Elective,Home or Self Care,2018,NEO073,BENIGN NEOPLASMS,FRS001,HYSTERECTOMY,519,UTERINE & ADNEXA PROCEDURES FOR LEIOMYOMA,13,DISEASES AND DISORDERS OF THE FEMALE REPRODUCTIVE SYSTEM,2,Moderate,Minor,Surgical,Blue Cross/Blue Shield,Self-Pay,,,,false,24652.95,8287.82
New York City,Manhattan,7002054,001464,New York-Presbyterian Hospital - Columbia Presbyterian Center,50 to 69,100,F,Black/African American,Not Span/Hispanic,7,Urgent,Home w/ Home Health Services,2018,NEO073,BENIGN NEOPLASMS,FRS001,HYSTERECTOMY,519,UTERINE & ADNEXA PROCEDURES FOR LEIOMYOMA,13,DISEASES AND DISORDERS OF THE FEMALE REPRODUCTIVE SYSTEM,3,Major,Major,Surgical,Medicare,Medicare,Self-Pay,,,false,120567.02,32241.25
New York City,Manhattan,7002009,001445,Harlem Hospital Center,30 to 49,112,F,Black/African American,Not Span/Hispanic,3,Emergency,Home or Self Care,2018,NEO073,BENIGN NEOPLASMS,FRS010,FEMALE UPPER GENITAL TRACT EXCISION,519,UTERINE & ADNEXA PROCEDURES FOR LEIOMYOMA,13,DISEASES AND DISORDERS OF THE FEMALE REPRODUCTIVE SYSTEM,1,Minor,Minor,Surgical,Medicaid,,,,,false,16200,12038.72
New York City,Bronx,7000001,001178,BronxCare Hospital Center,30 to 49,104,F,Other Race,Spanish/Hispanic,2,Elective,Home or Self Care,2018,NEO073,BENIGN NEOPLASMS,FRS010,FEMALE UPPER GENITAL TRACT EXCISION,519,UTERINE & ADNEXA PROCEDURES FOR LEIOMYOMA,13,DISEASES AND DISORDERS OF THE FEMALE REPRODUCTIVE SYSTEM,1,Minor,Minor,Surgical,Medicaid,,,,,false,10902.89,12865.98
Central NY,Onondaga,3301008,000636,Crouse Hospital,50 to 69,134,F,White,Not Span/Hispanic,2,Elective,Home or Self Care,2018,NEO073,BENIGN NEOPLASMS,FRS001,HYSTERECTOMY,519,UTERINE & ADNEXA PROCEDURES FOR LEIOMYOMA,13,DISEASES AND DISORDERS OF THE FEMALE REPRODUCTIVE SYSTEM,2,Moderate,Minor,Surgical,Medicare,,,,,false,19773.07,8050.62
Hudson Valley,Westchester,5957001,001139,Westchester Medical Center,50 to 69,127,F,Black/African American,Not Span/Hispanic,3,Elective,Home or Self Care,2018,NEO073,BENIGN NEOPLASMS,FRS001,HYSTERECTOMY,519,UTERINE & ADNEXA PROCEDURES FOR LEIOMYOMA,13,DISEASES AND DISORDERS OF THE FEMALE REPRODUCTIVE SYSTEM,1,Minor,Minor,Surgical,Blue Cross/Blue Shield,,,,,false,86406.71,16796.95
Long Island,Nassau,2951001,000541,North Shore University Hospital,30 to 49,125,F,Black/African American,Not Span/Hispanic,1,Elective,Home or Self Care,2018,NEO073,BENIGN NEOPLASMS,FRS010,FEMALE UPPER GENITAL TRACT EXCISION,519,UTERINE & ADNEXA PROCEDURES FOR LEIOMYOMA,13,DISEASES AND DISORDERS OF THE FEMALE REPRODUCTIVE SYSTEM,1,Minor,Minor,Surgical,Private Health Insurance,,,,,false,38694.08,11226.38
Long Island,Nassau,2952005,000552,Plainview Hospital,30 to 49,114,F,Black/African American,Not Span/Hispanic,2,Elective,Home or Self Care,2018,NEO073,BENIGN NEOPLASMS,FRS010,FEMALE UPPER GENITAL TRACT EXCISION,519,UTERINE & ADNEXA PROCEDURES FOR LEIOMYOMA,13,DISEASES AND DISORDERS OF THE FEMALE REPRODUCTIVE SYSTEM,1,Minor,Minor,Surgical,Private Health Insurance,,,,,false,28599.82,14319.77
Long Island,Nassau,2952005,000552,Plainview Hospital,50 to 69,117,F,White,Spanish/Hispanic,2,Elective,Home or Self Care,2018,NEO073,BENIGN NEOPLASMS,FRS001,HYSTERECTOMY,519,UTERINE & ADNEXA PROCEDURES FOR LEIOMYOMA,13,DISEASES AND DISORDERS OF THE FEMALE REPRODUCTIVE SYSTEM,1,Minor,Minor,Surgical,Blue Cross/Blue Shield,,,,,false,25878.82,12910.39
New York City,Bronx,7000024,001186,North Central Bronx Hospital,30 to 49,104,F,Black/African American,Not Span/Hispanic,3,Elective,Home or Self Care,2018,NEO073,BENIGN NEOPLASMS,FRS010,FEMALE UPPER GENITAL TRACT EXCISION,519,UTERINE & ADNEXA PROCEDURES FOR LEIOMYOMA,13,DISEASES AND DISORDERS OF THE FEMALE REPRODUCTIVE SYSTEM,2,Moderate,Minor,Surgical,Medicaid,Medicaid,,,,false,17664.87,10604.38
Long Island,Nassau,2909000,000513,Mercy Hospital,30 to 49,117,F,White,Spanish/Hispanic,2,Elective,Home or Self Care,2018,NEO073,BENIGN NEOPLASMS,FRS010,FEMALE UPPER GENITAL TRACT EXCISION,519,UTERINE & ADNEXA PROCEDURES FOR LEIOMYOMA,13,DISEASES AND DISORDERS OF THE FEMALE REPRODUCTIVE SYSTEM,1,Minor,Minor,Surgical,Private Health Insurance,,,,,false,36227.51,8460.04
Long Island,Suffolk,5154000,000924,South Shore University Hospital,30 to 49,117,F,Other Race,Spanish/Hispanic,2,Elective,Home or Self Care,2018,NEO073,BENIGN NEOPLASMS,FRS010,FEMALE UPPER GENITAL TRACT EXCISION,519,UTERINE & ADNEXA PROCEDURES FOR LEIOMYOMA,13,DISEASES AND DISORDERS OF THE FEMALE REPRODUCTIVE SYSTEM,1,Minor,Minor,Surgical,Private Health Insurance,,,,,false,30734.47,8300.28
Long Island,Suffolk,5151001,000245,Stony Brook University Hospital,50 to 69,119,F,Other Race,Not Span/Hispanic,1,Urgent,Home or Self Care,2018,NEO073,BENIGN NEOPLASMS,FRS001,HYSTERECTOMY,519,UTERINE & ADNEXA PROCEDURES FOR LEIOMYOMA,13,DISEASES AND DISORDERS OF THE FEMALE REPRODUCTIVE SYSTEM,1,Minor,Minor,Surgical,Medicaid,Medicaid,,,,false,23168.57,10301.6
New York City,Manhattan,7002009,001445,Harlem Hospital Center,30 to 49,100,F,Other Race,Spanish/Hispanic,3,Emergency,Home or Self Care,2018,NEO073,BENIGN NEOPLASMS,FRS010,FEMALE UPPER GENITAL TRACT EXCISION,519,UTERINE & ADNEXA PROCEDURES FOR LEIOMYOMA,13,DISEASES AND DISORDERS OF THE FEMALE REPRODUCTIVE SYSTEM,1,Minor,Minor,Surgical,Medicaid,Medicaid,,,,false,16200,12038.72
New York City,Queens,7003004,001630,Long Island Jewish Medical Center,30 to 49,113,F,White,Not Span/Hispanic,3,Elective,Home or Self Care,2018,NEO073,BENIGN NEOPLASMS,FRS001,HYSTERECTOMY,519,UTERINE & ADNEXA PROCEDURES FOR LEIOMYOMA,13,DISEASES AND DISORDERS OF THE FEMALE REPRODUCTIVE SYSTEM,1,Minor,Minor,Surgical,Private Health Insurance,Self-Pay,,,,false,45085.18,9631.85
New York City,Bronx,7000001,001178,BronxCare Hospital Center,30 to 49,104,F,Other Race,Spanish/Hispanic,2,Elective,Home or Self Care,2018,NEO073,BENIGN NEOPLASMS,FRS001,HYSTERECTOMY,519,UTERINE & ADNEXA PROCEDURES FOR LEIOMYOMA,13,DISEASES AND DISORDERS OF THE FEMALE REPRODUCTIVE SYSTEM,1,Minor,Minor,Surgical,Blue Cross/Blue Shield,,,,,false,11820.15,13413.55
New York City,Queens,7003001,001628,Flushing Hospital Medical Center,50 to 69,114,F,Black/African American,Not Span/Hispanic,2,Elective,Home or Self Care,2018,NEO073,BENIGN NEOPLASMS,FRS001,HYSTERECTOMY,519,UTERINE & ADNEXA PROCEDURES FOR LEIOMYOMA,13,DISEASES AND DISORDERS OF THE FEMALE REPRODUCTIVE SYSTEM,1,Minor,Minor,Surgical,Private Health Insurance,,,,,false,13715.53,10163.82
New York City,Kings,7001021,001306,New York - Presbyterian Brooklyn Methodist Hospital,30 to 49,112,F,Black/African American,Not Span/Hispanic,3,Elective,Home or Self Care,2018,NEO073,BENIGN NEOPLASMS,FRS001,HYSTERECTOMY,519,UTERINE & ADNEXA PROCEDURES FOR LEIOMYOMA,13,DISEASES AND DISORDERS OF THE FEMALE REPRODUCTIVE SYSTEM,2,Moderate,Minor,Surgical,Blue Cross/Blue Shield,Self-Pay,,,,false,34684.58,13550.53
Long Island,Nassau,2909000,000513,Mercy Hospital,50 to 69,115,F,White,Not Span/Hispanic,2,Elective,Home or Self Care,2018,NEO073,BENIGN NEOPLASMS,FRS003,SALPINGECTOMY,519,UTERINE & ADNEXA PROCEDURES FOR LEIOMYOMA,13,DISEASES AND DISORDERS OF THE FEMALE REPRODUCTIVE SYSTEM,1,Minor,Minor,Surgical,Private Health Insurance,Medicare,,,,false,32889.04,7799.18
New York City,Manhattan,7002017,001450,Lenox Hill Hospital,30 to 49,114,F,Black/African American,Not Span/Hispanic,2,Elective,Home or Self Care,2018,NEO073,BENIGN NEOPLASMS,FRS001,HYSTERECTOMY,519,UTERINE & ADNEXA PROCEDURES FOR LEIOMYOMA,13,DISEASES AND DISORDERS OF THE FEMALE REPRODUCTIVE SYSTEM,1,Minor,Minor,Surgical,Private Health Insurance,,,,,false,40493.14,11028.07
Long Island,Nassau,2952005,000552,Plainview Hospital,30 to 49,113,F,White,Not Span/Hispanic,2,Elective,Home or Self Care,2018,NEO073,BENIGN NEOPLASMS,FRS015,"FEMALE REPRODUCTIVE SYSTEM PROCEDURES, NEC",519,UTERINE & ADNEXA PROCEDURES FOR LEIOMYOMA,13,DISEASES AND DISORDERS OF THE FEMALE REPRODUCTIVE SYSTEM,1,Minor,Minor,Surgical,Medicaid,Medicaid,,,,false,29785.68,15694.76
New York City,Manhattan,7002017,001450,Lenox Hill Hospital,30 to 49,104,F,Other Race,Not Span/Hispanic,2,Elective,Home or Self Care,2018,NEO073,BENIGN NEOPLASMS,FRS010,FEMALE UPPER GENITAL TRACT EXCISION,519,UTERINE & ADNEXA PROCEDURES FOR LEIOMYOMA,13,DISEASES AND DISORDERS OF THE FEMALE REPRODUCTIVE SYSTEM,1,Minor,Minor,Surgical,Private Health Insurance,,,,,false,41489.53,11438.62
New York City,Queens,7003004,001638,Long Island Jewish Forest Hills,30 to 49,112,F,Black/African American,Not Span/Hispanic,2,Elective,Home or Self Care,2018,NEO073,BENIGN NEOPLASMS,FRS010,FEMALE UPPER GENITAL TRACT EXCISION,519,UTERINE & ADNEXA PROCEDURES FOR LEIOMYOMA,13,DISEASES AND DISORDERS OF THE FEMALE REPRODUCTIVE SYSTEM,2,Moderate,Minor,Surgical,Private Health Insurance,,,,,false,40592.57,9077.43
New York City,Queens,7003004,001638,Long Island Jewish Forest Hills,30 to 49,113,F,Other Race,Not Span/Hispanic,1,Urgent,Home or Self Care,2018,NEO073,BENIGN NEOPLASMS,FRS003,SALPINGECTOMY,519,UTERINE & ADNEXA PROCEDURES FOR LEIOMYOMA,13,DISEASES AND DISORDERS OF THE FEMALE REPRODUCTIVE SYSTEM,1,Minor,Minor,Surgical,Private Health Insurance,,,,,false,30727.62,6874.54
New York City,Queens,7003004,001638,Long Island Jewish Forest Hills,30 to 49,113,F,Other Race,Not Span/Hispanic,1,Urgent,Home or Self Care,2018,NEO073,BENIGN NEOPLASMS,FRS010,FEMALE UPPER GENITAL TRACT EXCISION,519,UTERINE & ADNEXA PROCEDURES FOR LEIOMYOMA,13,DISEASES AND DISORDERS OF THE FEMALE REPRODUCTIVE SYSTEM,1,Minor,Minor,Surgical,Medicaid,,,,,false,29377.55,6938.12
New York City,Queens,7003004,001638,Long Island Jewish Forest Hills,30 to 49,113,F,Other Race,Spanish/Hispanic,2,Elective,Home or Self Care,2018,NEO073,BENIGN NEOPLASMS,FRS001,HYSTERECTOMY,519,UTERINE & ADNEXA PROCEDURES FOR LEIOMYOMA,13,DISEASES AND DISORDERS OF THE FEMALE REPRODUCTIVE SYSTEM,1,Minor,Minor,Surgical,Blue Cross/Blue Shield,,,,,false,36506.59,7863.43
Long Island,Nassau,2951001,000541,North Shore University Hospital,30 to 49,115,F,Black/African American,Not Span/Hispanic,2,Elective,Home or Self Care,2018,NEO073,BENIGN NEOPLASMS,FRS010,FEMALE UPPER GENITAL TRACT EXCISION,519,UTERINE & ADNEXA PROCEDURES FOR LEIOMYOMA,13,DISEASES AND DISORDERS OF THE FEMALE REPRODUCTIVE SYSTEM,2,Moderate,Minor,Surgical,Blue Cross/Blue Shield,,,,,false,54275.46,13084.47
New York City,Bronx,7000006,001169,Montefiore Medical Center - Henry & Lucy Moses Div,30 to 49,104,F,Black/African American,Not Span/Hispanic,1,Emergency,Home or Self Care,2018,NEO073,BENIGN NEOPLASMS,FRS010,FEMALE UPPER GENITAL TRACT EXCISION,519,UTERINE & ADNEXA PROCEDURES FOR LEIOMYOMA,13,DISEASES AND DISORDERS OF THE FEMALE REPRODUCTIVE SYSTEM,2,Moderate,Minor,Surgical,Private Health Insurance,,,,,false,54628.16,12316.31
Southern Tier,Broome,0301001,000043,Our Lady of Lourdes Memorial Hospital,50 to 69,137,F,Other Race,Not Span/Hispanic,3,Elective,Home or Self Care,2018,NEO073,BENIGN NEOPLASMS,FRS001,HYSTERECTOMY,519,UTERINE & ADNEXA PROCEDURES FOR LEIOMYOMA,13,DISEASES AND DISORDERS OF THE FEMALE REPRODUCTIVE SYSTEM,2,Moderate,Minor,Surgical,Blue Cross/Blue Shield,Blue Cross/Blue Shield,Self-Pay,,,false,32085.9,12998.66
Long Island,Nassau,2951001,000541,North Shore University Hospital,50 to 69,114,F,Black/African American,Not Span/Hispanic,1,Elective,Home or Self Care,2018,NEO073,BENIGN NEOPLASMS,FRS001,HYSTERECTOMY,519,UTERINE & ADNEXA PROCEDURES FOR LEIOMYOMA,13,DISEASES AND DISORDERS OF THE FEMALE REPRODUCTIVE SYSTEM,1,Minor,Minor,Surgical,Medicaid,Medicaid,,,,false,38599.04,10789.65
Long Island,Suffolk,5154001,000925,Good Samaritan Hospital Medical Center,30 to 49,,F,Other Race,Not Span/Hispanic,2,Elective,Home or Self Care,2018,NEO073,BENIGN NEOPLASMS,FRS010,FEMALE UPPER GENITAL TRACT EXCISION,519,UTERINE & ADNEXA PROCEDURES FOR LEIOMYOMA,13,DISEASES AND DISORDERS OF THE FEMALE REPRODUCTIVE SYSTEM,1,Minor,Minor,Surgical,Private Health Insurance,,,,,false,56397.68,11163.12
New York City,Bronx,7000006,001169,Montefiore Medical Center - Henry & Lucy Moses Div,30 to 49,104,F,Black/African American,Not Span/Hispanic,3,Elective,Home or Self Care,2018,NEO073,BENIGN NEOPLASMS,FRS001,HYSTERECTOMY,519,UTERINE & ADNEXA PROCEDURES FOR LEIOMYOMA,13,DISEASES AND DISORDERS OF THE FEMALE REPRODUCTIVE SYSTEM,2,Moderate,Minor,Surgical,Blue Cross/Blue Shield,,,,,false,55550.02,11147.37
Long Island,Nassau,2908000,000511,NYU Langone Hospital-Long Island,50 to 69,115,F,White,Spanish/Hispanic,2,Elective,Home or Self Care,2018,NEO073,BENIGN NEOPLASMS,FRS001,HYSTERECTOMY,519,UTERINE & ADNEXA PROCEDURES FOR LEIOMYOMA,13,DISEASES AND DISORDERS OF THE FEMALE REPRODUCTIVE SYSTEM,1,Minor,Minor,Surgical,Private Health Insurance,,,,,false,60247.37,17074.2
Long Island,Nassau,2952005,000552,Plainview Hospital,70 or Older,117,F,White,Not Span/Hispanic,2,Elective,Home or Self Care,2018,NEO073,BENIGN NEOPLASMS,FRS001,HYSTERECTOMY,519,UTERINE & ADNEXA PROCEDURES FOR LEIOMYOMA,13,DISEASES AND DISORDERS OF THE FEMALE REPRODUCTIVE SYSTEM,1,Minor,Minor,Surgical,Medicare,Blue Cross/Blue Shield,,,,false,22681.59,11707.5
New York City,Manhattan,7002054,001464,New York-Presbyterian Hospital - Columbia Presbyterian Center,30 to 49,100,F,Other Race,Not Span/Hispanic,2,Elective,Home or Self Care,2018,NEO073,BENIGN NEOPLASMS,FRS010,FEMALE UPPER GENITAL TRACT EXCISION,519,UTERINE & ADNEXA PROCEDURES FOR LEIOMYOMA,13,DISEASES AND DISORDERS OF THE FEMALE REPRODUCTIVE SYSTEM,1,Minor,Minor,Surgical,Blue Cross/Blue Shield,Self-Pay,,,,false,19726.51,4167.64
Long Island,Nassau,2908000,000511,NYU Langone Hospital-Long Island,30 to 49,115,F,Black/African American,Not Span/Hispanic,2,Urgent,Home or Self Care,2018,NEO073,BENIGN NEOPLASMS,FRS010,FEMALE UPPER GENITAL TRACT EXCISION,519,UTERINE & ADNEXA PROCEDURES FOR LEIOMYOMA,13,DISEASES AND DISORDERS OF THE FEMALE REPRODUCTIVE SYSTEM,1,Minor,Minor,Surgical,Medicaid,Medicaid,,,,false,83340.34,23077.38
New York City,Kings,7001021,001306,New York - Presbyterian Brooklyn Methodist Hospital,50 to 69,112,F,Black/African American,Not Span/Hispanic,5,Emergency,Home or Self Care,2018,NEO073,BENIGN NEOPLASMS,FRS001,HYSTERECTOMY,519,UTERINE & ADNEXA PROCEDURES FOR LEIOMYOMA,13,DISEASES AND DISORDERS OF THE FEMALE REPRODUCTIVE SYSTEM,2,Moderate,Minor,Surgical,Private Health Insurance,Medicaid,Self-Pay,,,true,49818.38,18717.33
New York City,Bronx,7000006,001169,Montefiore Medical Center - Henry & Lucy Moses Div,50 to 69,104,F,Black/African American,Not Span/Hispanic,1,Emergency,Home or Self Care,2018,NEO073,BENIGN NEOPLASMS,FRS001,HYSTERECTOMY,519,UTERINE & ADNEXA PROCEDURES FOR LEIOMYOMA,13,DISEASES AND DISORDERS OF THE FEMALE REPRODUCTIVE SYSTEM,2,Moderate,Minor,Surgical,Private Health Insurance,,,,,false,39405.73,7683.77
Hudson Valley,Orange,3523000,000699,Garnet Health Medical Center,50 to 69,109,F,White,Not Span/Hispanic,1,Elective,Home or Self Care,2018,NEO073,BENIGN NEOPLASMS,FRS001,HYSTERECTOMY,519,UTERINE & ADNEXA PROCEDURES FOR LEIOMYOMA,13,DISEASES AND DISORDERS OF THE FEMALE REPRODUCTIVE SYSTEM,1,Minor,Minor,Surgical,Blue Cross/Blue Shield,,,,,false,22364.46,8102.84
New York City,Bronx,7000006,003058,Montefiore Med Center - Jack D Weiler Hosp of A Einstein College Div,30 to 49,104,F,Other Race,Not Span/Hispanic,2,Elective,Home or Self Care,2018,NEO073,BENIGN NEOPLASMS,FRS001,HYSTERECTOMY,519,UTERINE & ADNEXA PROCEDURES FOR LEIOMYOMA,13,DISEASES AND DISORDERS OF THE FEMALE REPRODUCTIVE SYSTEM,2,Moderate,Minor,Surgical,Private Health Insurance,,,,,false,47832.6,10247.96
Hudson Valley,Westchester,5907001,001097,SJRH - St Johns Division,30 to 49,104,F,Black/African American,Not Span/Hispanic,2,Emergency,Home or Self Care,2018,NEO073,BENIGN NEOPLASMS,FRS010,FEMALE UPPER GENITAL TRACT EXCISION,519,UTERINE & ADNEXA PROCEDURES FOR LEIOMYOMA,13,DISEASES AND DISORDERS OF THE FEMALE REPRODUCTIVE SYSTEM,1,Minor,Minor,Surgical,Medicaid,,,,,false,20584.26,8572.04
New York City,Manhattan,7002053,001463,NYU Langone Hospitals,30 to 49,112,F,Other Race,Unknown,3,Elective,Home or Self Care,2018,NEO073,BENIGN NEOPLASMS,FRS001,HYSTERECTOMY,519,UTERINE & ADNEXA PROCEDURES FOR LEIOMYOMA,13,DISEASES AND DISORDERS OF THE FEMALE REPRODUCTIVE SYSTEM,2,Moderate,Minor,Surgical,Blue Cross/Blue Shield,,,,,false,93951.2,18274.1
Long Island,Nassau,2951001,000541,North Shore University Hospital,30 to 49,115,F,White,Not Span/Hispanic,2,Elective,Home or Self Care,2018,NEO073,BENIGN NEOPLASMS,FRS001,HYSTERECTOMY,519,UTERINE & ADNEXA PROCEDURES FOR LEIOMYOMA,13,DISEASES AND DISORDERS OF THE FEMALE REPRODUCTIVE SYSTEM,1,Minor,Minor,Surgical,Private Health Insurance,,,,,false,36108.96,8728.23
New York City,Bronx,7000006,003058,Montefiore Med Center - Jack D Weiler Hosp of A Einstein College Div,30 to 49,104,F,Black/African American,Not Span/Hispanic,2,Elective,Home or Self Care,2018,NEO073,BENIGN NEOPLASMS,FRS010,FEMALE UPPER GENITAL TRACT EXCISION,519,UTERINE & ADNEXA PROCEDURES FOR LEIOMYOMA,13,DISEASES AND DISORDERS OF THE FEMALE REPRODUCTIVE SYSTEM,1,Minor,Minor,Surgical,Private Health Insurance,,,,,false,49175.32,11949.4
New York City,Manhattan,7002024,001456,Mount Sinai Hospital,30 to 49,OOS,F,Other Race,Spanish/Hispanic,1,Elective,Home or Self Care,2018,NEO073,BENIGN NEOPLASMS,FRS010,FEMALE UPPER GENITAL TRACT EXCISION,519,UTERINE & ADNEXA PROCEDURES FOR LEIOMYOMA,13,DISEASES AND DISORDERS OF THE FEMALE REPRODUCTIVE SYSTEM,1,Minor,Minor,Surgical,Private Health Insurance,Self-Pay,,,,false,27599.84,9810.06