Hospital Service Area,Hospital County,Operating Certificate Number,Permanent Facility Id,Facility Name,Age Group,Zip Code - 3 digits,Gender,Race,Ethnicity,Length of Stay,Type of Admission,Patient Disposition,Discharge Year,CCS Diagnosis Code,CCS Diagnosis Description,CCS Procedure Code,CCS Procedure Description,APR DRG Code,APR DRG Description,APR MDC Code,APR MDC Description,APR Severity of Illness Code,APR Severity of Illness Description,APR Risk of Mortality,APR Medical Surgical Description,Payment Typology 1,Payment Typology 2,Payment Typology 3,Birth Weight,Abortion Edit Indicator,Emergency Department Indicator,Total Charges,Total Costs
New York City,Kings,7002053,001304,NYU Langone Hospital-Brooklyn,30 to 49,112,F,Other Race,Spanish/Hispanic,2,Elective,Home or Self Care,2019,NEO073,BENIGN NEOPLASMS,FRS010,FEMALE UPPER GENITAL TRACT EXCISION,519,UTERINE & ADNEXA PROCEDURES FOR LEIOMYOMA,13,DISEASES AND DISORDERS OF THE FEMALE REPRODUCTIVE SYSTEM,2,Moderate,Minor,Surgical,Blue Cross/Blue Shield,,,,,false,64787.27,12967.79
New York City,Kings,7002053,001304,NYU Langone Hospital-Brooklyn,30 to 49,112,F,Other Race,Not Span/Hispanic,3,Elective,Home or Self Care,2019,NEO073,BENIGN NEOPLASMS,FRS010,FEMALE UPPER GENITAL TRACT EXCISION,519,UTERINE & ADNEXA PROCEDURES FOR LEIOMYOMA,13,DISEASES AND DISORDERS OF THE FEMALE REPRODUCTIVE SYSTEM,1,Minor,Minor,Surgical,Medicaid,,,,,false,75758.88,18301.97
New York City,Kings,7002053,001304,NYU Langone Hospital-Brooklyn,30 to 49,,F,Other Race,Unknown,4,Emergency,Home or Self Care,2019,NEO073,BENIGN NEOPLASMS,FRS010,FEMALE UPPER GENITAL TRACT EXCISION,519,UTERINE & ADNEXA PROCEDURES FOR LEIOMYOMA,13,DISEASES AND DISORDERS OF THE FEMALE REPRODUCTIVE SYSTEM,2,Moderate,Minor,Surgical,Medicaid,,,,,true,76117.92,18529.91
New York City,Kings,7002053,001304,NYU Langone Hospital-Brooklyn,30 to 49,112,F,Black/African American,Not Span/Hispanic,2,Emergency,Home or Self Care,2019,NEO073,BENIGN NEOPLASMS,FRS010,FEMALE UPPER GENITAL TRACT EXCISION,519,UTERINE & ADNEXA PROCEDURES FOR LEIOMYOMA,13,DISEASES AND DISORDERS OF THE FEMALE REPRODUCTIVE SYSTEM,2,Moderate,Moderate,Surgical,Private Health Insurance,,,,,false,95829.43,17292.41
New York City,Kings,7002053,001304,NYU Langone Hospital-Brooklyn,30 to 49,112,F,White,Not Span/Hispanic,2,Elective,Home or Self Care,2019,NEO073,BENIGN NEOPLASMS,GNR002,ABDOMINAL WALL REPAIR (INCLUDING HERNIA),519,UTERINE & ADNEXA PROCEDURES FOR LEIOMYOMA,13,DISEASES AND DISORDERS OF THE FEMALE REPRODUCTIVE SYSTEM,1,Minor,Minor,Surgical,Private Health Insurance,,,,,false,66076.81,13115.7
New York City,Kings,7002053,001304,NYU Langone Hospital-Brooklyn,30 to 49,112,F,Black/African American,Not Span/Hispanic,1,Elective,Home or Self Care,2019,NEO073,BENIGN NEOPLASMS,FRS001,HYSTERECTOMY,519,UTERINE & ADNEXA PROCEDURES FOR LEIOMYOMA,13,DISEASES AND DISORDERS OF THE FEMALE REPRODUCTIVE SYSTEM,1,Minor,Minor,Surgical,Blue Cross/Blue Shield,,,,,false,61848.08,10634.82
New York City,Kings,7002053,001304,NYU Langone Hospital-Brooklyn,30 to 49,112,F,Black/African American,Not Span/Hispanic,1,Elective,Home or Self Care,2019,NEO073,BENIGN NEOPLASMS,FRS010,FEMALE UPPER GENITAL TRACT EXCISION,519,UTERINE & ADNEXA PROCEDURES FOR LEIOMYOMA,13,DISEASES AND DISORDERS OF THE FEMALE REPRODUCTIVE SYSTEM,2,Moderate,Minor,Surgical,Private Health Insurance,Medicaid,,,,false,58261.77,10191.19
New York City,Kings,7002053,001304,NYU Langone Hospital-Brooklyn,30 to 49,112,F,Black/African American,Spanish/Hispanic,2,Elective,Home or Self Care,2019,NEO073,BENIGN NEOPLASMS,FRS010,FEMALE UPPER GENITAL TRACT EXCISION,519,UTERINE & ADNEXA PROCEDURES FOR LEIOMYOMA,13,DISEASES AND DISORDERS OF THE FEMALE REPRODUCTIVE SYSTEM,2,Moderate,Minor,Surgical,Medicaid,,,,,false,90287.93,16655.88
New York City,Kings,7002053,001304,NYU Langone Hospital-Brooklyn,30 to 49,112,F,Black/African American,Not Span/Hispanic,2,Elective,Home or Self Care,2019,NEO073,BENIGN NEOPLASMS,FRS001,HYSTERECTOMY,519,UTERINE & ADNEXA PROCEDURES FOR LEIOMYOMA,13,DISEASES AND DISORDERS OF THE FEMALE REPRODUCTIVE SYSTEM,2,Moderate,Minor,Surgical,Medicaid,,,,,false,66453.05,13478.62
New York City,Kings,7002053,001304,NYU Langone Hospital-Brooklyn,50 to 69,112,F,Other Race,Spanish/Hispanic,2,Emergency,Home or Self Care,2019,NEO073,BENIGN NEOPLASMS,FRS001,HYSTERECTOMY,519,UTERINE & ADNEXA PROCEDURES FOR LEIOMYOMA,13,DISEASES AND DISORDERS OF THE FEMALE REPRODUCTIVE SYSTEM,2,Moderate,Minor,Surgical,Medicaid,,,,,true,135830.68,24163.09
New York City,Kings,7002053,001304,NYU Langone Hospital-Brooklyn,30 to 49,112,F,Black/African American,Spanish/Hispanic,1,Elective,Home or Self Care,2019,NEO073,BENIGN NEOPLASMS,FRS010,FEMALE UPPER GENITAL TRACT EXCISION,519,UTERINE & ADNEXA PROCEDURES FOR LEIOMYOMA,13,DISEASES AND DISORDERS OF THE FEMALE REPRODUCTIVE SYSTEM,1,Minor,Minor,Surgical,Blue Cross/Blue Shield,,,,,false,77172.99,13492
New York City,Kings,7002053,001304,NYU Langone Hospital-Brooklyn,30 to 49,112,F,Black/African American,Not Span/Hispanic,1,Elective,Home or Self Care,2019,NEO073,BENIGN NEOPLASMS,FRS001,HYSTERECTOMY,519,UTERINE & ADNEXA PROCEDURES FOR LEIOMYOMA,13,DISEASES AND DISORDERS OF THE FEMALE REPRODUCTIVE SYSTEM,1,Minor,Minor,Surgical,Private Health Insurance,,,,,false,64522.18,11228.37
New York City,Kings,7002053,001304,NYU Langone Hospital-Brooklyn,30 to 49,103,F,Black/African American,Not Span/Hispanic,2,Elective,Home or Self Care,2019,NEO073,BENIGN NEOPLASMS,FRS001,HYSTERECTOMY,519,UTERINE & ADNEXA PROCEDURES FOR LEIOMYOMA,13,DISEASES AND DISORDERS OF THE FEMALE REPRODUCTIVE SYSTEM,2,Moderate,Minor,Surgical,Private Health Insurance,,,,,false,68440.56,13362.18
New York City,Kings,7002053,001304,NYU Langone Hospital-Brooklyn,50 to 69,112,F,Black/African American,Not Span/Hispanic,2,Elective,Home or Self Care,2019,NEO073,BENIGN NEOPLASMS,FRS001,HYSTERECTOMY,519,UTERINE & ADNEXA PROCEDURES FOR LEIOMYOMA,13,DISEASES AND DISORDERS OF THE FEMALE REPRODUCTIVE SYSTEM,1,Minor,Minor,Surgical,Medicaid,,,,,false,69076.25,14309.83
New York City,Kings,7002053,001304,NYU Langone Hospital-Brooklyn,30 to 49,113,F,Black/African American,Not Span/Hispanic,2,Elective,Home or Self Care,2019,NEO073,BENIGN NEOPLASMS,FRS010,FEMALE UPPER GENITAL TRACT EXCISION,519,UTERINE & ADNEXA PROCEDURES FOR LEIOMYOMA,13,DISEASES AND DISORDERS OF THE FEMALE REPRODUCTIVE SYSTEM,2,Moderate,Minor,Surgical,Medicaid,,,,,false,84911.26,15691.69
New York City,Kings,7002053,001304,NYU Langone Hospital-Brooklyn,18 to 29,112,F,Black/African American,Not Span/Hispanic,1,Elective,Home or Self Care,2019,NEO073,BENIGN NEOPLASMS,FRS010,FEMALE UPPER GENITAL TRACT EXCISION,519,UTERINE & ADNEXA PROCEDURES FOR LEIOMYOMA,13,DISEASES AND DISORDERS OF THE FEMALE REPRODUCTIVE SYSTEM,1,Minor,Minor,Surgical,Blue Cross/Blue Shield,,,,,false,58079.89,10066.23
New York City,Kings,7002053,001304,NYU Langone Hospital-Brooklyn,30 to 49,112,F,Black/African American,Not Span/Hispanic,1,Elective,Home or Self Care,2019,NEO073,BENIGN NEOPLASMS,FRS010,FEMALE UPPER GENITAL TRACT EXCISION,519,UTERINE & ADNEXA PROCEDURES FOR LEIOMYOMA,13,DISEASES AND DISORDERS OF THE FEMALE REPRODUCTIVE SYSTEM,1,Minor,Minor,Surgical,Medicaid,,,,,false,51985.14,9120.93
New York City,Kings,7002053,001304,NYU Langone Hospital-Brooklyn,30 to 49,112,F,Black/African American,Not Span/Hispanic,2,Elective,Home or Self Care,2019,NEO073,BENIGN NEOPLASMS,FRS010,FEMALE UPPER GENITAL TRACT EXCISION,519,UTERINE & ADNEXA PROCEDURES FOR LEIOMYOMA,13,DISEASES AND DISORDERS OF THE FEMALE REPRODUCTIVE SYSTEM,2,Moderate,Minor,Surgical,Blue Cross/Blue Shield,,,,,false,73463.55,14075.69
New York City,Kings,7002053,001304,NYU Langone Hospital-Brooklyn,50 to 69,112,F,Black/African American,Not Span/Hispanic,2,Elective,Home or Self Care,2019,NEO073,BENIGN NEOPLASMS,FRS001,HYSTERECTOMY,519,UTERINE & ADNEXA PROCEDURES FOR LEIOMYOMA,13,DISEASES AND DISORDERS OF THE FEMALE REPRODUCTIVE SYSTEM,1,Minor,Minor,Surgical,Private Health Insurance,,,,,false,62287.45,12675.02
New York City,Kings,7002053,001304,NYU Langone Hospital-Brooklyn,18 to 29,113,F,Other Race,Not Span/Hispanic,1,Elective,Home or Self Care,2019,NEO073,BENIGN NEOPLASMS,FRS010,FEMALE UPPER GENITAL TRACT EXCISION,519,UTERINE & ADNEXA PROCEDURES FOR LEIOMYOMA,13,DISEASES AND DISORDERS OF THE FEMALE REPRODUCTIVE SYSTEM,1,Minor,Minor,Surgical,Medicaid,,,,,false,47589.66,8429.49
New York City,Kings,7002053,001304,NYU Langone Hospital-Brooklyn,30 to 49,112,F,Black/African American,Not Span/Hispanic,1,Elective,Home or Self Care,2019,NEO073,BENIGN NEOPLASMS,FRS001,HYSTERECTOMY,519,UTERINE & ADNEXA PROCEDURES FOR LEIOMYOMA,13,DISEASES AND DISORDERS OF THE FEMALE REPRODUCTIVE SYSTEM,1,Minor,Minor,Surgical,Private Health Insurance,,,,,false,42310.59,7807.9
New York City,Kings,7002053,001304,NYU Langone Hospital-Brooklyn,30 to 49,117,F,White,Not Span/Hispanic,2,Elective,Home or Self Care,2019,NEO073,BENIGN NEOPLASMS,FRS010,FEMALE UPPER GENITAL TRACT EXCISION,519,UTERINE & ADNEXA PROCEDURES FOR LEIOMYOMA,13,DISEASES AND DISORDERS OF THE FEMALE REPRODUCTIVE SYSTEM,1,Minor,Minor,Surgical,Private Health Insurance,,,,,false,67262.48,13254.84
New York City,Kings,7002053,001304,NYU Langone Hospital-Brooklyn,30 to 49,112,F,Black/African American,Not Span/Hispanic,2,Elective,Home or Self Care,2019,NEO073,BENIGN NEOPLASMS,FRS010,FEMALE UPPER GENITAL TRACT EXCISION,519,UTERINE & ADNEXA PROCEDURES FOR LEIOMYOMA,13,DISEASES AND DISORDERS OF THE FEMALE REPRODUCTIVE SYSTEM,1,Minor,Minor,Surgical,Private Health Insurance,,,,,false,64619.1,12831.58
New York City,Kings,7002053,001304,NYU Langone Hospital-Brooklyn,50 to 69,103,F,White,Not Span/Hispanic,2,Elective,Home or Self Care,2019,NEO073,BENIGN NEOPLASMS,FRS001,HYSTERECTOMY,519,UTERINE & ADNEXA PROCEDURES FOR LEIOMYOMA,13,DISEASES AND DISORDERS OF THE FEMALE REPRODUCTIVE SYSTEM,1,Minor,Minor,Surgical,Medicaid,,,,,false,124402.83,22002.28
New York City,Kings,7002053,001304,NYU Langone Hospital-Brooklyn,30 to 49,114,F,Black/African American,Not Span/Hispanic,2,Urgent,Home or Self Care,2019,NEO073,BENIGN NEOPLASMS,FRS010,FEMALE UPPER GENITAL TRACT EXCISION,519,UTERINE & ADNEXA PROCEDURES FOR LEIOMYOMA,13,DISEASES AND DISORDERS OF THE FEMALE REPRODUCTIVE SYSTEM,1,Minor,Minor,Surgical,Medicaid,,,,,false,41450.02,9704.02
New York City,Kings,7002053,001304,NYU Langone Hospital-Brooklyn,50 to 69,104,F,Other Race,Spanish/Hispanic,2,Elective,Home or Self Care,2019,NEO073,BENIGN NEOPLASMS,FRS001,HYSTERECTOMY,519,UTERINE & ADNEXA PROCEDURES FOR LEIOMYOMA,13,DISEASES AND DISORDERS OF THE FEMALE REPRODUCTIVE SYSTEM,2,Moderate,Minor,Surgical,Private Health Insurance,,,,,false,62398.43,12647.94
New York City,Kings,7002053,001304,NYU Langone Hospital-Brooklyn,30 to 49,112,F,Black/African American,Not Span/Hispanic,2,Emergency,Home or Self Care,2019,NEO073,BENIGN NEOPLASMS,FRS010,FEMALE UPPER GENITAL TRACT EXCISION,519,UTERINE & ADNEXA PROCEDURES FOR LEIOMYOMA,13,DISEASES AND DISORDERS OF THE FEMALE REPRODUCTIVE SYSTEM,2,Moderate,Minor,Surgical,Blue Cross/Blue Shield,,,,,true,100815.88,18398.53
New York City,Kings,7002053,001304,NYU Langone Hospital-Brooklyn,30 to 49,112,F,Black/African American,Spanish/Hispanic,1,Elective,Home or Self Care,2019,NEO073,BENIGN NEOPLASMS,FRS010,FEMALE UPPER GENITAL TRACT EXCISION,519,UTERINE & ADNEXA PROCEDURES FOR LEIOMYOMA,13,DISEASES AND DISORDERS OF THE FEMALE REPRODUCTIVE SYSTEM,1,Minor,Minor,Surgical,Medicaid,,,,,false,54417.06,9405.91
New York City,Kings,7002053,001304,NYU Langone Hospital-Brooklyn,30 to 49,112,F,Black/African American,Not Span/Hispanic,1,Elective,Home or Self Care,2019,NEO073,BENIGN NEOPLASMS,FRS001,HYSTERECTOMY,519,UTERINE & ADNEXA PROCEDURES FOR LEIOMYOMA,13,DISEASES AND DISORDERS OF THE FEMALE REPRODUCTIVE SYSTEM,1,Minor,Minor,Surgical,Blue Cross/Blue Shield,,,,,false,78487.42,12841.76
New York City,Kings,7002053,001304,NYU Langone Hospital-Brooklyn,30 to 49,112,F,Other Race,Spanish/Hispanic,2,Emergency,Home or Self Care,2019,NEO073,BENIGN NEOPLASMS,FRS010,FEMALE UPPER GENITAL TRACT EXCISION,519,UTERINE & ADNEXA PROCEDURES FOR LEIOMYOMA,13,DISEASES AND DISORDERS OF THE FEMALE REPRODUCTIVE SYSTEM,1,Minor,Minor,Surgical,Medicaid,,,,,false,62000.37,12298.97
New York City,Kings,7002053,001304,NYU Langone Hospital-Brooklyn,30 to 49,103,F,White,Not Span/Hispanic,1,Elective,Home or Self Care,2019,NEO073,BENIGN NEOPLASMS,FRS010,FEMALE UPPER GENITAL TRACT EXCISION,519,UTERINE & ADNEXA PROCEDURES FOR LEIOMYOMA,13,DISEASES AND DISORDERS OF THE FEMALE REPRODUCTIVE SYSTEM,2,Moderate,Minor,Surgical,Private Health Insurance,,,,,false,56584.73,9908.09
New York City,Kings,7002053,001304,NYU Langone Hospital-Brooklyn,30 to 49,112,F,Black/African American,Not Span/Hispanic,2,Elective,Home or Self Care,2019,NEO073,BENIGN NEOPLASMS,FRS001,HYSTERECTOMY,519,UTERINE & ADNEXA PROCEDURES FOR LEIOMYOMA,13,DISEASES AND DISORDERS OF THE FEMALE REPRODUCTIVE SYSTEM,1,Minor,Minor,Surgical,Private Health Insurance,,,,,false,65615.41,13358.43
New York City,Kings,7002053,001304,NYU Langone Hospital-Brooklyn,18 to 29,112,F,Black/African American,Not Span/Hispanic,4,Emergency,Home or Self Care,2019,NEO073,BENIGN NEOPLASMS,FRS010,FEMALE UPPER GENITAL TRACT EXCISION,519,UTERINE & ADNEXA PROCEDURES FOR LEIOMYOMA,13,DISEASES AND DISORDERS OF THE FEMALE REPRODUCTIVE SYSTEM,2,Moderate,Minor,Surgical,Medicaid,,,,,true,102152.97,23294.17
New York City,Kings,7002053,001304,NYU Langone Hospital-Brooklyn,30 to 49,112,F,Other Race,Spanish/Hispanic,3,Elective,Home or Self Care,2019,NEO073,BENIGN NEOPLASMS,FRS001,HYSTERECTOMY,519,UTERINE & ADNEXA PROCEDURES FOR LEIOMYOMA,13,DISEASES AND DISORDERS OF THE FEMALE REPRODUCTIVE SYSTEM,2,Moderate,Minor,Surgical,Medicaid,,,,,false,64498.87,14488.07
New York City,Kings,7002053,001304,NYU Langone Hospital-Brooklyn,30 to 49,112,F,Black/African American,Not Span/Hispanic,5,Emergency,Home w/ Home Health Services,2019,NEO073,BENIGN NEOPLASMS,FRS001,HYSTERECTOMY,519,UTERINE & ADNEXA PROCEDURES FOR LEIOMYOMA,13,DISEASES AND DISORDERS OF THE FEMALE REPRODUCTIVE SYSTEM,2,Moderate,Minor,Surgical,Medicare,Medicaid,,,,true,119082.82,26717.16
New York City,Kings,7002053,001304,NYU Langone Hospital-Brooklyn,30 to 49,112,F,Black/African American,Not Span/Hispanic,2,Elective,Home or Self Care,2019,NEO073,BENIGN NEOPLASMS,FRS001,HYSTERECTOMY,519,UTERINE & ADNEXA PROCEDURES FOR LEIOMYOMA,13,DISEASES AND DISORDERS OF THE FEMALE REPRODUCTIVE SYSTEM,1,Minor,Minor,Surgical,Private Health Insurance,,,,,false,56226.99,12033.42
New York City,Kings,7002053,001304,NYU Langone Hospital-Brooklyn,30 to 49,112,F,Black/African American,Not Span/Hispanic,1,Elective,Home or Self Care,2019,NEO073,BENIGN NEOPLASMS,FRS010,FEMALE UPPER GENITAL TRACT EXCISION,519,UTERINE & ADNEXA PROCEDURES FOR LEIOMYOMA,13,DISEASES AND DISORDERS OF THE FEMALE REPRODUCTIVE SYSTEM,1,Minor,Minor,Surgical,Private Health Insurance,,,,,false,142621.74,26433.64
New York City,Kings,7002053,001304,NYU Langone Hospital-Brooklyn,70 or Older,112,F,White,Not Span/Hispanic,2,Elective,Home or Self Care,2019,NEO073,BENIGN NEOPLASMS,FRS001,HYSTERECTOMY,519,UTERINE & ADNEXA PROCEDURES FOR LEIOMYOMA,13,DISEASES AND DISORDERS OF THE FEMALE REPRODUCTIVE SYSTEM,1,Minor,Minor,Surgical,Medicare,Blue Cross/Blue Shield,,,,false,83626.48,15329.39
New York City,Kings,7002053,001304,NYU Langone Hospital-Brooklyn,30 to 49,103,F,Black/African American,Not Span/Hispanic,1,Elective,Home or Self Care,2019,NEO073,BENIGN NEOPLASMS,FRS001,HYSTERECTOMY,519,UTERINE & ADNEXA PROCEDURES FOR LEIOMYOMA,13,DISEASES AND DISORDERS OF THE FEMALE REPRODUCTIVE SYSTEM,1,Minor,Minor,Surgical,Blue Cross/Blue Shield,,,,,false,92371.84,15084.13
New York City,Kings,7002053,001304,NYU Langone Hospital-Brooklyn,30 to 49,112,F,White,Not Span/Hispanic,1,Elective,Home or Self Care,2019,NEO073,BENIGN NEOPLASMS,FRS010,FEMALE UPPER GENITAL TRACT EXCISION,519,UTERINE & ADNEXA PROCEDURES FOR LEIOMYOMA,13,DISEASES AND DISORDERS OF THE FEMALE REPRODUCTIVE SYSTEM,1,Minor,Minor,Surgical,Medicaid,,,,,false,59576.53,9594.54
New York City,Kings,7002053,001304,NYU Langone Hospital-Brooklyn,30 to 49,104,F,Other Race,Spanish/Hispanic,1,Elective,Home or Self Care,2019,NEO073,BENIGN NEOPLASMS,FRS001,HYSTERECTOMY,519,UTERINE & ADNEXA PROCEDURES FOR LEIOMYOMA,13,DISEASES AND DISORDERS OF THE FEMALE REPRODUCTIVE SYSTEM,1,Minor,Minor,Surgical,Medicaid,,,,,false,68882.83,11671.29
New York City,Kings,7002053,001304,NYU Langone Hospital-Brooklyn,30 to 49,112,F,White,Spanish/Hispanic,1,Emergency,Home or Self Care,2019,NEO073,BENIGN NEOPLASMS,FRS001,HYSTERECTOMY,519,UTERINE & ADNEXA PROCEDURES FOR LEIOMYOMA,13,DISEASES AND DISORDERS OF THE FEMALE REPRODUCTIVE SYSTEM,1,Minor,Minor,Surgical,Medicaid,,,,,false,92183.88,18372.23
New York City,Kings,7002053,001304,NYU Langone Hospital-Brooklyn,30 to 49,103,F,Other Race,Spanish/Hispanic,1,Elective,Home or Self Care,2019,NEO073,BENIGN NEOPLASMS,FRS010,FEMALE UPPER GENITAL TRACT EXCISION,519,UTERINE & ADNEXA PROCEDURES FOR LEIOMYOMA,13,DISEASES AND DISORDERS OF THE FEMALE REPRODUCTIVE SYSTEM,1,Minor,Minor,Surgical,Private Health Insurance,,,,,false,56282.09,10027.03
New York City,Kings,7002053,001304,NYU Langone Hospital-Brooklyn,30 to 49,114,F,Black/African American,Not Span/Hispanic,2,Elective,Home or Self Care,2019,NEO073,BENIGN NEOPLASMS,FRS010,FEMALE UPPER GENITAL TRACT EXCISION,519,UTERINE & ADNEXA PROCEDURES FOR LEIOMYOMA,13,DISEASES AND DISORDERS OF THE FEMALE REPRODUCTIVE SYSTEM,2,Moderate,Minor,Surgical,Medicaid,,,,,false,67765.62,12870.11
New York City,Kings,7002053,001304,NYU Langone Hospital-Brooklyn,30 to 49,103,F,Other Race,Spanish/Hispanic,1,Elective,Home or Self Care,2019,NEO073,BENIGN NEOPLASMS,FRS001,HYSTERECTOMY,519,UTERINE & ADNEXA PROCEDURES FOR LEIOMYOMA,13,DISEASES AND DISORDERS OF THE FEMALE REPRODUCTIVE SYSTEM,1,Minor,Minor,Surgical,Blue Cross/Blue Shield,,,,,false,67904.45,11716.22
New York City,Kings,7002053,001304,NYU Langone Hospital-Brooklyn,30 to 49,112,F,Black/African American,Not Span/Hispanic,1,Elective,Home or Self Care,2019,NEO073,BENIGN NEOPLASMS,FRS010,FEMALE UPPER GENITAL TRACT EXCISION,519,UTERINE & ADNEXA PROCEDURES FOR LEIOMYOMA,13,DISEASES AND DISORDERS OF THE FEMALE REPRODUCTIVE SYSTEM,2,Moderate,Minor,Surgical,Medicaid,,,,,false,88492.47,17798.07
New York City,Kings,7002053,001304,NYU Langone Hospital-Brooklyn,18 to 29,112,F,Other Race,Not Span/Hispanic,2,Elective,Home or Self Care,2019,NEO073,BENIGN NEOPLASMS,FRS010,FEMALE UPPER GENITAL TRACT EXCISION,519,UTERINE & ADNEXA PROCEDURES FOR LEIOMYOMA,13,DISEASES AND DISORDERS OF THE FEMALE REPRODUCTIVE SYSTEM,1,Minor,Minor,Surgical,Private Health Insurance,,,,,false,62850.5,12142.78
New York City,Kings,7002053,001304,NYU Langone Hospital-Brooklyn,30 to 49,112,F,Black/African American,Spanish/Hispanic,1,Elective,Home or Self Care,2019,NEO073,BENIGN NEOPLASMS,FRS001,HYSTERECTOMY,519,UTERINE & ADNEXA PROCEDURES FOR LEIOMYOMA,13,DISEASES AND DISORDERS OF THE FEMALE REPRODUCTIVE SYSTEM,1,Minor,Minor,Surgical,Medicaid,,,,,false,63225.37,10746.79
New York City,Kings,7002053,001304,NYU Langone Hospital-Brooklyn,30 to 49,112,F,Black/African American,Spanish/Hispanic,1,Elective,Home or Self Care,2019,NEO073,BENIGN NEOPLASMS,FRS001,HYSTERECTOMY,519,UTERINE & ADNEXA PROCEDURES FOR LEIOMYOMA,13,DISEASES AND DISORDERS OF THE FEMALE REPRODUCTIVE SYSTEM,1,Minor,Minor,Surgical,Medicaid,,,,,false,52402.01,9347.79
New York City,Kings,7002053,001304,NYU Langone Hospital-Brooklyn,30 to 49,112,F,White,Spanish/Hispanic,1,Elective,Home or Self Care,2019,NEO073,BENIGN NEOPLASMS,FRS001,HYSTERECTOMY,519,UTERINE & ADNEXA PROCEDURES FOR LEIOMYOMA,13,DISEASES AND DISORDERS OF THE FEMALE REPRODUCTIVE SYSTEM,1,Minor,Minor,Surgical,Private Health Insurance,,,,,false,60609.58,10581.8
New York City,Kings,7002053,001304,NYU Langone Hospital-Brooklyn,30 to 49,112,F,Black/African American,Not Span/Hispanic,3,Elective,Home or Self Care,2019,NEO073,BENIGN NEOPLASMS,FRS001,HYSTERECTOMY,519,UTERINE & ADNEXA PROCEDURES FOR LEIOMYOMA,13,DISEASES AND DISORDERS OF THE FEMALE REPRODUCTIVE SYSTEM,2,Moderate,Moderate,Surgical,Blue Cross/Blue Shield,,,,,false,136860.3,25812.99
New York City,Kings,7002053,001304,NYU Langone Hospital-Brooklyn,30 to 49,115,F,Black/African American,Not Span/Hispanic,2,Elective,Home or Self Care,2019,NEO073,BENIGN NEOPLASMS,FRS001,HYSTERECTOMY,519,UTERINE & ADNEXA PROCEDURES FOR LEIOMYOMA,13,DISEASES AND DISORDERS OF THE FEMALE REPRODUCTIVE SYSTEM,2,Moderate,Minor,Surgical,Private Health Insurance,,,,,false,67645.14,13404.27
New York City,Kings,7002053,001304,NYU Langone Hospital-Brooklyn,50 to 69,112,F,Other Race,Not Span/Hispanic,3,Elective,Home or Self Care,2019,NEO073,BENIGN NEOPLASMS,FRS001,HYSTERECTOMY,519,UTERINE & ADNEXA PROCEDURES FOR LEIOMYOMA,13,DISEASES AND DISORDERS OF THE FEMALE REPRODUCTIVE SYSTEM,2,Moderate,Minor,Surgical,Private Health Insurance,,,,,false,195172.54,37069.34
New York City,Kings,7002053,001304,NYU Langone Hospital-Brooklyn,50 to 69,112,F,Black/African American,Not Span/Hispanic,3,Elective,Home or Self Care,2019,NEO073,BENIGN NEOPLASMS,FRS001,HYSTERECTOMY,519,UTERINE & ADNEXA PROCEDURES FOR LEIOMYOMA,13,DISEASES AND DISORDERS OF THE FEMALE REPRODUCTIVE SYSTEM,1,Minor,Minor,Surgical,Blue Cross/Blue Shield,,,,,false,76017.75,16121.7
New York City,Kings,7002053,001304,NYU Langone Hospital-Brooklyn,30 to 49,112,F,Black/African American,Not Span/Hispanic,1,Elective,Home or Self Care,2019,NEO073,BENIGN NEOPLASMS,FRS010,FEMALE UPPER GENITAL TRACT EXCISION,519,UTERINE & ADNEXA PROCEDURES FOR LEIOMYOMA,13,DISEASES AND DISORDERS OF THE FEMALE REPRODUCTIVE SYSTEM,1,Minor,Minor,Surgical,Blue Cross/Blue Shield,,,,,false,54111.86,9553.15
New York City,Kings,7002053,001304,NYU Langone Hospital-Brooklyn,30 to 49,112,F,Multi-racial,Not Span/Hispanic,2,Elective,Home or Self Care,2019,NEO073,BENIGN NEOPLASMS,FRS010,FEMALE UPPER GENITAL TRACT EXCISION,519,UTERINE & ADNEXA PROCEDURES FOR LEIOMYOMA,13,DISEASES AND DISORDERS OF THE FEMALE REPRODUCTIVE SYSTEM,2,Moderate,Minor,Surgical,Medicaid,,,,,false,62170.61,12193.81
New York City,Kings,7002053,001304,NYU Langone Hospital-Brooklyn,30 to 49,112,F,Black/African American,Not Span/Hispanic,3,Elective,Home or Self Care,2019,NEO073,BENIGN NEOPLASMS,FRS010,FEMALE UPPER GENITAL TRACT EXCISION,519,UTERINE & ADNEXA PROCEDURES FOR LEIOMYOMA,13,DISEASES AND DISORDERS OF THE FEMALE REPRODUCTIVE SYSTEM,1,Minor,Minor,Surgical,Medicaid,,,,,false,147374.12,35092.01
New York City,Kings,7002053,001304,NYU Langone Hospital-Brooklyn,30 to 49,112,F,Black/African American,Not Span/Hispanic,1,Elective,Home or Self Care,2019,NEO073,BENIGN NEOPLASMS,FRS001,HYSTERECTOMY,519,UTERINE & ADNEXA PROCEDURES FOR LEIOMYOMA,13,DISEASES AND DISORDERS OF THE FEMALE REPRODUCTIVE SYSTEM,1,Minor,Minor,Surgical,Medicaid,,,,,false,65645.87,11314.85
New York City,Kings,7002053,001304,NYU Langone Hospital-Brooklyn,30 to 49,112,F,White,Spanish/Hispanic,1,Elective,Home or Self Care,2019,NEO073,BENIGN NEOPLASMS,FRS010,FEMALE UPPER GENITAL TRACT EXCISION,519,UTERINE & ADNEXA PROCEDURES FOR LEIOMYOMA,13,DISEASES AND DISORDERS OF THE FEMALE REPRODUCTIVE SYSTEM,1,Minor,Minor,Surgical,Private Health Insurance,,,,,false,53765.89,9073.97
New York City,Kings,7002053,001304,NYU Langone Hospital-Brooklyn,30 to 49,112,F,Black/African American,Not Span/Hispanic,1,Elective,Home or Self Care,2019,NEO073,BENIGN NEOPLASMS,FRS003,SALPINGECTOMY,519,UTERINE & ADNEXA PROCEDURES FOR LEIOMYOMA,13,DISEASES AND DISORDERS OF THE FEMALE REPRODUCTIVE SYSTEM,2,Moderate,Minor,Surgical,Private Health Insurance,,,,,false,82283.71,13433.45
New York City,Kings,7002053,001304,NYU Langone Hospital-Brooklyn,50 to 69,OOS,F,Other Race,Not Span/Hispanic,2,Elective,Home or Self Care,2019,NEO073,BENIGN NEOPLASMS,FRS001,HYSTERECTOMY,519,UTERINE & ADNEXA PROCEDURES FOR LEIOMYOMA,13,DISEASES AND DISORDERS OF THE FEMALE REPRODUCTIVE SYSTEM,1,Minor,Minor,Surgical,Private Health Insurance,,,,,false,77999.77,14521.73