Hospital Service Area,Hospital County,Operating Certificate Number,Permanent Facility Id,Facility Name,Age Group,Zip Code - 3 digits,Gender,Race,Ethnicity,Length of Stay,Type of Admission,Patient Disposition,Discharge Year,CCS Diagnosis Code,CCS Diagnosis Description,CCS Procedure Code,CCS Procedure Description,APR DRG Code,APR DRG Description,APR MDC Code,APR MDC Description,APR Severity of Illness Code,APR Severity of Illness Description,APR Risk of Mortality,APR Medical Surgical Description,Payment Typology 1,Payment Typology 2,Payment Typology 3,Birth Weight,Abortion Edit Indicator,Emergency Department Indicator,Total Charges,Total Costs
Long Island,Nassau,2908000,000511,NYU Langone Hospital-Long Island,50 to 69,115,F,Black/African American,Not Span/Hispanic,4,Elective,Home or Self Care,2019,NEO073,BENIGN NEOPLASMS,FRS001,HYSTERECTOMY,519,UTERINE & ADNEXA PROCEDURES FOR LEIOMYOMA,13,DISEASES AND DISORDERS OF THE FEMALE REPRODUCTIVE SYSTEM,2,Moderate,Minor,Surgical,Blue Cross/Blue Shield,Blue Cross/Blue Shield,,,,false,67147.81,12872.38
Long Island,Nassau,2908000,000511,NYU Langone Hospital-Long Island,30 to 49,115,F,Black/African American,Not Span/Hispanic,1,Elective,Home or Self Care,2019,NEO073,BENIGN NEOPLASMS,FRS001,HYSTERECTOMY,519,UTERINE & ADNEXA PROCEDURES FOR LEIOMYOMA,13,DISEASES AND DISORDERS OF THE FEMALE REPRODUCTIVE SYSTEM,2,Moderate,Moderate,Surgical,Blue Cross/Blue Shield,,,,,false,70056.59,19234.61
Long Island,Nassau,2908000,000511,NYU Langone Hospital-Long Island,30 to 49,117,F,Black/African American,Not Span/Hispanic,2,Elective,Home or Self Care,2019,NEO073,BENIGN NEOPLASMS,FRS010,FEMALE UPPER GENITAL TRACT EXCISION,519,UTERINE & ADNEXA PROCEDURES FOR LEIOMYOMA,13,DISEASES AND DISORDERS OF THE FEMALE REPRODUCTIVE SYSTEM,2,Moderate,Minor,Surgical,Federal/State/Local/VA,,,,,false,65683.41,18393.53
Long Island,Nassau,2908000,000511,NYU Langone Hospital-Long Island,30 to 49,115,F,Black/African American,Not Span/Hispanic,3,Elective,Home or Self Care,2019,NEO073,BENIGN NEOPLASMS,FRS010,FEMALE UPPER GENITAL TRACT EXCISION,519,UTERINE & ADNEXA PROCEDURES FOR LEIOMYOMA,13,DISEASES AND DISORDERS OF THE FEMALE REPRODUCTIVE SYSTEM,2,Moderate,Minor,Surgical,Private Health Insurance,Self-Pay,,,,false,94008.21,15901.75
Long Island,Nassau,2908000,000511,NYU Langone Hospital-Long Island,50 to 69,115,F,White,Not Span/Hispanic,2,Elective,Home or Self Care,2019,NEO073,BENIGN NEOPLASMS,FRS001,HYSTERECTOMY,519,UTERINE & ADNEXA PROCEDURES FOR LEIOMYOMA,13,DISEASES AND DISORDERS OF THE FEMALE REPRODUCTIVE SYSTEM,1,Minor,Minor,Surgical,Private Health Insurance,,,,,false,72996.6,20370.02
Long Island,Nassau,2908000,000511,NYU Langone Hospital-Long Island,50 to 69,115,F,Black/African American,Not Span/Hispanic,2,Elective,Home or Self Care,2019,NEO073,BENIGN NEOPLASMS,FRS001,HYSTERECTOMY,519,UTERINE & ADNEXA PROCEDURES FOR LEIOMYOMA,13,DISEASES AND DISORDERS OF THE FEMALE REPRODUCTIVE SYSTEM,1,Minor,Minor,Surgical,Blue Cross/Blue Shield,,,,,false,82093.18,27161.19
Long Island,Nassau,2908000,000511,NYU Langone Hospital-Long Island,50 to 69,113,F,White,Not Span/Hispanic,2,Elective,Home or Self Care,2019,NEO073,BENIGN NEOPLASMS,FRS001,HYSTERECTOMY,519,UTERINE & ADNEXA PROCEDURES FOR LEIOMYOMA,13,DISEASES AND DISORDERS OF THE FEMALE REPRODUCTIVE SYSTEM,1,Minor,Minor,Surgical,Private Health Insurance,,,,,false,54950.98,16497.51
Long Island,Nassau,2908000,000511,NYU Langone Hospital-Long Island,50 to 69,115,F,White,Not Span/Hispanic,3,Elective,Home w/ Home Health Services,2019,NEO073,BENIGN NEOPLASMS,FRS001,HYSTERECTOMY,519,UTERINE & ADNEXA PROCEDURES FOR LEIOMYOMA,13,DISEASES AND DISORDERS OF THE FEMALE REPRODUCTIVE SYSTEM,2,Moderate,Minor,Surgical,Private Health Insurance,,,,,false,108157.74,28561.62
Long Island,Nassau,2908000,000511,NYU Langone Hospital-Long Island,50 to 69,115,F,Black/African American,Not Span/Hispanic,2,Elective,Home or Self Care,2019,NEO073,BENIGN NEOPLASMS,FRS001,HYSTERECTOMY,519,UTERINE & ADNEXA PROCEDURES FOR LEIOMYOMA,13,DISEASES AND DISORDERS OF THE FEMALE REPRODUCTIVE SYSTEM,1,Minor,Minor,Surgical,Private Health Insurance,,,,,false,50748.17,8760.99
Long Island,Nassau,2908000,000511,NYU Langone Hospital-Long Island,70 or Older,114,F,Black/African American,Not Span/Hispanic,3,Elective,Home w/ Home Health Services,2019,NEO073,BENIGN NEOPLASMS,FRS001,HYSTERECTOMY,519,UTERINE & ADNEXA PROCEDURES FOR LEIOMYOMA,13,DISEASES AND DISORDERS OF THE FEMALE REPRODUCTIVE SYSTEM,1,Minor,Minor,Surgical,Medicare,Medicare,,,,false,74866.8,21414.55
Long Island,Nassau,2908000,000511,NYU Langone Hospital-Long Island,50 to 69,117,F,White,Not Span/Hispanic,1,Elective,Home or Self Care,2019,NEO073,BENIGN NEOPLASMS,FRS001,HYSTERECTOMY,519,UTERINE & ADNEXA PROCEDURES FOR LEIOMYOMA,13,DISEASES AND DISORDERS OF THE FEMALE REPRODUCTIVE SYSTEM,2,Moderate,Moderate,Surgical,Medicare,Medicare,Self-Pay,,,false,57983.47,15182.01
Long Island,Nassau,2908000,000511,NYU Langone Hospital-Long Island,30 to 49,110,F,Black/African American,Spanish/Hispanic,2,Urgent,Home or Self Care,2019,NEO073,BENIGN NEOPLASMS,FRS001,HYSTERECTOMY,519,UTERINE & ADNEXA PROCEDURES FOR LEIOMYOMA,13,DISEASES AND DISORDERS OF THE FEMALE REPRODUCTIVE SYSTEM,2,Moderate,Minor,Surgical,Blue Cross/Blue Shield,,,,,false,93982.94,24894.12
Long Island,Nassau,2908000,000511,NYU Langone Hospital-Long Island,30 to 49,115,F,White,Spanish/Hispanic,1,Elective,Home or Self Care,2019,NEO073,BENIGN NEOPLASMS,FRS001,HYSTERECTOMY,519,UTERINE & ADNEXA PROCEDURES FOR LEIOMYOMA,13,DISEASES AND DISORDERS OF THE FEMALE REPRODUCTIVE SYSTEM,1,Minor,Minor,Surgical,Federal/State/Local/VA,,,,,false,51523.81,13871.34
Long Island,Nassau,2908000,000511,NYU Langone Hospital-Long Island,30 to 49,114,F,Black/African American,Not Span/Hispanic,3,Elective,Home or Self Care,2019,NEO073,BENIGN NEOPLASMS,FRS010,FEMALE UPPER GENITAL TRACT EXCISION,519,UTERINE & ADNEXA PROCEDURES FOR LEIOMYOMA,13,DISEASES AND DISORDERS OF THE FEMALE REPRODUCTIVE SYSTEM,2,Moderate,Minor,Surgical,Private Health Insurance,,,,,false,76744.1,13294.16
Long Island,Nassau,2908000,000511,NYU Langone Hospital-Long Island,30 to 49,118,F,White,Not Span/Hispanic,2,Elective,Home or Self Care,2019,NEO073,BENIGN NEOPLASMS,FRS001,HYSTERECTOMY,519,UTERINE & ADNEXA PROCEDURES FOR LEIOMYOMA,13,DISEASES AND DISORDERS OF THE FEMALE REPRODUCTIVE SYSTEM,1,Minor,Minor,Surgical,Private Health Insurance,,,,,false,83837.46,22754.45
Long Island,Nassau,2908000,000511,NYU Langone Hospital-Long Island,30 to 49,112,F,Black/African American,Not Span/Hispanic,1,Urgent,Home or Self Care,2019,NEO073,BENIGN NEOPLASMS,FRS001,HYSTERECTOMY,519,UTERINE & ADNEXA PROCEDURES FOR LEIOMYOMA,13,DISEASES AND DISORDERS OF THE FEMALE REPRODUCTIVE SYSTEM,1,Minor,Minor,Surgical,Private Health Insurance,,,,,false,145368.09,45049.13
Long Island,Nassau,2908000,000511,NYU Langone Hospital-Long Island,30 to 49,115,F,White,Not Span/Hispanic,2,Urgent,Home or Self Care,2019,NEO073,BENIGN NEOPLASMS,FRS010,FEMALE UPPER GENITAL TRACT EXCISION,519,UTERINE & ADNEXA PROCEDURES FOR LEIOMYOMA,13,DISEASES AND DISORDERS OF THE FEMALE REPRODUCTIVE SYSTEM,1,Minor,Minor,Surgical,Private Health Insurance,,,,,false,62743.98,16545.87
Long Island,Nassau,2908000,000511,NYU Langone Hospital-Long Island,30 to 49,117,F,Black/African American,Not Span/Hispanic,2,Urgent,Home or Self Care,2019,NEO073,BENIGN NEOPLASMS,FRS001,HYSTERECTOMY,519,UTERINE & ADNEXA PROCEDURES FOR LEIOMYOMA,13,DISEASES AND DISORDERS OF THE FEMALE REPRODUCTIVE SYSTEM,2,Moderate,Minor,Surgical,Medicaid,,,,,false,80889.28,13169.72
Long Island,Nassau,2908000,000511,NYU Langone Hospital-Long Island,30 to 49,110,F,White,Not Span/Hispanic,2,Elective,Home or Self Care,2019,NEO073,BENIGN NEOPLASMS,FRS010,FEMALE UPPER GENITAL TRACT EXCISION,519,UTERINE & ADNEXA PROCEDURES FOR LEIOMYOMA,13,DISEASES AND DISORDERS OF THE FEMALE REPRODUCTIVE SYSTEM,1,Minor,Minor,Surgical,Medicaid,Medicaid,,,,false,59562.59,15641.2
Long Island,Nassau,2908000,000511,NYU Langone Hospital-Long Island,30 to 49,110,F,White,Not Span/Hispanic,2,Elective,Home or Self Care,2019,NEO073,BENIGN NEOPLASMS,FRS001,HYSTERECTOMY,519,UTERINE & ADNEXA PROCEDURES FOR LEIOMYOMA,13,DISEASES AND DISORDERS OF THE FEMALE REPRODUCTIVE SYSTEM,2,Moderate,Minor,Surgical,Blue Cross/Blue Shield,,,,,false,59862.95,16372.06
Long Island,Nassau,2908000,000511,NYU Langone Hospital-Long Island,30 to 49,115,F,Other Race,Unknown,2,Elective,Home or Self Care,2019,NEO073,BENIGN NEOPLASMS,FRS001,HYSTERECTOMY,519,UTERINE & ADNEXA PROCEDURES FOR LEIOMYOMA,13,DISEASES AND DISORDERS OF THE FEMALE REPRODUCTIVE SYSTEM,1,Minor,Minor,Surgical,Private Health Insurance,,,,,false,78802.97,22778.17
Long Island,Nassau,2908000,000511,NYU Langone Hospital-Long Island,50 to 69,115,F,White,Not Span/Hispanic,2,Elective,Home or Self Care,2019,NEO073,BENIGN NEOPLASMS,FRS001,HYSTERECTOMY,519,UTERINE & ADNEXA PROCEDURES FOR LEIOMYOMA,13,DISEASES AND DISORDERS OF THE FEMALE REPRODUCTIVE SYSTEM,1,Minor,Minor,Surgical,Private Health Insurance,,,,,false,53427.17,14944
Long Island,Nassau,2908000,000511,NYU Langone Hospital-Long Island,30 to 49,115,F,White,Not Span/Hispanic,2,Urgent,Home or Self Care,2019,NEO073,BENIGN NEOPLASMS,FRS001,HYSTERECTOMY,519,UTERINE & ADNEXA PROCEDURES FOR LEIOMYOMA,13,DISEASES AND DISORDERS OF THE FEMALE REPRODUCTIVE SYSTEM,1,Minor,Minor,Surgical,Private Health Insurance,,,,,false,85457.43,23354.9
Long Island,Nassau,2908000,000511,NYU Langone Hospital-Long Island,30 to 49,117,F,Other Race,Spanish/Hispanic,1,Elective,Home or Self Care,2019,NEO073,BENIGN NEOPLASMS,FRS001,HYSTERECTOMY,519,UTERINE & ADNEXA PROCEDURES FOR LEIOMYOMA,13,DISEASES AND DISORDERS OF THE FEMALE REPRODUCTIVE SYSTEM,1,Minor,Minor,Surgical,Blue Cross/Blue Shield,,,,,false,49355.53,7722.16
Long Island,Nassau,2908000,000511,NYU Langone Hospital-Long Island,30 to 49,115,F,Black/African American,Not Span/Hispanic,2,Elective,Home or Self Care,2019,NEO073,BENIGN NEOPLASMS,FRS010,FEMALE UPPER GENITAL TRACT EXCISION,519,UTERINE & ADNEXA PROCEDURES FOR LEIOMYOMA,13,DISEASES AND DISORDERS OF THE FEMALE REPRODUCTIVE SYSTEM,1,Minor,Minor,Surgical,Private Health Insurance,,,,,false,71935.81,19482.54
Long Island,Nassau,2908000,000511,NYU Langone Hospital-Long Island,30 to 49,113,F,White,Spanish/Hispanic,2,Elective,Home or Self Care,2019,NEO073,BENIGN NEOPLASMS,FRS001,HYSTERECTOMY,519,UTERINE & ADNEXA PROCEDURES FOR LEIOMYOMA,13,DISEASES AND DISORDERS OF THE FEMALE REPRODUCTIVE SYSTEM,2,Moderate,Moderate,Surgical,Private Health Insurance,,,,,false,54427.49,14835.24
Long Island,Nassau,2908000,000511,NYU Langone Hospital-Long Island,50 to 69,115,F,White,Not Span/Hispanic,1,Elective,Home or Self Care,2019,NEO073,BENIGN NEOPLASMS,FRS001,HYSTERECTOMY,519,UTERINE & ADNEXA PROCEDURES FOR LEIOMYOMA,13,DISEASES AND DISORDERS OF THE FEMALE REPRODUCTIVE SYSTEM,1,Minor,Minor,Surgical,Private Health Insurance,,,,,false,49792.58,7675.38
Long Island,Nassau,2908000,000511,NYU Langone Hospital-Long Island,30 to 49,115,F,Black/African American,Not Span/Hispanic,2,Elective,Home or Self Care,2019,NEO073,BENIGN NEOPLASMS,FRS001,HYSTERECTOMY,519,UTERINE & ADNEXA PROCEDURES FOR LEIOMYOMA,13,DISEASES AND DISORDERS OF THE FEMALE REPRODUCTIVE SYSTEM,1,Minor,Minor,Surgical,Blue Cross/Blue Shield,,,,,false,61464.39,10323.19
Long Island,Nassau,2908000,000511,NYU Langone Hospital-Long Island,30 to 49,115,F,Black/African American,Not Span/Hispanic,3,Elective,Home or Self Care,2019,NEO073,BENIGN NEOPLASMS,FRS001,HYSTERECTOMY,519,UTERINE & ADNEXA PROCEDURES FOR LEIOMYOMA,13,DISEASES AND DISORDERS OF THE FEMALE REPRODUCTIVE SYSTEM,1,Minor,Minor,Surgical,Blue Cross/Blue Shield,,,,,false,94409.7,22165.62
Long Island,Nassau,2908000,000511,NYU Langone Hospital-Long Island,50 to 69,115,F,White,Spanish/Hispanic,3,Elective,Home or Self Care,2019,NEO073,BENIGN NEOPLASMS,FRS001,HYSTERECTOMY,519,UTERINE & ADNEXA PROCEDURES FOR LEIOMYOMA,13,DISEASES AND DISORDERS OF THE FEMALE REPRODUCTIVE SYSTEM,3,Major,Minor,Surgical,Medicaid,Medicaid,,,,false,109371.2,17123.48
Long Island,Nassau,2908000,000511,NYU Langone Hospital-Long Island,30 to 49,115,F,White,Spanish/Hispanic,2,Elective,Home or Self Care,2019,NEO073,BENIGN NEOPLASMS,LYM003,LYMPH NODE DISSECTION,519,UTERINE & ADNEXA PROCEDURES FOR LEIOMYOMA,13,DISEASES AND DISORDERS OF THE FEMALE REPRODUCTIVE SYSTEM,2,Moderate,Minor,Surgical,Federal/State/Local/VA,,,,,false,71675.43,19250.65
Long Island,Nassau,2908000,000511,NYU Langone Hospital-Long Island,50 to 69,117,F,White,Not Span/Hispanic,2,Urgent,Home or Self Care,2019,NEO073,BENIGN NEOPLASMS,FRS001,HYSTERECTOMY,519,UTERINE & ADNEXA PROCEDURES FOR LEIOMYOMA,13,DISEASES AND DISORDERS OF THE FEMALE REPRODUCTIVE SYSTEM,2,Moderate,Minor,Surgical,Medicaid,Medicaid,,,,false,152122.3,42950.32
Long Island,Nassau,2908000,000511,NYU Langone Hospital-Long Island,50 to 69,115,F,White,Not Span/Hispanic,1,Elective,Home or Self Care,2019,NEO073,BENIGN NEOPLASMS,FRS001,HYSTERECTOMY,519,UTERINE & ADNEXA PROCEDURES FOR LEIOMYOMA,13,DISEASES AND DISORDERS OF THE FEMALE REPRODUCTIVE SYSTEM,2,Moderate,Minor,Surgical,Blue Cross/Blue Shield,,,,,false,70027.75,18956.9
Long Island,Nassau,2908000,000511,NYU Langone Hospital-Long Island,30 to 49,115,F,Black/African American,Not Span/Hispanic,2,Elective,Home w/ Home Health Services,2019,NEO073,BENIGN NEOPLASMS,FRS010,FEMALE UPPER GENITAL TRACT EXCISION,519,UTERINE & ADNEXA PROCEDURES FOR LEIOMYOMA,13,DISEASES AND DISORDERS OF THE FEMALE REPRODUCTIVE SYSTEM,1,Minor,Minor,Surgical,Private Health Insurance,,,,,false,52498.65,15782.71
Long Island,Nassau,2908000,000511,NYU Langone Hospital-Long Island,30 to 49,115,F,Black/African American,Not Span/Hispanic,4,Elective,Home w/ Home Health Services,2019,NEO073,BENIGN NEOPLASMS,FRS001,HYSTERECTOMY,519,UTERINE & ADNEXA PROCEDURES FOR LEIOMYOMA,13,DISEASES AND DISORDERS OF THE FEMALE REPRODUCTIVE SYSTEM,2,Moderate,Minor,Surgical,Blue Cross/Blue Shield,,,,,false,86981.83,23207.9
Long Island,Nassau,2908000,000511,NYU Langone Hospital-Long Island,30 to 49,113,F,White,Not Span/Hispanic,4,Elective,Home w/ Home Health Services,2019,NEO073,BENIGN NEOPLASMS,FRS001,HYSTERECTOMY,519,UTERINE & ADNEXA PROCEDURES FOR LEIOMYOMA,13,DISEASES AND DISORDERS OF THE FEMALE REPRODUCTIVE SYSTEM,2,Moderate,Minor,Surgical,Medicaid,Medicaid,,,,false,108300.41,18636.13
Long Island,Nassau,2908000,000511,NYU Langone Hospital-Long Island,50 to 69,118,F,Other Race,Not Span/Hispanic,1,Elective,Home or Self Care,2019,NEO073,BENIGN NEOPLASMS,FRS001,HYSTERECTOMY,519,UTERINE & ADNEXA PROCEDURES FOR LEIOMYOMA,13,DISEASES AND DISORDERS OF THE FEMALE REPRODUCTIVE SYSTEM,1,Minor,Minor,Surgical,Federal/State/Local/VA,,,,,false,47139.97,13719.1
Long Island,Nassau,2908000,000511,NYU Langone Hospital-Long Island,50 to 69,110,F,White,Spanish/Hispanic,1,Elective,Home or Self Care,2019,NEO073,BENIGN NEOPLASMS,FRS001,HYSTERECTOMY,519,UTERINE & ADNEXA PROCEDURES FOR LEIOMYOMA,13,DISEASES AND DISORDERS OF THE FEMALE REPRODUCTIVE SYSTEM,1,Minor,Minor,Surgical,Blue Cross/Blue Shield,,,,,false,76748.05,19712.09
Long Island,Nassau,2908000,000511,NYU Langone Hospital-Long Island,70 or Older,115,F,Black/African American,Not Span/Hispanic,2,Elective,Home or Self Care,2019,NEO073,BENIGN NEOPLASMS,FRS001,HYSTERECTOMY,519,UTERINE & ADNEXA PROCEDURES FOR LEIOMYOMA,13,DISEASES AND DISORDERS OF THE FEMALE REPRODUCTIVE SYSTEM,2,Moderate,Minor,Surgical,Blue Cross/Blue Shield,,,,,false,53038.68,13520.21
Long Island,Nassau,2908000,000511,NYU Langone Hospital-Long Island,30 to 49,115,F,White,Spanish/Hispanic,2,Elective,Home or Self Care,2019,NEO073,BENIGN NEOPLASMS,FRS010,FEMALE UPPER GENITAL TRACT EXCISION,519,UTERINE & ADNEXA PROCEDURES FOR LEIOMYOMA,13,DISEASES AND DISORDERS OF THE FEMALE REPRODUCTIVE SYSTEM,1,Minor,Minor,Surgical,Federal/State/Local/VA,,,,,false,47458.58,13794.85
Long Island,Nassau,2908000,000511,NYU Langone Hospital-Long Island,30 to 49,118,F,Other Race,Not Span/Hispanic,1,Urgent,Home or Self Care,2019,NEO073,BENIGN NEOPLASMS,FRS010,FEMALE UPPER GENITAL TRACT EXCISION,519,UTERINE & ADNEXA PROCEDURES FOR LEIOMYOMA,13,DISEASES AND DISORDERS OF THE FEMALE REPRODUCTIVE SYSTEM,2,Moderate,Minor,Surgical,Private Health Insurance,,,,,false,47999.52,13004.94
Long Island,Nassau,2908000,000511,NYU Langone Hospital-Long Island,30 to 49,115,F,Black/African American,Not Span/Hispanic,3,Elective,Home or Self Care,2019,NEO073,BENIGN NEOPLASMS,FRS001,HYSTERECTOMY,519,UTERINE & ADNEXA PROCEDURES FOR LEIOMYOMA,13,DISEASES AND DISORDERS OF THE FEMALE REPRODUCTIVE SYSTEM,1,Minor,Minor,Surgical,Blue Cross/Blue Shield,,,,,false,78125.19,21784.32
Long Island,Nassau,2908000,000511,NYU Langone Hospital-Long Island,50 to 69,115,F,Black/African American,Not Span/Hispanic,1,Urgent,Home or Self Care,2019,NEO073,BENIGN NEOPLASMS,FRS001,HYSTERECTOMY,519,UTERINE & ADNEXA PROCEDURES FOR LEIOMYOMA,13,DISEASES AND DISORDERS OF THE FEMALE REPRODUCTIVE SYSTEM,2,Moderate,Minor,Surgical,Private Health Insurance,,,,,false,95892.47,14373.34
Long Island,Nassau,2908000,000511,NYU Langone Hospital-Long Island,50 to 69,112,F,Black/African American,Not Span/Hispanic,2,Elective,Home or Self Care,2019,NEO073,BENIGN NEOPLASMS,FRS001,HYSTERECTOMY,519,UTERINE & ADNEXA PROCEDURES FOR LEIOMYOMA,13,DISEASES AND DISORDERS OF THE FEMALE REPRODUCTIVE SYSTEM,1,Minor,Minor,Surgical,Private Health Insurance,,,,,false,70441.9,17970.15
Long Island,Nassau,2908000,000511,NYU Langone Hospital-Long Island,50 to 69,114,F,White,Spanish/Hispanic,3,Elective,Home or Self Care,2019,NEO073,BENIGN NEOPLASMS,FRS001,HYSTERECTOMY,519,UTERINE & ADNEXA PROCEDURES FOR LEIOMYOMA,13,DISEASES AND DISORDERS OF THE FEMALE REPRODUCTIVE SYSTEM,2,Moderate,Minor,Surgical,Private Health Insurance,,,,,false,104117.78,26433.54
Long Island,Nassau,2908000,000511,NYU Langone Hospital-Long Island,30 to 49,112,F,Black/African American,Not Span/Hispanic,2,Elective,Home or Self Care,2019,NEO073,BENIGN NEOPLASMS,FRS001,HYSTERECTOMY,519,UTERINE & ADNEXA PROCEDURES FOR LEIOMYOMA,13,DISEASES AND DISORDERS OF THE FEMALE REPRODUCTIVE SYSTEM,2,Moderate,Minor,Surgical,Blue Cross/Blue Shield,,,,,false,79684.34,22799.54
Long Island,Nassau,2908000,000511,NYU Langone Hospital-Long Island,50 to 69,110,F,White,Not Span/Hispanic,1,Elective,Home or Self Care,2019,NEO073,BENIGN NEOPLASMS,FRS001,HYSTERECTOMY,519,UTERINE & ADNEXA PROCEDURES FOR LEIOMYOMA,13,DISEASES AND DISORDERS OF THE FEMALE REPRODUCTIVE SYSTEM,1,Minor,Minor,Surgical,Private Health Insurance,,,,,false,55871.25,14369.39
Long Island,Nassau,2908000,000511,NYU Langone Hospital-Long Island,30 to 49,110,F,White,Not Span/Hispanic,1,Urgent,Home or Self Care,2019,NEO073,BENIGN NEOPLASMS,FRS001,HYSTERECTOMY,519,UTERINE & ADNEXA PROCEDURES FOR LEIOMYOMA,13,DISEASES AND DISORDERS OF THE FEMALE REPRODUCTIVE SYSTEM,1,Minor,Minor,Surgical,Private Health Insurance,,,,,false,59285.67,14453.62
Long Island,Nassau,2908000,000511,NYU Langone Hospital-Long Island,30 to 49,110,F,White,Spanish/Hispanic,2,Elective,Home or Self Care,2019,NEO073,BENIGN NEOPLASMS,FRS001,HYSTERECTOMY,519,UTERINE & ADNEXA PROCEDURES FOR LEIOMYOMA,13,DISEASES AND DISORDERS OF THE FEMALE REPRODUCTIVE SYSTEM,1,Minor,Minor,Surgical,Medicaid,Medicaid,,,,false,74861.12,20156.6
Long Island,Nassau,2908000,000511,NYU Langone Hospital-Long Island,30 to 49,115,F,Other Race,Spanish/Hispanic,1,Elective,Home or Self Care,2019,NEO073,BENIGN NEOPLASMS,FRS001,HYSTERECTOMY,519,UTERINE & ADNEXA PROCEDURES FOR LEIOMYOMA,13,DISEASES AND DISORDERS OF THE FEMALE REPRODUCTIVE SYSTEM,1,Minor,Minor,Surgical,Blue Cross/Blue Shield,,,,,false,72339.34,11157.35
Long Island,Nassau,2908000,000511,NYU Langone Hospital-Long Island,50 to 69,117,F,White,Not Span/Hispanic,2,Urgent,Home or Self Care,2019,NEO073,BENIGN NEOPLASMS,FRS001,HYSTERECTOMY,519,UTERINE & ADNEXA PROCEDURES FOR LEIOMYOMA,13,DISEASES AND DISORDERS OF THE FEMALE REPRODUCTIVE SYSTEM,2,Moderate,Minor,Surgical,Blue Cross/Blue Shield,,,,,false,55380.45,14072.13
Long Island,Nassau,2908000,000511,NYU Langone Hospital-Long Island,50 to 69,115,F,Black/African American,Not Span/Hispanic,2,Elective,Home or Self Care,2019,NEO073,BENIGN NEOPLASMS,FRS001,HYSTERECTOMY,519,UTERINE & ADNEXA PROCEDURES FOR LEIOMYOMA,13,DISEASES AND DISORDERS OF THE FEMALE REPRODUCTIVE SYSTEM,2,Moderate,Minor,Surgical,Blue Cross/Blue Shield,,,,,false,67196.63,20115.3
Long Island,Nassau,2908000,000511,NYU Langone Hospital-Long Island,30 to 49,117,F,Other Race,Not Span/Hispanic,2,Elective,Home or Self Care,2019,NEO073,BENIGN NEOPLASMS,FRS001,HYSTERECTOMY,519,UTERINE & ADNEXA PROCEDURES FOR LEIOMYOMA,13,DISEASES AND DISORDERS OF THE FEMALE REPRODUCTIVE SYSTEM,2,Moderate,Minor,Surgical,Private Health Insurance,,,,,false,51200.99,8697.78
Long Island,Nassau,2908000,000511,NYU Langone Hospital-Long Island,30 to 49,117,F,White,Not Span/Hispanic,2,Elective,Home or Self Care,2019,NEO073,BENIGN NEOPLASMS,FRS001,HYSTERECTOMY,519,UTERINE & ADNEXA PROCEDURES FOR LEIOMYOMA,13,DISEASES AND DISORDERS OF THE FEMALE REPRODUCTIVE SYSTEM,2,Moderate,Minor,Surgical,Private Health Insurance,,,,,false,61864.14,17698.01
Long Island,Nassau,2908000,000511,NYU Langone Hospital-Long Island,30 to 49,115,F,Black/African American,Not Span/Hispanic,3,Elective,Home or Self Care,2019,NEO073,BENIGN NEOPLASMS,FRS001,HYSTERECTOMY,519,UTERINE & ADNEXA PROCEDURES FOR LEIOMYOMA,13,DISEASES AND DISORDERS OF THE FEMALE REPRODUCTIVE SYSTEM,1,Minor,Minor,Surgical,Blue Cross/Blue Shield,,,,,false,72662.42,12890.49
Long Island,Nassau,2908000,000511,NYU Langone Hospital-Long Island,50 to 69,115,F,White,Spanish/Hispanic,2,Elective,Home or Self Care,2019,NEO073,BENIGN NEOPLASMS,FRS001,HYSTERECTOMY,519,UTERINE & ADNEXA PROCEDURES FOR LEIOMYOMA,13,DISEASES AND DISORDERS OF THE FEMALE REPRODUCTIVE SYSTEM,1,Minor,Minor,Surgical,Private Health Insurance,,,,,false,49108.18,12909.01
Long Island,Nassau,2908000,000511,NYU Langone Hospital-Long Island,30 to 49,115,F,White,Spanish/Hispanic,2,Elective,Home or Self Care,2019,NEO073,BENIGN NEOPLASMS,FRS001,HYSTERECTOMY,519,UTERINE & ADNEXA PROCEDURES FOR LEIOMYOMA,13,DISEASES AND DISORDERS OF THE FEMALE REPRODUCTIVE SYSTEM,1,Minor,Minor,Surgical,Blue Cross/Blue Shield,,,,,false,79436.31,23729.92
Long Island,Nassau,2908000,000511,NYU Langone Hospital-Long Island,30 to 49,115,F,Black/African American,Not Span/Hispanic,5,Urgent,Home or Self Care,2019,NEO073,BENIGN NEOPLASMS,FRS001,HYSTERECTOMY,519,UTERINE & ADNEXA PROCEDURES FOR LEIOMYOMA,13,DISEASES AND DISORDERS OF THE FEMALE REPRODUCTIVE SYSTEM,2,Moderate,Minor,Surgical,Private Health Insurance,,,,,false,198077.91,48998.8
Long Island,Nassau,2908000,000511,NYU Langone Hospital-Long Island,30 to 49,115,F,Black/African American,Not Span/Hispanic,2,Elective,Home or Self Care,2019,NEO073,BENIGN NEOPLASMS,FRS001,HYSTERECTOMY,519,UTERINE & ADNEXA PROCEDURES FOR LEIOMYOMA,13,DISEASES AND DISORDERS OF THE FEMALE REPRODUCTIVE SYSTEM,2,Moderate,Minor,Surgical,Private Health Insurance,,,,,false,71510.09,19708.32
Long Island,Nassau,2908000,000511,NYU Langone Hospital-Long Island,30 to 49,115,F,Black/African American,Not Span/Hispanic,3,Elective,Home or Self Care,2019,NEO073,BENIGN NEOPLASMS,FRS001,HYSTERECTOMY,519,UTERINE & ADNEXA PROCEDURES FOR LEIOMYOMA,13,DISEASES AND DISORDERS OF THE FEMALE REPRODUCTIVE SYSTEM,1,Minor,Minor,Surgical,Blue Cross/Blue Shield,,,,,false,62014.44,11239.84
Long Island,Nassau,2908000,000511,NYU Langone Hospital-Long Island,30 to 49,117,F,Black/African American,Spanish/Hispanic,2,Elective,Home or Self Care,2019,NEO073,BENIGN NEOPLASMS,FRS001,HYSTERECTOMY,519,UTERINE & ADNEXA PROCEDURES FOR LEIOMYOMA,13,DISEASES AND DISORDERS OF THE FEMALE REPRODUCTIVE SYSTEM,1,Minor,Minor,Surgical,Private Health Insurance,,,,,false,51171.94,13134.98