Hospital Service Area,Hospital County,Operating Certificate Number,Permanent Facility Id,Facility Name,Age Group,Zip Code - 3 digits,Gender,Race,Ethnicity,Length of Stay,Type of Admission,Patient Disposition,Discharge Year,CCS Diagnosis Code,CCS Diagnosis Description,CCS Procedure Code,CCS Procedure Description,APR DRG Code,APR DRG Description,APR MDC Code,APR MDC Description,APR Severity of Illness Code,APR Severity of Illness Description,APR Risk of Mortality,APR Medical Surgical Description,Payment Typology 1,Payment Typology 2,Payment Typology 3,Birth Weight,Abortion Edit Indicator,Emergency Department Indicator,Total Charges,Total Costs
New York City,Manhattan,7002024,001456,Mount Sinai Hospital,30 to 49,113,F,White,Not Span/Hispanic,2,Elective,Home or Self Care,2020,NEO073,BENIGN NEOPLASMS,FRS010,FEMALE UPPER GENITAL TRACT EXCISION,519,UTERINE & ADNEXA PROCEDURES FOR LEIOMYOMA,13,DISEASES AND DISORDERS OF THE FEMALE REPRODUCTIVE SYSTEM,1,Minor,Minor,Surgical,Private Health Insurance,Self-Pay,,,,N,41265.04,11493.86
New York City,Bronx,7000006,003058,Montefiore Med Center - Jack D Weiler Hosp of A Einstein College Div,30 to 49,104,F,Black/African American,Unknown,2,Elective,Home or Self Care,2020,NEO073,BENIGN NEOPLASMS,FRS001,HYSTERECTOMY,519,UTERINE & ADNEXA PROCEDURES FOR LEIOMYOMA,13,DISEASES AND DISORDERS OF THE FEMALE REPRODUCTIVE SYSTEM,1,Minor,Minor,Surgical,Private Health Insurance,,,,,N,56528.66,12193.46
New York City,Bronx,7000006,001169,Montefiore Medical Center - Henry & Lucy Moses Div,30 to 49,104,F,Black/African American,Not Span/Hispanic,2,Emergency,Home or Self Care,2020,NEO073,BENIGN NEOPLASMS,FRS010,FEMALE UPPER GENITAL TRACT EXCISION,519,UTERINE & ADNEXA PROCEDURES FOR LEIOMYOMA,13,DISEASES AND DISORDERS OF THE FEMALE REPRODUCTIVE SYSTEM,1,Minor,Minor,Surgical,Private Health Insurance,,,,,N,57549.47,11068.49
New York City,Manhattan,7002024,001456,Mount Sinai Hospital,30 to 49,OOS,F,Black/African American,Not Span/Hispanic,1,Elective,Home or Self Care,2020,NEO073,BENIGN NEOPLASMS,FRS010,FEMALE UPPER GENITAL TRACT EXCISION,519,UTERINE & ADNEXA PROCEDURES FOR LEIOMYOMA,13,DISEASES AND DISORDERS OF THE FEMALE REPRODUCTIVE SYSTEM,1,Minor,Minor,Surgical,Private Health Insurance,Self-Pay,,,,N,31443.58,8388.42
New York City,Manhattan,7002024,001456,Mount Sinai Hospital,50 to 69,113,F,Other Race,Unknown,1,Elective,Home or Self Care,2020,NEO073,BENIGN NEOPLASMS,FRS001,HYSTERECTOMY,519,UTERINE & ADNEXA PROCEDURES FOR LEIOMYOMA,13,DISEASES AND DISORDERS OF THE FEMALE REPRODUCTIVE SYSTEM,1,Minor,Minor,Surgical,Blue Cross/Blue Shield,Self-Pay,,,,N,27870.76,7801.16
New York City,Manhattan,7002024,001456,Mount Sinai Hospital,30 to 49,100,F,Other Race,Spanish/Hispanic,2,Elective,Home or Self Care,2020,NEO073,BENIGN NEOPLASMS,FRS010,FEMALE UPPER GENITAL TRACT EXCISION,519,UTERINE & ADNEXA PROCEDURES FOR LEIOMYOMA,13,DISEASES AND DISORDERS OF THE FEMALE REPRODUCTIVE SYSTEM,2,Moderate,Moderate,Surgical,Blue Cross/Blue Shield,Self-Pay,,,,N,53697.88,14910.48
New York City,Manhattan,7002024,001456,Mount Sinai Hospital,30 to 49,104,F,Black/African American,Not Span/Hispanic,1,Elective,Home or Self Care,2020,NEO073,BENIGN NEOPLASMS,FRS001,HYSTERECTOMY,519,UTERINE & ADNEXA PROCEDURES FOR LEIOMYOMA,13,DISEASES AND DISORDERS OF THE FEMALE REPRODUCTIVE SYSTEM,2,Moderate,Minor,Surgical,Medicaid,Medicaid,Self-Pay,,,N,39835.43,10995.79
New York City,Kings,7002002,001324,Mount Sinai Brooklyn,30 to 49,103,F,Black/African American,Not Span/Hispanic,2,Elective,Home or Self Care,2020,NEO073,BENIGN NEOPLASMS,FRS010,FEMALE UPPER GENITAL TRACT EXCISION,519,UTERINE & ADNEXA PROCEDURES FOR LEIOMYOMA,13,DISEASES AND DISORDERS OF THE FEMALE REPRODUCTIVE SYSTEM,1,Minor,Minor,Surgical,Blue Cross/Blue Shield,Self-Pay,,,,N,78838.74,15490.23
New York City,Manhattan,7002032,001466,Mount Sinai West,50 to 69,104,F,Black/African American,Not Span/Hispanic,1,Elective,Home or Self Care,2020,NEO073,BENIGN NEOPLASMS,FRS001,HYSTERECTOMY,519,UTERINE & ADNEXA PROCEDURES FOR LEIOMYOMA,13,DISEASES AND DISORDERS OF THE FEMALE REPRODUCTIVE SYSTEM,1,Minor,Minor,Surgical,Private Health Insurance,Self-Pay,,,,N,35803.75,8795.88
New York City,Manhattan,7002032,001466,Mount Sinai West,18 to 29,107,F,Black/African American,Not Span/Hispanic,1,Elective,Home or Self Care,2020,NEO073,BENIGN NEOPLASMS,FRS010,FEMALE UPPER GENITAL TRACT EXCISION,519,UTERINE & ADNEXA PROCEDURES FOR LEIOMYOMA,13,DISEASES AND DISORDERS OF THE FEMALE REPRODUCTIVE SYSTEM,2,Moderate,Minor,Surgical,Medicaid,Medicaid,Self-Pay,,,N,32092.8,8014.97
New York City,Manhattan,7002032,001466,Mount Sinai West,50 to 69,100,F,Other Race,Spanish/Hispanic,2,Elective,Home w/ Home Health Services,2020,NEO073,BENIGN NEOPLASMS,FRS001,HYSTERECTOMY,519,UTERINE & ADNEXA PROCEDURES FOR LEIOMYOMA,13,DISEASES AND DISORDERS OF THE FEMALE REPRODUCTIVE SYSTEM,3,Major,Minor,Surgical,Medicaid,Medicaid,Self-Pay,,,N,54645.72,13348.27
New York City,Manhattan,7002032,001466,Mount Sinai West,30 to 49,,F,White,Not Span/Hispanic,3,Elective,Home or Self Care,2020,NEO073,BENIGN NEOPLASMS,FRS001,HYSTERECTOMY,519,UTERINE & ADNEXA PROCEDURES FOR LEIOMYOMA,13,DISEASES AND DISORDERS OF THE FEMALE REPRODUCTIVE SYSTEM,1,Minor,Minor,Surgical,Blue Cross/Blue Shield,Self-Pay,,,,N,61089.47,14483.81
New York City,Manhattan,7002032,001466,Mount Sinai West,30 to 49,113,F,Other Race,Spanish/Hispanic,1,Elective,Home or Self Care,2020,NEO073,BENIGN NEOPLASMS,FRS010,FEMALE UPPER GENITAL TRACT EXCISION,519,UTERINE & ADNEXA PROCEDURES FOR LEIOMYOMA,13,DISEASES AND DISORDERS OF THE FEMALE REPRODUCTIVE SYSTEM,2,Moderate,Minor,Surgical,Private Health Insurance,Self-Pay,,,,N,31994.3,7758.99
New York City,Manhattan,7002032,001466,Mount Sinai West,30 to 49,104,F,Other Race,Spanish/Hispanic,1,Elective,Home or Self Care,2020,NEO073,BENIGN NEOPLASMS,FRS010,FEMALE UPPER GENITAL TRACT EXCISION,519,UTERINE & ADNEXA PROCEDURES FOR LEIOMYOMA,13,DISEASES AND DISORDERS OF THE FEMALE REPRODUCTIVE SYSTEM,2,Moderate,Minor,Surgical,Blue Cross/Blue Shield,Self-Pay,,,,N,50412.08,13205.11
New York City,Manhattan,7002032,001466,Mount Sinai West,30 to 49,100,F,Black/African American,Unknown,3,Urgent,Home or Self Care,2020,NEO073,BENIGN NEOPLASMS,FRS001,HYSTERECTOMY,519,UTERINE & ADNEXA PROCEDURES FOR LEIOMYOMA,13,DISEASES AND DISORDERS OF THE FEMALE REPRODUCTIVE SYSTEM,2,Moderate,Minor,Surgical,Medicare,Medicaid,Self-Pay,,,N,66463.75,15750.96
New York City,Manhattan,7002032,001466,Mount Sinai West,30 to 49,OOS,F,Other Race,Spanish/Hispanic,1,Elective,Home or Self Care,2020,NEO073,BENIGN NEOPLASMS,FRS001,HYSTERECTOMY,519,UTERINE & ADNEXA PROCEDURES FOR LEIOMYOMA,13,DISEASES AND DISORDERS OF THE FEMALE REPRODUCTIVE SYSTEM,1,Minor,Minor,Surgical,Blue Cross/Blue Shield,Self-Pay,,,,N,36763.69,8997.37
New York City,Manhattan,7002032,001466,Mount Sinai West,30 to 49,100,F,Black/African American,Unknown,1,Elective,Home or Self Care,2020,NEO073,BENIGN NEOPLASMS,FRS001,HYSTERECTOMY,519,UTERINE & ADNEXA PROCEDURES FOR LEIOMYOMA,13,DISEASES AND DISORDERS OF THE FEMALE REPRODUCTIVE SYSTEM,1,Minor,Minor,Surgical,Private Health Insurance,Self-Pay,,,,N,33248.9,8121.46
New York City,Manhattan,7002032,001466,Mount Sinai West,30 to 49,100,F,Other Race,Spanish/Hispanic,2,Elective,Home or Self Care,2020,NEO073,BENIGN NEOPLASMS,FRS001,HYSTERECTOMY,519,UTERINE & ADNEXA PROCEDURES FOR LEIOMYOMA,13,DISEASES AND DISORDERS OF THE FEMALE REPRODUCTIVE SYSTEM,2,Moderate,Minor,Surgical,Private Health Insurance,Self-Pay,,,,N,43304.08,10434.81
New York City,Manhattan,7002032,001466,Mount Sinai West,30 to 49,104,F,Other Race,Spanish/Hispanic,2,Elective,Home or Self Care,2020,NEO073,BENIGN NEOPLASMS,FRS001,HYSTERECTOMY,519,UTERINE & ADNEXA PROCEDURES FOR LEIOMYOMA,13,DISEASES AND DISORDERS OF THE FEMALE REPRODUCTIVE SYSTEM,1,Minor,Minor,Surgical,Medicaid,Medicaid,Self-Pay,,,N,40499.55,9542.72
New York City,Manhattan,7002032,001466,Mount Sinai West,30 to 49,100,F,White,Not Span/Hispanic,1,Elective,Home or Self Care,2020,NEO073,BENIGN NEOPLASMS,FRS010,FEMALE UPPER GENITAL TRACT EXCISION,519,UTERINE & ADNEXA PROCEDURES FOR LEIOMYOMA,13,DISEASES AND DISORDERS OF THE FEMALE REPRODUCTIVE SYSTEM,2,Moderate,Minor,Surgical,Private Health Insurance,Self-Pay,,,,N,34592.36,8667.14
New York City,Manhattan,7002032,001466,Mount Sinai West,50 to 69,114,F,Other Race,Spanish/Hispanic,2,Elective,Home or Self Care,2020,NEO073,BENIGN NEOPLASMS,FRS001,HYSTERECTOMY,519,UTERINE & ADNEXA PROCEDURES FOR LEIOMYOMA,13,DISEASES AND DISORDERS OF THE FEMALE REPRODUCTIVE SYSTEM,1,Minor,Minor,Surgical,Private Health Insurance,Medicaid,Self-Pay,,,N,41248.87,9900.79
New York City,Manhattan,7002024,001456,Mount Sinai Hospital,30 to 49,100,F,White,Not Span/Hispanic,1,Elective,Home or Self Care,2020,NEO073,BENIGN NEOPLASMS,FRS010,FEMALE UPPER GENITAL TRACT EXCISION,519,UTERINE & ADNEXA PROCEDURES FOR LEIOMYOMA,13,DISEASES AND DISORDERS OF THE FEMALE REPRODUCTIVE SYSTEM,2,Moderate,Moderate,Surgical,Private Health Insurance,Self-Pay,,,,N,63080.72,18536.27
New York City,Manhattan,7002024,001456,Mount Sinai Hospital,30 to 49,112,F,Black/African American,Not Span/Hispanic,1,Elective,Home or Self Care,2020,NEO073,BENIGN NEOPLASMS,FRS010,FEMALE UPPER GENITAL TRACT EXCISION,519,UTERINE & ADNEXA PROCEDURES FOR LEIOMYOMA,13,DISEASES AND DISORDERS OF THE FEMALE REPRODUCTIVE SYSTEM,1,Minor,Minor,Surgical,Private Health Insurance,Self-Pay,,,,N,34108.19,9497.16
New York City,Bronx,7000006,003058,Montefiore Med Center - Jack D Weiler Hosp of A Einstein College Div,30 to 49,104,F,Black/African American,Not Span/Hispanic,1,Emergency,Home or Self Care,2020,NEO073,BENIGN NEOPLASMS,FRS002,OOPHORECTOMY,519,UTERINE & ADNEXA PROCEDURES FOR LEIOMYOMA,13,DISEASES AND DISORDERS OF THE FEMALE REPRODUCTIVE SYSTEM,1,Minor,Minor,Surgical,Private Health Insurance,,,,,N,61284.23,11974.88
New York City,Bronx,7000006,003058,Montefiore Med Center - Jack D Weiler Hosp of A Einstein College Div,30 to 49,104,F,Other Race,Unknown,2,Emergency,Home or Self Care,2020,NEO073,BENIGN NEOPLASMS,FRS001,HYSTERECTOMY,519,UTERINE & ADNEXA PROCEDURES FOR LEIOMYOMA,13,DISEASES AND DISORDERS OF THE FEMALE REPRODUCTIVE SYSTEM,1,Minor,Minor,Surgical,Private Health Insurance,,,,,N,60638.26,13364.08
Hudson Valley,Westchester,5904001,001072,Montefiore New Rochelle Hospital,30 to 49,104,F,Other Race,Spanish/Hispanic,2,Elective,Home or Self Care,2020,NEO073,BENIGN NEOPLASMS,FRS010,FEMALE UPPER GENITAL TRACT EXCISION,519,UTERINE & ADNEXA PROCEDURES FOR LEIOMYOMA,13,DISEASES AND DISORDERS OF THE FEMALE REPRODUCTIVE SYSTEM,1,Minor,Minor,Surgical,Private Health Insurance,Self-Pay,,,,N,22854.3,7183.92
Hudson Valley,Westchester,5904001,001072,Montefiore New Rochelle Hospital,30 to 49,104,F,Other Race,Spanish/Hispanic,3,Elective,Home or Self Care,2020,NEO073,BENIGN NEOPLASMS,FRS001,HYSTERECTOMY,519,UTERINE & ADNEXA PROCEDURES FOR LEIOMYOMA,13,DISEASES AND DISORDERS OF THE FEMALE REPRODUCTIVE SYSTEM,1,Minor,Minor,Surgical,Private Health Insurance,Self-Pay,,,,N,33856.26,10834.09
Hudson Valley,Westchester,5904001,001072,Montefiore New Rochelle Hospital,30 to 49,105,F,Black/African American,Not Span/Hispanic,3,Elective,Home or Self Care,2020,NEO073,BENIGN NEOPLASMS,FRS001,HYSTERECTOMY,519,UTERINE & ADNEXA PROCEDURES FOR LEIOMYOMA,13,DISEASES AND DISORDERS OF THE FEMALE REPRODUCTIVE SYSTEM,1,Minor,Minor,Surgical,Private Health Insurance,Self-Pay,,,,N,29027.96,8897.19
Long Island,Nassau,2908000,000511,NYU Langone Hospital-Long Island,30 to 49,115,F,Black/African American,Not Span/Hispanic,2,Elective,Home w/ Home Health Services,2020,NEO073,BENIGN NEOPLASMS,FRS003,SALPINGECTOMY,519,UTERINE & ADNEXA PROCEDURES FOR LEIOMYOMA,13,DISEASES AND DISORDERS OF THE FEMALE REPRODUCTIVE SYSTEM,2,Moderate,Minor,Surgical,Blue Cross/Blue Shield,,,,,N,73465.71,12693.53
New York City,Bronx,7000006,003058,Montefiore Med Center - Jack D Weiler Hosp of A Einstein College Div,30 to 49,117,F,Other Race,Unknown,2,Elective,Home or Self Care,2020,NEO073,BENIGN NEOPLASMS,FRS010,FEMALE UPPER GENITAL TRACT EXCISION,519,UTERINE & ADNEXA PROCEDURES FOR LEIOMYOMA,13,DISEASES AND DISORDERS OF THE FEMALE REPRODUCTIVE SYSTEM,1,Minor,Minor,Surgical,Private Health Insurance,,,,,N,65977.33,12508.34
New York City,Manhattan,7002054,001464,New York-Presbyterian Hospital - Columbia Presbyterian Center,50 to 69,100,F,White,Not Span/Hispanic,4,Elective,Home or Self Care,2020,NEO073,BENIGN NEOPLASMS,FRS001,HYSTERECTOMY,519,UTERINE & ADNEXA PROCEDURES FOR LEIOMYOMA,13,DISEASES AND DISORDERS OF THE FEMALE REPRODUCTIVE SYSTEM,2,Moderate,Moderate,Surgical,Private Health Insurance,Self-Pay,,,,N,70019.04,18444.68
New York City,Manhattan,7002054,001464,New York-Presbyterian Hospital - Columbia Presbyterian Center,30 to 49,108,F,Other Race,Spanish/Hispanic,1,Elective,Home or Self Care,2020,NEO073,BENIGN NEOPLASMS,FRS010,FEMALE UPPER GENITAL TRACT EXCISION,519,UTERINE & ADNEXA PROCEDURES FOR LEIOMYOMA,13,DISEASES AND DISORDERS OF THE FEMALE REPRODUCTIVE SYSTEM,1,Minor,Minor,Surgical,Private Health Insurance,Self-Pay,,,,N,57042.08,17748.2
New York City,Manhattan,7002054,001464,New York-Presbyterian Hospital - Columbia Presbyterian Center,30 to 49,104,F,Black/African American,Not Span/Hispanic,4,Elective,Home or Self Care,2020,NEO073,BENIGN NEOPLASMS,FRS001,HYSTERECTOMY,519,UTERINE & ADNEXA PROCEDURES FOR LEIOMYOMA,13,DISEASES AND DISORDERS OF THE FEMALE REPRODUCTIVE SYSTEM,2,Moderate,Moderate,Surgical,Blue Cross/Blue Shield,Self-Pay,,,,N,98942.74,27092.12
New York City,Manhattan,7002054,001464,New York-Presbyterian Hospital - Columbia Presbyterian Center,30 to 49,OOS,F,Other Race,Not Span/Hispanic,1,Urgent,Home or Self Care,2020,NEO073,BENIGN NEOPLASMS,FRS010,FEMALE UPPER GENITAL TRACT EXCISION,519,UTERINE & ADNEXA PROCEDURES FOR LEIOMYOMA,13,DISEASES AND DISORDERS OF THE FEMALE REPRODUCTIVE SYSTEM,1,Minor,Minor,Surgical,Private Health Insurance,Self-Pay,,,,N,53083.65,14546.34
New York City,Manhattan,7002054,001464,New York-Presbyterian Hospital - Columbia Presbyterian Center,30 to 49,104,F,Black/African American,Not Span/Hispanic,3,Elective,Home or Self Care,2020,NEO073,BENIGN NEOPLASMS,FRS001,HYSTERECTOMY,519,UTERINE & ADNEXA PROCEDURES FOR LEIOMYOMA,13,DISEASES AND DISORDERS OF THE FEMALE REPRODUCTIVE SYSTEM,1,Minor,Minor,Surgical,Medicaid,Medicaid,Self-Pay,,,N,64243.29,16858.95
New York City,Manhattan,7002054,001464,New York-Presbyterian Hospital - Columbia Presbyterian Center,50 to 69,100,F,White,Not Span/Hispanic,3,Elective,Home or Self Care,2020,NEO073,BENIGN NEOPLASMS,FRS001,HYSTERECTOMY,519,UTERINE & ADNEXA PROCEDURES FOR LEIOMYOMA,13,DISEASES AND DISORDERS OF THE FEMALE REPRODUCTIVE SYSTEM,1,Minor,Minor,Surgical,Medicare,Private Health Insurance,Self-Pay,,,N,63844.68,16957.63
New York City,Manhattan,7002054,001464,New York-Presbyterian Hospital - Columbia Presbyterian Center,30 to 49,104,F,Black/African American,Not Span/Hispanic,2,Elective,Home or Self Care,2020,NEO073,BENIGN NEOPLASMS,FRS002,OOPHORECTOMY,519,UTERINE & ADNEXA PROCEDURES FOR LEIOMYOMA,13,DISEASES AND DISORDERS OF THE FEMALE REPRODUCTIVE SYSTEM,1,Minor,Minor,Surgical,Private Health Insurance,Self-Pay,,,,N,69804.87,18917.92
New York City,Manhattan,7002054,001464,New York-Presbyterian Hospital - Columbia Presbyterian Center,30 to 49,100,F,Black/African American,Not Span/Hispanic,3,Elective,Home or Self Care,2020,NEO073,BENIGN NEOPLASMS,FRS010,FEMALE UPPER GENITAL TRACT EXCISION,519,UTERINE & ADNEXA PROCEDURES FOR LEIOMYOMA,13,DISEASES AND DISORDERS OF THE FEMALE REPRODUCTIVE SYSTEM,2,Moderate,Minor,Surgical,Blue Cross/Blue Shield,Self-Pay,,,,N,71744.31,20180.3
New York City,Manhattan,7002054,001464,New York-Presbyterian Hospital - Columbia Presbyterian Center,30 to 49,100,F,Other Race,Not Span/Hispanic,2,Elective,Home or Self Care,2020,NEO073,BENIGN NEOPLASMS,FRS001,HYSTERECTOMY,519,UTERINE & ADNEXA PROCEDURES FOR LEIOMYOMA,13,DISEASES AND DISORDERS OF THE FEMALE REPRODUCTIVE SYSTEM,1,Minor,Minor,Surgical,Private Health Insurance,Self-Pay,,,,N,56765.34,16082.7
New York City,Manhattan,7002054,001464,New York-Presbyterian Hospital - Columbia Presbyterian Center,30 to 49,104,F,Multi-racial,Multi-ethnic,2,Elective,Home or Self Care,2020,NEO073,BENIGN NEOPLASMS,FRS001,HYSTERECTOMY,519,UTERINE & ADNEXA PROCEDURES FOR LEIOMYOMA,13,DISEASES AND DISORDERS OF THE FEMALE REPRODUCTIVE SYSTEM,1,Minor,Minor,Surgical,Medicaid,Medicaid,Self-Pay,,,N,49782.43,14189.98
New York City,Manhattan,7002054,001464,New York-Presbyterian Hospital - Columbia Presbyterian Center,30 to 49,104,F,Black/African American,Not Span/Hispanic,2,Urgent,Home or Self Care,2020,NEO073,BENIGN NEOPLASMS,FRS001,HYSTERECTOMY,519,UTERINE & ADNEXA PROCEDURES FOR LEIOMYOMA,13,DISEASES AND DISORDERS OF THE FEMALE REPRODUCTIVE SYSTEM,1,Minor,Minor,Surgical,Private Health Insurance,Self-Pay,,,,N,61895.83,18065.62
New York City,Manhattan,7002054,001464,New York-Presbyterian Hospital - Columbia Presbyterian Center,30 to 49,100,F,Black/African American,Not Span/Hispanic,2,Elective,Home or Self Care,2020,NEO073,BENIGN NEOPLASMS,FRS010,FEMALE UPPER GENITAL TRACT EXCISION,519,UTERINE & ADNEXA PROCEDURES FOR LEIOMYOMA,13,DISEASES AND DISORDERS OF THE FEMALE REPRODUCTIVE SYSTEM,1,Minor,Minor,Surgical,Private Health Insurance,Self-Pay,,,,N,61541.58,18232.41
New York City,Manhattan,7002054,001464,New York-Presbyterian Hospital - Columbia Presbyterian Center,30 to 49,100,F,Other Race,Not Span/Hispanic,2,Urgent,Home or Self Care,2020,NEO073,BENIGN NEOPLASMS,FRS001,HYSTERECTOMY,519,UTERINE & ADNEXA PROCEDURES FOR LEIOMYOMA,13,DISEASES AND DISORDERS OF THE FEMALE REPRODUCTIVE SYSTEM,1,Minor,Minor,Surgical,Private Health Insurance,Self-Pay,,,,N,56731.24,15175.41
New York City,Manhattan,7002054,001464,New York-Presbyterian Hospital - Columbia Presbyterian Center,30 to 49,112,F,Black/African American,Not Span/Hispanic,1,Elective,Home or Self Care,2020,NEO073,BENIGN NEOPLASMS,FRS010,FEMALE UPPER GENITAL TRACT EXCISION,519,UTERINE & ADNEXA PROCEDURES FOR LEIOMYOMA,13,DISEASES AND DISORDERS OF THE FEMALE REPRODUCTIVE SYSTEM,1,Minor,Minor,Surgical,Private Health Insurance,Self-Pay,,,,N,43021.26,12644.82
New York City,Manhattan,7002054,001464,New York-Presbyterian Hospital - Columbia Presbyterian Center,30 to 49,104,F,Black/African American,Not Span/Hispanic,2,Urgent,Home or Self Care,2020,NEO073,BENIGN NEOPLASMS,FRS010,FEMALE UPPER GENITAL TRACT EXCISION,519,UTERINE & ADNEXA PROCEDURES FOR LEIOMYOMA,13,DISEASES AND DISORDERS OF THE FEMALE REPRODUCTIVE SYSTEM,1,Minor,Minor,Surgical,Blue Cross/Blue Shield,Self-Pay,,,,N,55709.66,15898.85
New York City,Manhattan,7002054,001464,New York-Presbyterian Hospital - Columbia Presbyterian Center,50 to 69,100,F,Multi-racial,Multi-ethnic,1,Urgent,Home or Self Care,2020,NEO073,BENIGN NEOPLASMS,FRS001,HYSTERECTOMY,519,UTERINE & ADNEXA PROCEDURES FOR LEIOMYOMA,13,DISEASES AND DISORDERS OF THE FEMALE REPRODUCTIVE SYSTEM,1,Minor,Minor,Surgical,Medicaid,Medicaid,Self-Pay,,,N,42904.89,12951.62
New York City,Manhattan,7002024,001456,Mount Sinai Hospital,30 to 49,100,F,White,Not Span/Hispanic,10,Elective,Home or Self Care,2020,NEO073,BENIGN NEOPLASMS,FRS001,HYSTERECTOMY,519,UTERINE & ADNEXA PROCEDURES FOR LEIOMYOMA,13,DISEASES AND DISORDERS OF THE FEMALE REPRODUCTIVE SYSTEM,2,Moderate,Minor,Surgical,Private Health Insurance,Self-Pay,,,,N,136328.76,35458.1
New York City,Manhattan,7002024,001456,Mount Sinai Hospital,30 to 49,OOS,F,Other Race,Not Span/Hispanic,1,Elective,Home or Self Care,2020,NEO073,BENIGN NEOPLASMS,FRS001,HYSTERECTOMY,519,UTERINE & ADNEXA PROCEDURES FOR LEIOMYOMA,13,DISEASES AND DISORDERS OF THE FEMALE REPRODUCTIVE SYSTEM,1,Minor,Minor,Surgical,Private Health Insurance,Self-Pay,,,,N,35842.99,9448.01
New York City,Manhattan,7002024,001456,Mount Sinai Hospital,50 to 69,100,F,Other Race,Spanish/Hispanic,1,Elective,Home or Self Care,2020,NEO073,BENIGN NEOPLASMS,FRS001,HYSTERECTOMY,519,UTERINE & ADNEXA PROCEDURES FOR LEIOMYOMA,13,DISEASES AND DISORDERS OF THE FEMALE REPRODUCTIVE SYSTEM,1,Minor,Minor,Surgical,Blue Cross/Blue Shield,Self-Pay,,,,N,32079.38,8787.18
New York City,Manhattan,7002024,001456,Mount Sinai Hospital,30 to 49,100,F,Other Race,Spanish/Hispanic,4,Elective,Home or Self Care,2020,NEO073,BENIGN NEOPLASMS,FRS010,FEMALE UPPER GENITAL TRACT EXCISION,519,UTERINE & ADNEXA PROCEDURES FOR LEIOMYOMA,13,DISEASES AND DISORDERS OF THE FEMALE REPRODUCTIVE SYSTEM,1,Minor,Minor,Surgical,Medicaid,Medicaid,Self-Pay,,,N,65936.55,17765.77
New York City,Queens,7003010,001637,New York - Presbyterian/Queens,50 to 69,113,F,Black/African American,Not Span/Hispanic,1,Urgent,Home or Self Care,2020,NEO073,BENIGN NEOPLASMS,FRS001,HYSTERECTOMY,519,UTERINE & ADNEXA PROCEDURES FOR LEIOMYOMA,13,DISEASES AND DISORDERS OF THE FEMALE REPRODUCTIVE SYSTEM,1,Minor,Minor,Surgical,Blue Cross/Blue Shield,Self-Pay,,,,N,7650.88,1942.01
New York City,Queens,7003010,001637,New York - Presbyterian/Queens,30 to 49,113,F,Black/African American,Spanish/Hispanic,2,Urgent,Home or Self Care,2020,NEO073,BENIGN NEOPLASMS,FRS010,FEMALE UPPER GENITAL TRACT EXCISION,519,UTERINE & ADNEXA PROCEDURES FOR LEIOMYOMA,13,DISEASES AND DISORDERS OF THE FEMALE REPRODUCTIVE SYSTEM,1,Minor,Minor,Surgical,"Managed Care, Unspecified",Medicaid,Self-Pay,,,N,36851.96,13029.15
New York City,Queens,7003010,001637,New York - Presbyterian/Queens,30 to 49,113,F,Black/African American,Not Span/Hispanic,2,Elective,Home or Self Care,2020,NEO073,BENIGN NEOPLASMS,FRS010,FEMALE UPPER GENITAL TRACT EXCISION,519,UTERINE & ADNEXA PROCEDURES FOR LEIOMYOMA,13,DISEASES AND DISORDERS OF THE FEMALE REPRODUCTIVE SYSTEM,1,Minor,Minor,Surgical,Private Health Insurance,Self-Pay,,,,N,15798.56,4116.28
New York City,Queens,7003010,001637,New York - Presbyterian/Queens,30 to 49,100,F,Other Race,Not Span/Hispanic,1,Urgent,Home or Self Care,2020,NEO073,BENIGN NEOPLASMS,FRS010,FEMALE UPPER GENITAL TRACT EXCISION,519,UTERINE & ADNEXA PROCEDURES FOR LEIOMYOMA,13,DISEASES AND DISORDERS OF THE FEMALE REPRODUCTIVE SYSTEM,1,Minor,Minor,Surgical,Blue Cross/Blue Shield,Self-Pay,,,,N,29174.67,11353.62
New York City,Manhattan,7002054,001437,New York-Presbyterian/Lower Manhattan Hospital,30 to 49,103,F,Black/African American,Not Span/Hispanic,2,Emergency,Home or Self Care,2020,NEO073,BENIGN NEOPLASMS,FRS010,FEMALE UPPER GENITAL TRACT EXCISION,519,UTERINE & ADNEXA PROCEDURES FOR LEIOMYOMA,13,DISEASES AND DISORDERS OF THE FEMALE REPRODUCTIVE SYSTEM,1,Minor,Minor,Surgical,Blue Cross/Blue Shield,Self-Pay,,,,N,61145.71,17841.81
New York City,Manhattan,7002054,001437,New York-Presbyterian/Lower Manhattan Hospital,18 to 29,104,F,White,Spanish/Hispanic,1,Elective,Home or Self Care,2020,NEO073,BENIGN NEOPLASMS,FRS010,FEMALE UPPER GENITAL TRACT EXCISION,519,UTERINE & ADNEXA PROCEDURES FOR LEIOMYOMA,13,DISEASES AND DISORDERS OF THE FEMALE REPRODUCTIVE SYSTEM,1,Minor,Minor,Surgical,Private Health Insurance,Self-Pay,,,,N,36273.62,11017.62
New York City,Manhattan,7002054,001437,New York-Presbyterian/Lower Manhattan Hospital,30 to 49,112,F,Other Race,Not Span/Hispanic,2,Elective,Home or Self Care,2020,NEO073,BENIGN NEOPLASMS,FRS010,FEMALE UPPER GENITAL TRACT EXCISION,519,UTERINE & ADNEXA PROCEDURES FOR LEIOMYOMA,13,DISEASES AND DISORDERS OF THE FEMALE REPRODUCTIVE SYSTEM,1,Minor,Minor,Surgical,"Managed Care, Unspecified",Medicaid,Self-Pay,,,N,41958.81,11715.08
New York City,Queens,7003010,001637,New York - Presbyterian/Queens,30 to 49,112,F,Other Race,Not Span/Hispanic,4,Emergency,Home or Self Care,2020,NEO073,BENIGN NEOPLASMS,FRS003,SALPINGECTOMY,519,UTERINE & ADNEXA PROCEDURES FOR LEIOMYOMA,13,DISEASES AND DISORDERS OF THE FEMALE REPRODUCTIVE SYSTEM,2,Moderate,Minor,Surgical,"Managed Care, Unspecified",Medicaid,Self-Pay,,,Y,52020.6,17123.42