Hospital Service Area,Hospital County,Operating Certificate Number,Permanent Facility Id,Facility Name,Age Group,Zip Code - 3 digits,Gender,Race,Ethnicity,Length of Stay,Type of Admission,Patient Disposition,Discharge Year,CCS Diagnosis Code,CCS Diagnosis Description,CCS Procedure Code,CCS Procedure Description,APR DRG Code,APR DRG Description,APR MDC Code,APR MDC Description,APR Severity of Illness Code,APR Severity of Illness Description,APR Risk of Mortality,APR Medical Surgical Description,Payment Typology 1,Payment Typology 2,Payment Typology 3,Birth Weight,Abortion Edit Indicator,Emergency Department Indicator,Total Charges,Total Costs
New York City,Manhattan,7002001,001438,Bellevue Hospital Center,30 to 49,113,M,Other Race,Spanish/Hispanic,4,Emergency,Home or Self Care,2017,259,Residual codes; unclassified,198,MAG RESONANCE IMAGING,052,Nontraumatic stupor & coma,01,Diseases and Disorders of the Nervous System,1,Minor,Minor,Medical,Department of Corrections,,,,N,Y,32917.51,21223.50
New York City,Manhattan,7002001,001438,Bellevue Hospital Center,50 to 69,112,F,Black/African American,Not Span/Hispanic,1,Emergency,Home or Self Care,2017,111,Other and ill-defined cerebrovascular disease,000,NO PROC,052,Nontraumatic stupor & coma,01,Diseases and Disorders of the Nervous System,2,Moderate,Minor,Medical,Blue Cross/Blue Shield,,,,N,Y,12186.64,7857.31
New York City,Manhattan,7002001,001438,Bellevue Hospital Center,50 to 69,116,M,Other Race,Not Span/Hispanic,11,Emergency,Home or Self Care,2017,095,Other nervous system disorders,177,COMP AXIAL TOMOGR (CT),052,Nontraumatic stupor & coma,01,Diseases and Disorders of the Nervous System,3,Major,Minor,Medical,Medicaid,Medicaid,,,N,N,66141.59,42644.66
New York City,Manhattan,7002001,001438,Bellevue Hospital Center,0 to 17,100,M,Other Race,Not Span/Hispanic,2,Emergency,Home or Self Care,2017,259,Residual codes; unclassified,000,NO PROC,052,Nontraumatic stupor & coma,01,Diseases and Disorders of the Nervous System,1,Minor,Minor,Medical,Medicaid,Medicaid,,,N,N,11520.00,7427.50
New York City,Manhattan,7002001,001438,Bellevue Hospital Center,50 to 69,114,M,Black/African American,Not Span/Hispanic,14,Emergency,Skilled Nursing Home,2017,095,Other nervous system disorders,177,COMP AXIAL TOMOGR (CT),052,Nontraumatic stupor & coma,01,Diseases and Disorders of the Nervous System,3,Major,Major,Medical,Medicare,Medicaid,,,N,Y,80814.52,52105.00
New York City,Manhattan,7002001,001438,Bellevue Hospital Center,70 or Older,100,F,White,Not Span/Hispanic,1,Emergency,Home or Self Care,2017,112,Transient cerebral ischemia,000,NO PROC,052,Nontraumatic stupor & coma,01,Diseases and Disorders of the Nervous System,1,Minor,Minor,Medical,Private Health Insurance,Medicare,,,N,Y,13657.17,8805.43
New York City,Manhattan,7002001,001438,Bellevue Hospital Center,30 to 49,100,M,White,Not Span/Hispanic,2,Emergency,Left Against Medical Advice,2017,095,Other nervous system disorders,177,COMP AXIAL TOMOGR (CT),052,Nontraumatic stupor & coma,01,Diseases and Disorders of the Nervous System,2,Moderate,Minor,Medical,Medicaid,,,,N,Y,20386.16,13143.94
New York City,Manhattan,7002001,001438,Bellevue Hospital Center,50 to 69,100,M,Other Race,Not Span/Hispanic,3,Emergency,Home or Self Care,2017,095,Other nervous system disorders,177,COMP AXIAL TOMOGR (CT),052,Nontraumatic stupor & coma,01,Diseases and Disorders of the Nervous System,3,Major,Moderate,Medical,Medicare,Medicaid,,,N,Y,27479.06,17717.07
New York City,Manhattan,7002001,001438,Bellevue Hospital Center,50 to 69,104,M,Other Race,Not Span/Hispanic,1,Emergency,Left Against Medical Advice,2017,095,Other nervous system disorders,219,ALCO/DRUG REHAB/DETOX,052,Nontraumatic stupor & coma,01,Diseases and Disorders of the Nervous System,3,Major,Minor,Medical,Self-Pay,,,,N,Y,10558.38,6807.49
New York City,Manhattan,7002001,001438,Bellevue Hospital Center,0 to 17,112,M,Black/African American,Not Span/Hispanic,25,Emergency,Home or Self Care,2017,220,Intrauterine hypoxia and birth asphyxia,115,CIRCUMCISION,052,Nontraumatic stupor & coma,01,Diseases and Disorders of the Nervous System,3,Major,Moderate,Medical,Medicaid,Medicaid,,04300,N,N,96999.46,62540.21
New York City,Manhattan,7002001,001438,Bellevue Hospital Center,30 to 49,104,F,Other Race,Not Span/Hispanic,19,Emergency,Expired,2017,085,Coma; stupor; and brain damage,216,RESP INTUB/MECH VENTIL,052,Nontraumatic stupor & coma,01,Diseases and Disorders of the Nervous System,4,Extreme,Extreme,Medical,Medicaid,Medicaid,,,N,N,145540.34,93836.84
New York City,Manhattan,7002001,001438,Bellevue Hospital Center,70 or Older,100,M,Other Race,Not Span/Hispanic,11,Emergency,Home or Self Care,2017,095,Other nervous system disorders,222,BLOOD TRANSFUSION,052,Nontraumatic stupor & coma,01,Diseases and Disorders of the Nervous System,2,Moderate,Minor,Medical,Medicare,Private Health Insurance,,,N,Y,57990.34,37389.16
New York City,Manhattan,7002001,001438,Bellevue Hospital Center,30 to 49,112,F,Black/African American,Not Span/Hispanic,49,Emergency,Expired,2017,085,Coma; stupor; and brain damage,047,DX CARDIAC CATHETERIZTN,052,Nontraumatic stupor & coma,01,Diseases and Disorders of the Nervous System,4,Extreme,Extreme,Medical,Medicaid,Medicaid,,,N,Y,377730.72,243541.13
New York City,Manhattan,7002001,001438,Bellevue Hospital Center,50 to 69,111,F,Black/African American,Not Span/Hispanic,2,Emergency,Home or Self Care,2017,112,Transient cerebral ischemia,000,NO PROC,052,Nontraumatic stupor & coma,01,Diseases and Disorders of the Nervous System,1,Minor,Minor,Medical,Private Health Insurance,,,,N,Y,18711.88,12064.45
New York City,Manhattan,7002001,001438,Bellevue Hospital Center,70 or Older,112,F,Black/African American,Not Span/Hispanic,6,Emergency,Home or Self Care,2017,095,Other nervous system disorders,231,OTHER THERAPEUTIC PRCS,052,Nontraumatic stupor & coma,01,Diseases and Disorders of the Nervous System,3,Major,Major,Medical,Medicaid,Medicaid,,,N,Y,35944.62,23175.22
New York City,Manhattan,7002001,001438,Bellevue Hospital Center,30 to 49,100,M,Black/African American,Not Span/Hispanic,6,Emergency,Left Against Medical Advice,2017,095,Other nervous system disorders,171,SUTURE SKIN/SUBCUT TISS,052,Nontraumatic stupor & coma,01,Diseases and Disorders of the Nervous System,3,Major,Moderate,Medical,Medicaid,Medicaid,,,N,Y,37130.12,23939.57
New York City,Manhattan,7002001,001438,Bellevue Hospital Center,18 to 29,100,M,Other Race,Not Span/Hispanic,120 +,Emergency,Short-term Hospital,2017,085,Coma; stupor; and brain damage,231,OTHER THERAPEUTIC PRCS,052,Nontraumatic stupor & coma,01,Diseases and Disorders of the Nervous System,4,Extreme,Extreme,Medical,Medicaid,Medicaid,,,N,N,1130371.85,728804.99
New York City,Manhattan,7002001,001438,Bellevue Hospital Center,50 to 69,100,M,Black/African American,Not Span/Hispanic,2,Emergency,Home or Self Care,2017,259,Residual codes; unclassified,177,COMP AXIAL TOMOGR (CT),052,Nontraumatic stupor & coma,01,Diseases and Disorders of the Nervous System,1,Minor,Minor,Medical,Self-Pay,,,,N,Y,15757.81,10159.82
New York City,Manhattan,7002001,001438,Bellevue Hospital Center,50 to 69,113,F,Other Race,Not Span/Hispanic,6,Emergency,Home or Self Care,2017,095,Other nervous system disorders,199,ELECTROENCEPHALOGRAM,052,Nontraumatic stupor & coma,01,Diseases and Disorders of the Nervous System,3,Major,Moderate,Medical,Medicaid,,,,N,Y,49495.89,31912.38
New York City,Manhattan,7002001,001438,Bellevue Hospital Center,70 or Older,100,F,White,Not Span/Hispanic,6,Emergency,Expired,2017,085,Coma; stupor; and brain damage,216,RESP INTUB/MECH VENTIL,052,Nontraumatic stupor & coma,01,Diseases and Disorders of the Nervous System,4,Extreme,Extreme,Medical,Private Health Insurance,,,,N,Y,56686.12,36548.26
New York City,Manhattan,7002001,001438,Bellevue Hospital Center,50 to 69,113,F,Other Race,Not Span/Hispanic,1,Emergency,Home or Self Care,2017,112,Transient cerebral ischemia,177,COMP AXIAL TOMOGR (CT),052,Nontraumatic stupor & coma,01,Diseases and Disorders of the Nervous System,1,Minor,Minor,Medical,Self-Pay,,,,N,Y,17809.34,11482.54
New York City,Manhattan,7002001,001438,Bellevue Hospital Center,50 to 69,100,M,Other Race,Spanish/Hispanic,6,Emergency,Inpatient Rehabilitation Facility,2017,095,Other nervous system disorders,216,RESP INTUB/MECH VENTIL,052,Nontraumatic stupor & coma,01,Diseases and Disorders of the Nervous System,3,Major,Moderate,Medical,Self-Pay,,,,N,Y,46570.48,30026.22
New York City,Manhattan,7002001,001438,Bellevue Hospital Center,30 to 49,OOS,M,White,Not Span/Hispanic,1,Emergency,Home or Self Care,2017,085,Coma; stupor; and brain damage,222,BLOOD TRANSFUSION,052,Nontraumatic stupor & coma,01,Diseases and Disorders of the Nervous System,2,Moderate,Minor,Medical,Blue Cross/Blue Shield,,,,N,Y,9546.13,6154.85
New York City,Manhattan,7002001,001438,Bellevue Hospital Center,70 or Older,112,M,White,Not Span/Hispanic,5,Emergency,Home or Self Care,2017,095,Other nervous system disorders,004,DIAGNOSTIC SPINAL TAP,052,Nontraumatic stupor & coma,01,Diseases and Disorders of the Nervous System,2,Moderate,Minor,Medical,Medicare,Medicaid,,,N,Y,29462.12,18995.64
