Hospital Service Area,Hospital County,Operating Certificate Number,Permanent Facility Id,Facility Name,Age Group,Zip Code - 3 digits,Gender,Race,Ethnicity,Length of Stay,Type of Admission,Patient Disposition,Discharge Year,CCS Diagnosis Code,CCS Diagnosis Description,CCS Procedure Code,CCS Procedure Description,APR DRG Code,APR DRG Description,APR MDC Code,APR MDC Description,APR Severity of Illness Code,APR Severity of Illness Description,APR Risk of Mortality,APR Medical Surgical Description,Payment Typology 1,Payment Typology 2,Payment Typology 3,Birth Weight,Abortion Edit Indicator,Emergency Department Indicator,Total Charges,Total Costs
Western NY,Erie,1401014,000207,Buffalo General Medical Center,70 or Older,142,F,Black/African American,Not Span/Hispanic,12,Emergency,Home w/ Home Health Services,2018,NVS020,OTHER SPECIFIED NERVOUS SYSTEM DISORDERS,IMG008,ULTRASONOGRAPHY,052,ALTERATION IN CONSCIOUSNESS,01,DISEASES AND DISORDERS OF THE NERVOUS SYSTEM,3,Major,Major,Medical,Medicare,Private Health Insurance,Self-Pay,,,true,50871.24,19741.54
Finger Lakes,Monroe,2701003,000411,Rochester General Hospital,70 or Older,146,M,White,Not Span/Hispanic,4,Emergency,Skilled Nursing Home,2018,NVS020,OTHER SPECIFIED NERVOUS SYSTEM DISORDERS,,,052,ALTERATION IN CONSCIOUSNESS,01,DISEASES AND DISORDERS OF THE NERVOUS SYSTEM,3,Major,Moderate,Medical,Medicare,Medicaid,,,,true,15695.12,6851.68
Finger Lakes,Monroe,2701003,000411,Rochester General Hospital,70 or Older,146,M,White,Not Span/Hispanic,3,Emergency,Home w/ Home Health Services,2018,NVS020,OTHER SPECIFIED NERVOUS SYSTEM DISORDERS,,,052,ALTERATION IN CONSCIOUSNESS,01,DISEASES AND DISORDERS OF THE NERVOUS SYSTEM,4,Extreme,Extreme,Medical,Medicare,,,,,true,22520.64,6385.16
Capital/Adirond,Columbia,1001000,000146,Columbia Memorial Hospital,70 or Older,124,F,White,Not Span/Hispanic,7,Elective,Skilled Nursing Home,2018,NVS020,OTHER SPECIFIED NERVOUS SYSTEM DISORDERS,,,052,ALTERATION IN CONSCIOUSNESS,01,DISEASES AND DISORDERS OF THE NERVOUS SYSTEM,3,Major,Moderate,Medical,Medicare,Blue Cross/Blue Shield,,,,true,35374.34,9932.89
Long Island,Suffolk,5153000,000913,Huntington Hospital,70 or Older,117,F,Black/African American,Not Span/Hispanic,1,Emergency,Home or Self Care,2018,NVS020,OTHER SPECIFIED NERVOUS SYSTEM DISORDERS,,,052,ALTERATION IN CONSCIOUSNESS,01,DISEASES AND DISORDERS OF THE NERVOUS SYSTEM,3,Major,Moderate,Medical,Medicare,,,,,true,11502,3583.87
Finger Lakes,Wayne,5820000,001028,Newark-Wayne Community Hospital,70 or Older,145,F,White,Not Span/Hispanic,3,Emergency,Home or Self Care,2018,NVS020,OTHER SPECIFIED NERVOUS SYSTEM DISORDERS,,,052,ALTERATION IN CONSCIOUSNESS,01,DISEASES AND DISORDERS OF THE NERVOUS SYSTEM,3,Major,Moderate,Medical,Medicare,Blue Cross/Blue Shield,Private Health Insurance,,,true,13052.43,3530.27
Finger Lakes,Monroe,2701003,000411,Rochester General Hospital,50 to 69,,F,Black/African American,Not Span/Hispanic,5,Urgent,Home or Self Care,2018,NVS020,OTHER SPECIFIED NERVOUS SYSTEM DISORDERS,,,052,ALTERATION IN CONSCIOUSNESS,01,DISEASES AND DISORDERS OF THE NERVOUS SYSTEM,3,Major,Moderate,Medical,Medicare,Medicaid,,,,false,18586.59,7522.1
New York City,Manhattan,7002054,001458,New York-Presbyterian Hospital - New York Weill Cornell Center,70 or Older,101,M,Other Race,Not Span/Hispanic,12,Emergency,Expired,2018,NVS020,OTHER SPECIFIED NERVOUS SYSTEM DISORDERS,CNS002,LUMBAR PUNCTURE,052,ALTERATION IN CONSCIOUSNESS,01,DISEASES AND DISORDERS OF THE NERVOUS SYSTEM,4,Extreme,Extreme,Medical,Medicare,Medicare,Medicaid,,,true,253125.94,109749.95
New York City,Manhattan,7002054,001464,New York-Presbyterian Hospital - Columbia Presbyterian Center,0 to 17,100,F,Black/African American,Not Span/Hispanic,3,Urgent,Home or Self Care,2018,SYM010,NERVOUS SYSTEM SIGNS AND SYMPTOMS,MAM011,ELECTROENCEPHALOGRAM (EEG),052,ALTERATION IN CONSCIOUSNESS,01,DISEASES AND DISORDERS OF THE NERVOUS SYSTEM,2,Moderate,Minor,Medical,Private Health Insurance,Medicaid,Self-Pay,,,false,41748.23,9161.33
New York City,Manhattan,7002054,001437,New York-Presbyterian/Lower Manhattan Hospital,70 or Older,112,M,Other Race,Not Span/Hispanic,6,Emergency,Home w/ Home Health Services,2018,NVS020,OTHER SPECIFIED NERVOUS SYSTEM DISORDERS,ADM021,"ADMINISTRATION OF THERAPEUTIC SUBSTANCES, NEC",052,ALTERATION IN CONSCIOUSNESS,01,DISEASES AND DISORDERS OF THE NERVOUS SYSTEM,3,Major,Major,Medical,Medicare,Medicaid,Self-Pay,,,true,74493.83,16324.57
New York City,Queens,7002024,001639,Mount Sinai Hospital - Mount Sinai Hospital of Queens,70 or Older,111,F,White,Not Span/Hispanic,4,Emergency,Home w/ Home Health Services,2018,NVS020,OTHER SPECIFIED NERVOUS SYSTEM DISORDERS,IMG009,PLAIN RADIOGRAPHY,052,ALTERATION IN CONSCIOUSNESS,01,DISEASES AND DISORDERS OF THE NERVOUS SYSTEM,3,Major,Moderate,Medical,Medicare,Medicaid,,,,true,16672.91,4579.35
Finger Lakes,Monroe,2701005,000413,Strong Memorial Hospital,70 or Older,145,F,White,Not Span/Hispanic,2,Emergency,Home w/ Home Health Services,2018,CIR008,HYPERTENSION WITH COMPLICATIONS AND SECONDARY HYPERTENSION,,,052,ALTERATION IN CONSCIOUSNESS,01,DISEASES AND DISORDERS OF THE NERVOUS SYSTEM,1,Minor,Minor,Medical,Medicare,Medicare,Self-Pay,,,true,18182.85,5195.06
Long Island,Nassau,2951001,000541,North Shore University Hospital,70 or Older,114,F,White,Not Span/Hispanic,4,Emergency,Home or Self Care,2018,NVS020,OTHER SPECIFIED NERVOUS SYSTEM DISORDERS,,,052,ALTERATION IN CONSCIOUSNESS,01,DISEASES AND DISORDERS OF THE NERVOUS SYSTEM,3,Major,Moderate,Medical,Medicare,Private Health Insurance,,,,true,42412.55,7132.1
New York City,Manhattan,7002020,001453,Memorial Hospital for Cancer and Allied Diseases,70 or Older,112,M,Black/African American,Not Span/Hispanic,3,Emergency,Home or Self Care,2018,NVS020,OTHER SPECIFIED NERVOUS SYSTEM DISORDERS,,,052,ALTERATION IN CONSCIOUSNESS,01,DISEASES AND DISORDERS OF THE NERVOUS SYSTEM,3,Major,Major,Medical,Medicare,Private Health Insurance,,,,true,35931.75,13905.42
Central NY,Onondaga,3301007,000635,University Hospital SUNY Health Science Center,50 to 69,130,F,White,Not Span/Hispanic,1,Emergency,Home or Self Care,2018,NVS020,OTHER SPECIFIED NERVOUS SYSTEM DISORDERS,MAM011,ELECTROENCEPHALOGRAM (EEG),052,ALTERATION IN CONSCIOUSNESS,01,DISEASES AND DISORDERS OF THE NERVOUS SYSTEM,3,Major,Minor,Medical,Medicaid,,,,,false,15515.13,3085.46
New York City,Queens,7003003,001629,Jamaica Hospital Medical Center,70 or Older,114,M,White,Not Span/Hispanic,10,Emergency,Skilled Nursing Home,2018,CIR008,HYPERTENSION WITH COMPLICATIONS AND SECONDARY HYPERTENSION,,,052,ALTERATION IN CONSCIOUSNESS,01,DISEASES AND DISORDERS OF THE NERVOUS SYSTEM,3,Major,Major,Medical,Medicare,Blue Cross/Blue Shield,,,,true,49280,22579.54
Central NY,Onondaga,3301007,000635,University Hospital SUNY Health Science Center,30 to 49,131,M,White,Not Span/Hispanic,3,Emergency,Home or Self Care,2018,CIR024,OTHER AND ILL-DEFINED CEREBROVASCULAR DISEASE,IMG008,ULTRASONOGRAPHY,052,ALTERATION IN CONSCIOUSNESS,01,DISEASES AND DISORDERS OF THE NERVOUS SYSTEM,3,Major,Extreme,Medical,Private Health Insurance,,,,,false,39122.08,11225.3
Central NY,Oneida,3201002,000589,"Rome Memorial Hospital, Inc",70 or Older,134,F,White,Not Span/Hispanic,4,Emergency,Home or Self Care,2018,NVS020,OTHER SPECIFIED NERVOUS SYSTEM DISORDERS,,,052,ALTERATION IN CONSCIOUSNESS,01,DISEASES AND DISORDERS OF THE NERVOUS SYSTEM,3,Major,Moderate,Medical,Medicare,Medicaid,,,,true,30093.53,7142.45
Finger Lakes,Monroe,2701005,000413,Strong Memorial Hospital,50 to 69,145,M,White,Not Span/Hispanic,8,Emergency,Psychiatric Hospital or Unit of Hosp,2018,NVS020,OTHER SPECIFIED NERVOUS SYSTEM DISORDERS,,,052,ALTERATION IN CONSCIOUSNESS,01,DISEASES AND DISORDERS OF THE NERVOUS SYSTEM,3,Major,Minor,Medical,Medicare,,,,,true,19489.01,9649.19
Finger Lakes,Monroe,2701005,000413,Strong Memorial Hospital,70 or Older,144,M,White,Not Span/Hispanic,4,Emergency,Home w/ Home Health Services,2018,NVS020,OTHER SPECIFIED NERVOUS SYSTEM DISORDERS,MAM011,ELECTROENCEPHALOGRAM (EEG),052,ALTERATION IN CONSCIOUSNESS,01,DISEASES AND DISORDERS OF THE NERVOUS SYSTEM,3,Major,Major,Medical,Medicare,Blue Cross/Blue Shield,,,,true,14818.12,6107.83
Long Island,Nassau,7003004,000518,Long Island Jewish Valley Stream,70 or Older,110,F,Other Race,Unknown,2,Emergency,Skilled Nursing Home,2018,NVS020,OTHER SPECIFIED NERVOUS SYSTEM DISORDERS,,,052,ALTERATION IN CONSCIOUSNESS,01,DISEASES AND DISORDERS OF THE NERVOUS SYSTEM,3,Major,Moderate,Medical,Medicare,Medicare,Medicaid,,,true,40759.18,6929.79
New York City,Bronx,7000008,001172,Lincoln Medical & Mental Health Center,50 to 69,104,F,Black/African American,Not Span/Hispanic,3,Emergency,Home or Self Care,2018,NVS020,OTHER SPECIFIED NERVOUS SYSTEM DISORDERS,,,052,ALTERATION IN CONSCIOUSNESS,01,DISEASES AND DISORDERS OF THE NERVOUS SYSTEM,3,Major,Minor,Medical,Medicare,Medicare,Medicaid,,,true,19160,11315.07
New York City,Queens,7002024,001639,Mount Sinai Hospital - Mount Sinai Hospital of Queens,70 or Older,113,F,Other Race,Spanish/Hispanic,6,Emergency,Home w/ Home Health Services,2018,NVS020,OTHER SPECIFIED NERVOUS SYSTEM DISORDERS,ADM021,"ADMINISTRATION OF THERAPEUTIC SUBSTANCES, NEC",052,ALTERATION IN CONSCIOUSNESS,01,DISEASES AND DISORDERS OF THE NERVOUS SYSTEM,3,Major,Major,Medical,Medicare,Medicaid,Medicare,,,false,18168.64,4748.08
Finger Lakes,Wayne,5820000,001028,Newark-Wayne Community Hospital,70 or Older,144,F,White,Not Span/Hispanic,5,Emergency,Home or Self Care,2018,NVS020,OTHER SPECIFIED NERVOUS SYSTEM DISORDERS,,,052,ALTERATION IN CONSCIOUSNESS,01,DISEASES AND DISORDERS OF THE NERVOUS SYSTEM,3,Major,Minor,Medical,Medicare,,,,,true,17459.64,5332.53
Finger Lakes,Monroe,2701003,000411,Rochester General Hospital,50 to 69,146,M,Black/African American,Not Span/Hispanic,3,Emergency,Home w/ Home Health Services,2018,NVS020,OTHER SPECIFIED NERVOUS SYSTEM DISORDERS,,,052,ALTERATION IN CONSCIOUSNESS,01,DISEASES AND DISORDERS OF THE NERVOUS SYSTEM,3,Major,Major,Medical,Medicare,Medicaid,,,,true,16591.85,5704.81
Western NY,Erie,1401014,000207,Buffalo General Medical Center,70 or Older,141,F,White,Not Span/Hispanic,9,Emergency,Skilled Nursing Home,2018,NVS020,OTHER SPECIFIED NERVOUS SYSTEM DISORDERS,,,052,ALTERATION IN CONSCIOUSNESS,01,DISEASES AND DISORDERS OF THE NERVOUS SYSTEM,3,Major,Major,Medical,Medicare,Self-Pay,,,,true,31830.05,13935.93
Hudson Valley,Orange,3522000,000694,St Luke's Cornwall Hospital/Newburgh,70 or Older,125,F,Multi-racial,Unknown,3,Emergency,Home or Self Care,2018,NVS020,OTHER SPECIFIED NERVOUS SYSTEM DISORDERS,MAM007,ELECTROCARDIOGRAM (ECG),052,ALTERATION IN CONSCIOUSNESS,01,DISEASES AND DISORDERS OF THE NERVOUS SYSTEM,3,Major,Major,Medical,Medicare,,,,,true,55528.64,12427.98
Hudson Valley,Westchester,5957001,001139,Westchester Medical Center,30 to 49,123,F,White,Not Span/Hispanic,29,Emergency,Home or Self Care,2018,NVS020,OTHER SPECIFIED NERVOUS SYSTEM DISORDERS,ADM001,TRANSFUSION OF BLOOD AND BLOOD PRODUCTS,052,ALTERATION IN CONSCIOUSNESS,01,DISEASES AND DISORDERS OF THE NERVOUS SYSTEM,4,Extreme,Extreme,Medical,Blue Cross/Blue Shield,,,,,true,418647.83,78239.31
Finger Lakes,Monroe,2701003,000411,Rochester General Hospital,50 to 69,146,M,Black/African American,Not Span/Hispanic,11,Emergency,Skilled Nursing Home,2018,NVS020,OTHER SPECIFIED NERVOUS SYSTEM DISORDERS,ESA001,HEMODIALYSIS,052,ALTERATION IN CONSCIOUSNESS,01,DISEASES AND DISORDERS OF THE NERVOUS SYSTEM,3,Major,Moderate,Medical,Medicaid,,,,,true,42258.82,18986.94
Capital/Adirond,Albany,0101000,000001,Albany Medical Center Hospital,0 to 17,121,M,White,Not Span/Hispanic,3,Elective,Home or Self Care,2018,SYM010,NERVOUS SYSTEM SIGNS AND SYMPTOMS,MAM011,ELECTROENCEPHALOGRAM (EEG),052,ALTERATION IN CONSCIOUSNESS,01,DISEASES AND DISORDERS OF THE NERVOUS SYSTEM,2,Moderate,Minor,Medical,"Managed Care, Unspecified",,,,,false,19135.16,5962.79
Hudson Valley,Westchester,5922000,001122,New York - Presbyterian Hospital,70 or Older,105,F,White,Not Span/Hispanic,2,Emergency,Home or Self Care,2018,NVS012,TRANSIENT CEREBRAL ISCHEMIA,,,052,ALTERATION IN CONSCIOUSNESS,01,DISEASES AND DISORDERS OF THE NERVOUS SYSTEM,1,Minor,Minor,Medical,Medicare,Private Health Insurance,,,,true,35398.78,13341.83
Western NY,Erie,1401013,000292,Sisters of Charity Hospital - St. Joseph Campus,70 or Older,140,F,White,Not Span/Hispanic,3,Elective,Home or Self Care,2018,NVS020,OTHER SPECIFIED NERVOUS SYSTEM DISORDERS,,,052,ALTERATION IN CONSCIOUSNESS,01,DISEASES AND DISORDERS OF THE NERVOUS SYSTEM,3,Major,Moderate,Medical,Medicare,Medicare,,,,true,17417.52,6675.9
New York City,Queens,7003001,001628,Flushing Hospital Medical Center,50 to 69,104,M,White,Not Span/Hispanic,5,Emergency,Skilled Nursing Home,2018,NVS020,OTHER SPECIFIED NERVOUS SYSTEM DISORDERS,MAM011,ELECTROENCEPHALOGRAM (EEG),052,ALTERATION IN CONSCIOUSNESS,01,DISEASES AND DISORDERS OF THE NERVOUS SYSTEM,3,Major,Moderate,Medical,Medicaid,,,,,true,14323,9804.14
Hudson Valley,Westchester,5932000,001129,Phelps Hospital,70 or Older,105,F,White,Not Span/Hispanic,3,Emergency,Skilled Nursing Home,2018,NVS020,OTHER SPECIFIED NERVOUS SYSTEM DISORDERS,,,052,ALTERATION IN CONSCIOUSNESS,01,DISEASES AND DISORDERS OF THE NERVOUS SYSTEM,3,Major,Major,Medical,Medicare,Blue Cross/Blue Shield,,,,true,29712.31,12201.22
New York City,Queens,7001024,001635,St Johns Episcopal Hospital So Shore,50 to 69,116,M,Black/African American,Not Span/Hispanic,6,Emergency,Skilled Nursing Home,2018,NVS020,OTHER SPECIFIED NERVOUS SYSTEM DISORDERS,,,052,ALTERATION IN CONSCIOUSNESS,01,DISEASES AND DISORDERS OF THE NERVOUS SYSTEM,3,Major,Minor,Medical,Medicaid,,,,,true,57176.62,15706.35
New York City,Manhattan,7002017,001450,Lenox Hill Hospital,50 to 69,100,F,Other Race,Not Span/Hispanic,1,Emergency,Home or Self Care,2018,NVS012,TRANSIENT CEREBRAL ISCHEMIA,,,052,ALTERATION IN CONSCIOUSNESS,01,DISEASES AND DISORDERS OF THE NERVOUS SYSTEM,1,Minor,Minor,Medical,Self-Pay,Self-Pay,,,,true,32269.66,3684.62
Central NY,Onondaga,3301007,000635,University Hospital SUNY Health Science Center,50 to 69,130,M,White,Not Span/Hispanic,19,Emergency,Skilled Nursing Home,2018,NVS020,OTHER SPECIFIED NERVOUS SYSTEM DISORDERS,MAM011,ELECTROENCEPHALOGRAM (EEG),052,ALTERATION IN CONSCIOUSNESS,01,DISEASES AND DISORDERS OF THE NERVOUS SYSTEM,4,Extreme,Extreme,Medical,Medicare,,,,,true,245860.36,66356.87
Western NY,Erie,1401014,000208,John R. Oishei Children's Hospital,0 to 17,140,M,White,Not Span/Hispanic,3,Urgent,Home or Self Care,2018,NVS020,OTHER SPECIFIED NERVOUS SYSTEM DISORDERS,RES007,AIRWAY INTUBATION,052,ALTERATION IN CONSCIOUSNESS,01,DISEASES AND DISORDERS OF THE NERVOUS SYSTEM,4,Extreme,Extreme,Medical,Private Health Insurance,Self-Pay,,,,true,38062.18,14786.07
Hudson Valley,Rockland,4322000,000775,Helen Hayes Hospital,50 to 69,109,F,White,Unknown,19,Elective,Home or Self Care,2018,NVS020,OTHER SPECIFIED NERVOUS SYSTEM DISORDERS,,,052,ALTERATION IN CONSCIOUSNESS,01,DISEASES AND DISORDERS OF THE NERVOUS SYSTEM,3,Major,Minor,Medical,Private Health Insurance,,,,,false,49718,38678.94
Central NY,Onondaga,3301007,000628,UPSTATE University Hospital at Community General,70 or Older,131,M,White,Not Span/Hispanic,7,Emergency,Skilled Nursing Home,2018,NVS020,OTHER SPECIFIED NERVOUS SYSTEM DISORDERS,IMG008,ULTRASONOGRAPHY,052,ALTERATION IN CONSCIOUSNESS,01,DISEASES AND DISORDERS OF THE NERVOUS SYSTEM,3,Major,Major,Medical,Medicare,Blue Cross/Blue Shield,,,,true,49078.16,12296.65
New York City,Manhattan,7002054,001437,New York-Presbyterian/Lower Manhattan Hospital,50 to 69,100,M,Other Race,Not Span/Hispanic,8,Emergency,Skilled Nursing Home,2018,CIR008,HYPERTENSION WITH COMPLICATIONS AND SECONDARY HYPERTENSION,ADM021,"ADMINISTRATION OF THERAPEUTIC SUBSTANCES, NEC",052,ALTERATION IN CONSCIOUSNESS,01,DISEASES AND DISORDERS OF THE NERVOUS SYSTEM,3,Major,Moderate,Medical,Medicare,Medicare,Self-Pay,,,true,142310.85,47084.36
Western NY,Cattaraugus,0401001,000066,Olean General Hospital,70 or Older,148,M,White,Not Span/Hispanic,3,Urgent,Skilled Nursing Home,2018,NVS020,OTHER SPECIFIED NERVOUS SYSTEM DISORDERS,,,052,ALTERATION IN CONSCIOUSNESS,01,DISEASES AND DISORDERS OF THE NERVOUS SYSTEM,3,Major,Major,Medical,Medicare,Medicaid,,,,false,11739.1,4333.53
Capital/Adirond,Albany,0101000,000001,Albany Medical Center Hospital,70 or Older,122,F,Black/African American,Not Span/Hispanic,6,Emergency,Home or Self Care,2018,NVS020,OTHER SPECIFIED NERVOUS SYSTEM DISORDERS,ESA001,HEMODIALYSIS,052,ALTERATION IN CONSCIOUSNESS,01,DISEASES AND DISORDERS OF THE NERVOUS SYSTEM,3,Major,Major,Medical,Medicare,,,,,true,34955.05,10085.35
New York City,Manhattan,7002024,001456,Mount Sinai Hospital,50 to 69,100,M,Black/African American,Not Span/Hispanic,8,Emergency,Home w/ Home Health Services,2018,CIR008,HYPERTENSION WITH COMPLICATIONS AND SECONDARY HYPERTENSION,ESA001,HEMODIALYSIS,052,ALTERATION IN CONSCIOUSNESS,01,DISEASES AND DISORDERS OF THE NERVOUS SYSTEM,3,Major,Major,Medical,Medicare,Medicaid,Self-Pay,,,true,82221.7,26320.84
New York City,Queens,7001024,001635,St Johns Episcopal Hospital So Shore,70 or Older,116,M,Other Race,Unknown,7,Emergency,Inpatient Rehabilitation Facility,2018,NVS020,OTHER SPECIFIED NERVOUS SYSTEM DISORDERS,,,052,ALTERATION IN CONSCIOUSNESS,01,DISEASES AND DISORDERS OF THE NERVOUS SYSTEM,3,Major,Major,Medical,Medicare,Medicaid,,,,true,60872.35,14877.75
New York City,Bronx,7000006,003058,Montefiore Med Center - Jack D Weiler Hosp of A Einstein College Div,30 to 49,104,M,Other Race,Spanish/Hispanic,7,Emergency,Home or Self Care,2018,NVS020,OTHER SPECIFIED NERVOUS SYSTEM DISORDERS,ADM017,ADMINISTRATION OF NUTRITIONAL AND ELECTROLYTIC SUBSTANCES,052,ALTERATION IN CONSCIOUSNESS,01,DISEASES AND DISORDERS OF THE NERVOUS SYSTEM,3,Major,Minor,Medical,Medicaid,,,,,true,67934.43,11136.42
New York City,Kings,7001020,001305,Maimonides Medical Center,70 or Older,112,F,Other Race,Not Span/Hispanic,5,Emergency,Home w/ Home Health Services,2018,NVS020,OTHER SPECIFIED NERVOUS SYSTEM DISORDERS,IMG008,ULTRASONOGRAPHY,052,ALTERATION IN CONSCIOUSNESS,01,DISEASES AND DISORDERS OF THE NERVOUS SYSTEM,3,Major,Major,Medical,Medicare,Medicare,Medicaid,,,true,57830.04,8955.92
Hudson Valley,Orange,3523000,000699,Garnet Health Medical Center,50 to 69,127,F,White,Not Span/Hispanic,3,Emergency,Home or Self Care,2018,CIR008,HYPERTENSION WITH COMPLICATIONS AND SECONDARY HYPERTENSION,,,052,ALTERATION IN CONSCIOUSNESS,01,DISEASES AND DISORDERS OF THE NERVOUS SYSTEM,2,Moderate,Moderate,Medical,Medicare,,,,,true,42730.4,8911.28
New York City,Bronx,7000006,003058,Montefiore Med Center - Jack D Weiler Hosp of A Einstein College Div,50 to 69,104,M,Black/African American,Not Span/Hispanic,5,Emergency,Skilled Nursing Home,2018,SYM010,NERVOUS SYSTEM SIGNS AND SYMPTOMS,ESA001,HEMODIALYSIS,052,ALTERATION IN CONSCIOUSNESS,01,DISEASES AND DISORDERS OF THE NERVOUS SYSTEM,3,Major,Moderate,Medical,Medicare,Medicaid,,,,true,59560.73,9781.05
New York City,Bronx,7000006,003058,Montefiore Med Center - Jack D Weiler Hosp of A Einstein College Div,70 or Older,104,M,White,Not Span/Hispanic,18,Emergency,Inpatient Rehabilitation Facility,2018,NVS020,OTHER SPECIFIED NERVOUS SYSTEM DISORDERS,CNS002,LUMBAR PUNCTURE,052,ALTERATION IN CONSCIOUSNESS,01,DISEASES AND DISORDERS OF THE NERVOUS SYSTEM,3,Major,Major,Medical,Medicare,Private Health Insurance,,,,true,237489.97,34170.28
Long Island,Nassau,2908000,000511,NYU Langone Hospital-Long Island,0 to 17,115,F,Other Race,Spanish/Hispanic,2,Elective,Home or Self Care,2018,SYM010,NERVOUS SYSTEM SIGNS AND SYMPTOMS,MAM011,ELECTROENCEPHALOGRAM (EEG),052,ALTERATION IN CONSCIOUSNESS,01,DISEASES AND DISORDERS OF THE NERVOUS SYSTEM,1,Minor,Minor,Medical,Medicaid,Medicaid,,,,false,62152.82,5593.87
Southern Tier,Broome,0303001,000058,United Health Services Hospitals Inc. - Wilson Medical Center,50 to 69,139,F,White,Not Span/Hispanic,8,Emergency,Home w/ Home Health Services,2018,CIR024,OTHER AND ILL-DEFINED CEREBROVASCULAR DISEASE,GIS017,GASTROSTOMY,052,ALTERATION IN CONSCIOUSNESS,01,DISEASES AND DISORDERS OF THE NERVOUS SYSTEM,3,Major,Major,Medical,Medicaid,Medicaid,,,,true,42582,15704.61
New York City,Manhattan,7002032,001469,Mount Sinai Morningside,70 or Older,100,M,Black/African American,Not Span/Hispanic,3,Emergency,Home or Self Care,2018,NVS020,OTHER SPECIFIED NERVOUS SYSTEM DISORDERS,ESA001,HEMODIALYSIS,052,ALTERATION IN CONSCIOUSNESS,01,DISEASES AND DISORDERS OF THE NERVOUS SYSTEM,3,Major,Moderate,Medical,Medicare,Medicare,Self-Pay,,,false,34279.88,9022.39
Long Island,Nassau,2908000,000511,NYU Langone Hospital-Long Island,50 to 69,117,M,White,Not Span/Hispanic,1,Emergency,Home or Self Care,2018,NVS012,TRANSIENT CEREBRAL ISCHEMIA,,,052,ALTERATION IN CONSCIOUSNESS,01,DISEASES AND DISORDERS OF THE NERVOUS SYSTEM,1,Minor,Minor,Medical,Blue Cross/Blue Shield,,,,,true,49937.92,4462.1
Western NY,Erie,1401014,003067,Millard Fillmore Suburban Hospital,50 to 69,140,M,White,Not Span/Hispanic,8,Emergency,Psychiatric Hospital or Unit of Hosp,2018,NVS020,OTHER SPECIFIED NERVOUS SYSTEM DISORDERS,CNS002,LUMBAR PUNCTURE,052,ALTERATION IN CONSCIOUSNESS,01,DISEASES AND DISORDERS OF THE NERVOUS SYSTEM,3,Major,Moderate,Medical,Medicaid,Self-Pay,,,,true,37487.74,14607.03
New York City,Kings,7002002,001324,Mount Sinai Brooklyn,50 to 69,112,F,White,Not Span/Hispanic,3,Emergency,Home or Self Care,2018,NVS012,TRANSIENT CEREBRAL ISCHEMIA,IMG008,ULTRASONOGRAPHY,052,ALTERATION IN CONSCIOUSNESS,01,DISEASES AND DISORDERS OF THE NERVOUS SYSTEM,1,Minor,Minor,Medical,Medicare,Medicaid,Self-Pay,,,true,35630.05,6070.97
Capital/Adirond,Schenectady,4601001,000829,Ellis Hospital,70 or Older,121,M,White,Not Span/Hispanic,8,Emergency,Skilled Nursing Home,2018,NVS020,OTHER SPECIFIED NERVOUS SYSTEM DISORDERS,ADM001,TRANSFUSION OF BLOOD AND BLOOD PRODUCTS,052,ALTERATION IN CONSCIOUSNESS,01,DISEASES AND DISORDERS OF THE NERVOUS SYSTEM,3,Major,Moderate,Medical,Medicare,Medicare,,,,true,32689.9,10541.2
Long Island,Suffolk,5153000,000913,Huntington Hospital,70 or Older,117,F,White,Not Span/Hispanic,2,Emergency,Home or Self Care,2018,NVS012,TRANSIENT CEREBRAL ISCHEMIA,,,052,ALTERATION IN CONSCIOUSNESS,01,DISEASES AND DISORDERS OF THE NERVOUS SYSTEM,1,Minor,Minor,Medical,Medicare,Private Health Insurance,,,,true,38009.06,8941.16
Capital/Adirond,Albany,0101000,000001,Albany Medical Center Hospital,70 or Older,121,F,White,Not Span/Hispanic,8,Emergency,Skilled Nursing Home,2018,NVS020,OTHER SPECIFIED NERVOUS SYSTEM DISORDERS,,,052,ALTERATION IN CONSCIOUSNESS,01,DISEASES AND DISORDERS OF THE NERVOUS SYSTEM,3,Major,Extreme,Medical,Medicare,,,,,true,39492.2,10731.26
Capital/Adirond,Albany,0101000,000001,Albany Medical Center Hospital,18 to 29,138,F,White,Not Span/Hispanic,2,Elective,Home or Self Care,2018,SYM010,NERVOUS SYSTEM SIGNS AND SYMPTOMS,MAM011,ELECTROENCEPHALOGRAM (EEG),052,ALTERATION IN CONSCIOUSNESS,01,DISEASES AND DISORDERS OF THE NERVOUS SYSTEM,1,Minor,Minor,Medical,"Managed Care, Unspecified",,,,,false,16787,4898.45
Western NY,Erie,1401014,000207,Buffalo General Medical Center,70 or Older,140,F,White,Not Span/Hispanic,4,Emergency,Skilled Nursing Home,2018,NVS020,OTHER SPECIFIED NERVOUS SYSTEM DISORDERS,,,052,ALTERATION IN CONSCIOUSNESS,01,DISEASES AND DISORDERS OF THE NERVOUS SYSTEM,3,Major,Moderate,Medical,Medicare,Self-Pay,,,,true,10990.32,4862.4
New York City,Queens,7003004,001630,Long Island Jewish Medical Center,70 or Older,113,F,White,Not Span/Hispanic,15,Emergency,Skilled Nursing Home,2018,NVS020,OTHER SPECIFIED NERVOUS SYSTEM DISORDERS,GIS017,GASTROSTOMY,052,ALTERATION IN CONSCIOUSNESS,01,DISEASES AND DISORDERS OF THE NERVOUS SYSTEM,3,Major,Major,Medical,Medicare,Blue Cross/Blue Shield,Self-Pay,,,true,243794.03,118390.21