Hospital Service Area,Hospital County,Operating Certificate Number,Permanent Facility Id,Facility Name,Age Group,Zip Code - 3 digits,Gender,Race,Ethnicity,Length of Stay,Type of Admission,Patient Disposition,Discharge Year,CCS Diagnosis Code,CCS Diagnosis Description,CCS Procedure Code,CCS Procedure Description,APR DRG Code,APR DRG Description,APR MDC Code,APR MDC Description,APR Severity of Illness Code,APR Severity of Illness Description,APR Risk of Mortality,APR Medical Surgical Description,Payment Typology 1,Payment Typology 2,Payment Typology 3,Birth Weight,Abortion Edit Indicator,Emergency Department Indicator,Total Charges,Total Costs
New York City,Manhattan,7002053,001463,NYU Langone Hospitals,70 or Older,100,F,White,Not Span/Hispanic,3,Elective,Home or Self Care,2019,NVS020,OTHER SPECIFIED NERVOUS SYSTEM DISORDERS,MAM011,ELECTROENCEPHALOGRAM (EEG),052,ALTERATION IN CONSCIOUSNESS,01,DISEASES AND DISORDERS OF THE NERVOUS SYSTEM,3,Major,Moderate,Medical,Medicare,Blue Cross/Blue Shield,,,,false,101728.5,21383.55
New York City,Manhattan,7002053,001463,NYU Langone Hospitals,0 to 17,117,F,Other Race,Spanish/Hispanic,1,Elective,Home w/ Home Health Services,2019,SYM010,NERVOUS SYSTEM SIGNS AND SYMPTOMS,MAM011,ELECTROENCEPHALOGRAM (EEG),052,ALTERATION IN CONSCIOUSNESS,01,DISEASES AND DISORDERS OF THE NERVOUS SYSTEM,2,Moderate,Minor,Medical,Medicaid,,,,,false,36944.22,3660.56
New York City,Manhattan,7002053,001463,NYU Langone Hospitals,70 or Older,111,M,Other Race,Unknown,6,Emergency,Skilled Nursing Home,2019,NVS020,OTHER SPECIFIED NERVOUS SYSTEM DISORDERS,CNS002,LUMBAR PUNCTURE,052,ALTERATION IN CONSCIOUSNESS,01,DISEASES AND DISORDERS OF THE NERVOUS SYSTEM,4,Extreme,Major,Medical,Medicare,Medicare,,,,true,95373.01,22317.81
New York City,Manhattan,7002053,001463,NYU Langone Hospitals,50 to 69,OOS,M,White,Not Span/Hispanic,7,Emergency,Inpatient Rehabilitation Facility,2019,NVS020,OTHER SPECIFIED NERVOUS SYSTEM DISORDERS,,,052,ALTERATION IN CONSCIOUSNESS,01,DISEASES AND DISORDERS OF THE NERVOUS SYSTEM,3,Major,Moderate,Medical,Medicare,Private Health Insurance,,,,true,86790.76,30649.59
New York City,Manhattan,7002053,001463,NYU Langone Hospitals,70 or Older,100,M,White,Not Span/Hispanic,16,Emergency,Skilled Nursing Home,2019,NVS020,OTHER SPECIFIED NERVOUS SYSTEM DISORDERS,ESA001,HEMODIALYSIS,052,ALTERATION IN CONSCIOUSNESS,01,DISEASES AND DISORDERS OF THE NERVOUS SYSTEM,4,Extreme,Major,Medical,Medicare,Blue Cross/Blue Shield,,,,true,261684.67,72987.39
New York City,Manhattan,7002053,001463,NYU Langone Hospitals,70 or Older,100,M,White,Not Span/Hispanic,5,Emergency,Home w/ Home Health Services,2019,NVS020,OTHER SPECIFIED NERVOUS SYSTEM DISORDERS,MAM005,MEASUREMENT DURING CARDIAC CATHETERIZATION,052,ALTERATION IN CONSCIOUSNESS,01,DISEASES AND DISORDERS OF THE NERVOUS SYSTEM,3,Major,Moderate,Medical,Medicare,Blue Cross/Blue Shield,,,,true,193443.28,43715.53
New York City,Manhattan,7002053,001463,NYU Langone Hospitals,0 to 17,113,M,Other Race,Not Span/Hispanic,2,Elective,Home or Self Care,2019,SYM010,NERVOUS SYSTEM SIGNS AND SYMPTOMS,MAM011,ELECTROENCEPHALOGRAM (EEG),052,ALTERATION IN CONSCIOUSNESS,01,DISEASES AND DISORDERS OF THE NERVOUS SYSTEM,1,Minor,Minor,Medical,Medicaid,,,,,false,35737.33,5788.97
New York City,Manhattan,7002053,001463,NYU Langone Hospitals,50 to 69,100,M,White,Not Span/Hispanic,1,Emergency,Home or Self Care,2019,NVS020,OTHER SPECIFIED NERVOUS SYSTEM DISORDERS,,,052,ALTERATION IN CONSCIOUSNESS,01,DISEASES AND DISORDERS OF THE NERVOUS SYSTEM,2,Moderate,Moderate,Medical,Private Health Insurance,,,,,true,44647.13,11566.1
New York City,Manhattan,7002053,001463,NYU Langone Hospitals,70 or Older,112,F,Black/African American,Not Span/Hispanic,2,Emergency,Home or Self Care,2019,NVS020,OTHER SPECIFIED NERVOUS SYSTEM DISORDERS,MAM011,ELECTROENCEPHALOGRAM (EEG),052,ALTERATION IN CONSCIOUSNESS,01,DISEASES AND DISORDERS OF THE NERVOUS SYSTEM,3,Major,Moderate,Medical,Medicaid,,,,,true,43565.41,9726.98
New York City,Manhattan,7002053,001463,NYU Langone Hospitals,50 to 69,128,M,White,Not Span/Hispanic,4,Emergency,Inpatient Rehabilitation Facility,2019,NVS020,OTHER SPECIFIED NERVOUS SYSTEM DISORDERS,MAM005,MEASUREMENT DURING CARDIAC CATHETERIZATION,052,ALTERATION IN CONSCIOUSNESS,01,DISEASES AND DISORDERS OF THE NERVOUS SYSTEM,3,Major,Moderate,Medical,Medicare,Medicaid,,,,false,153918.31,39554.67
New York City,Manhattan,7002053,001463,NYU Langone Hospitals,70 or Older,100,M,White,Not Span/Hispanic,2,Emergency,Home w/ Home Health Services,2019,NVS020,OTHER SPECIFIED NERVOUS SYSTEM DISORDERS,,,052,ALTERATION IN CONSCIOUSNESS,01,DISEASES AND DISORDERS OF THE NERVOUS SYSTEM,3,Major,Major,Medical,Medicare,,,,,true,41468.83,10446.39
New York City,Manhattan,7002053,001463,NYU Langone Hospitals,0 to 17,109,F,White,Not Span/Hispanic,2,Elective,Home or Self Care,2019,SYM010,NERVOUS SYSTEM SIGNS AND SYMPTOMS,MAM011,ELECTROENCEPHALOGRAM (EEG),052,ALTERATION IN CONSCIOUSNESS,01,DISEASES AND DISORDERS OF THE NERVOUS SYSTEM,2,Moderate,Minor,Medical,Private Health Insurance,,,,,false,38179.84,6109.72
New York City,Manhattan,7002053,001463,NYU Langone Hospitals,70 or Older,100,M,White,Not Span/Hispanic,6,Emergency,Home or Self Care,2019,NVS020,OTHER SPECIFIED NERVOUS SYSTEM DISORDERS,,,052,ALTERATION IN CONSCIOUSNESS,01,DISEASES AND DISORDERS OF THE NERVOUS SYSTEM,3,Major,Major,Medical,Medicare,Private Health Insurance,,,,true,83857.94,23880.87
New York City,Manhattan,7002053,001463,NYU Langone Hospitals,70 or Older,100,F,White,Not Span/Hispanic,1,Emergency,Home w/ Home Health Services,2019,NVS020,OTHER SPECIFIED NERVOUS SYSTEM DISORDERS,,,052,ALTERATION IN CONSCIOUSNESS,01,DISEASES AND DISORDERS OF THE NERVOUS SYSTEM,3,Major,Moderate,Medical,Medicare,,,,,true,30615.85,5394.15
New York City,Manhattan,7002053,001463,NYU Langone Hospitals,0 to 17,143,F,Multi-racial,Not Span/Hispanic,4,Emergency,Home or Self Care,2019,SYM010,NERVOUS SYSTEM SIGNS AND SYMPTOMS,MAM011,ELECTROENCEPHALOGRAM (EEG),052,ALTERATION IN CONSCIOUSNESS,01,DISEASES AND DISORDERS OF THE NERVOUS SYSTEM,3,Major,Major,Medical,Medicaid,,,,,true,59614.02,14105.67
New York City,Manhattan,7002053,001463,NYU Langone Hospitals,30 to 49,100,F,White,Not Span/Hispanic,3,Emergency,Home or Self Care,2019,NVS020,OTHER SPECIFIED NERVOUS SYSTEM DISORDERS,MAM011,ELECTROENCEPHALOGRAM (EEG),052,ALTERATION IN CONSCIOUSNESS,01,DISEASES AND DISORDERS OF THE NERVOUS SYSTEM,3,Major,Minor,Medical,Blue Cross/Blue Shield,,,,,true,36320.92,12695.78
New York City,Manhattan,7002053,001463,NYU Langone Hospitals,0 to 17,109,F,White,Not Span/Hispanic,1,Elective,Home or Self Care,2019,SYM010,NERVOUS SYSTEM SIGNS AND SYMPTOMS,MAM011,ELECTROENCEPHALOGRAM (EEG),052,ALTERATION IN CONSCIOUSNESS,01,DISEASES AND DISORDERS OF THE NERVOUS SYSTEM,1,Minor,Minor,Medical,Private Health Insurance,,,,,false,30158,3321.83
New York City,Manhattan,7002053,001463,NYU Langone Hospitals,50 to 69,115,M,White,Not Span/Hispanic,2,Emergency,Home w/ Home Health Services,2019,NVS020,OTHER SPECIFIED NERVOUS SYSTEM DISORDERS,MST001,ARTHROCENTESIS,052,ALTERATION IN CONSCIOUSNESS,01,DISEASES AND DISORDERS OF THE NERVOUS SYSTEM,3,Major,Major,Medical,Medicare,Medicare,,,,true,52174.01,11666.84
New York City,Manhattan,7002053,001463,NYU Langone Hospitals,70 or Older,112,F,White,Not Span/Hispanic,4,Emergency,Skilled Nursing Home,2019,NVS020,OTHER SPECIFIED NERVOUS SYSTEM DISORDERS,,,052,ALTERATION IN CONSCIOUSNESS,01,DISEASES AND DISORDERS OF THE NERVOUS SYSTEM,3,Major,Moderate,Medical,Medicare,Medicare,,,,true,60156.77,21710.32
New York City,Manhattan,7002053,001463,NYU Langone Hospitals,70 or Older,112,F,White,Not Span/Hispanic,9,Emergency,Skilled Nursing Home,2019,NVS020,OTHER SPECIFIED NERVOUS SYSTEM DISORDERS,,,052,ALTERATION IN CONSCIOUSNESS,01,DISEASES AND DISORDERS OF THE NERVOUS SYSTEM,4,Extreme,Major,Medical,Medicare,Medicaid,,,,true,139942.74,34584.72
New York City,Manhattan,7002053,001463,NYU Langone Hospitals,70 or Older,100,M,White,Not Span/Hispanic,2,Emergency,Home w/ Home Health Services,2019,SYM010,NERVOUS SYSTEM SIGNS AND SYMPTOMS,IMG008,ULTRASONOGRAPHY,052,ALTERATION IN CONSCIOUSNESS,01,DISEASES AND DISORDERS OF THE NERVOUS SYSTEM,3,Major,Minor,Medical,Medicare,Medicare,,,,true,158888.84,21783.09
New York City,Manhattan,7002053,001463,NYU Langone Hospitals,70 or Older,112,F,White,Not Span/Hispanic,8,Emergency,Skilled Nursing Home,2019,NVS020,OTHER SPECIFIED NERVOUS SYSTEM DISORDERS,MAM011,ELECTROENCEPHALOGRAM (EEG),052,ALTERATION IN CONSCIOUSNESS,01,DISEASES AND DISORDERS OF THE NERVOUS SYSTEM,3,Major,Moderate,Medical,Medicare,Blue Cross/Blue Shield,,,,true,237921.1,48383.96
New York City,Manhattan,7002053,001463,NYU Langone Hospitals,50 to 69,OOS,F,Other Race,Not Span/Hispanic,1,Emergency,Home or Self Care,2019,NVS012,TRANSIENT CEREBRAL ISCHEMIA,,,052,ALTERATION IN CONSCIOUSNESS,01,DISEASES AND DISORDERS OF THE NERVOUS SYSTEM,1,Minor,Minor,Medical,Blue Cross/Blue Shield,,,,,true,45755.4,5991.98
New York City,Manhattan,7002053,001463,NYU Langone Hospitals,18 to 29,112,F,White,Unknown,3,Emergency,Home w/ Home Health Services,2019,NVS020,OTHER SPECIFIED NERVOUS SYSTEM DISORDERS,MAM011,ELECTROENCEPHALOGRAM (EEG),052,ALTERATION IN CONSCIOUSNESS,01,DISEASES AND DISORDERS OF THE NERVOUS SYSTEM,4,Extreme,Major,Medical,Medicaid,,,,,true,149507.53,23850.73
New York City,Manhattan,7002053,001463,NYU Langone Hospitals,50 to 69,104,M,Other Race,Not Span/Hispanic,24,Urgent,Inpatient Rehabilitation Facility,2019,NVS020,OTHER SPECIFIED NERVOUS SYSTEM DISORDERS,OTR004,ISOLATION PROCEDURES,052,ALTERATION IN CONSCIOUSNESS,01,DISEASES AND DISORDERS OF THE NERVOUS SYSTEM,4,Extreme,Major,Medical,Private Health Insurance,,,,,false,272250,90359.79
New York City,Manhattan,7002053,001463,NYU Langone Hospitals,18 to 29,112,F,White,Not Span/Hispanic,5,Emergency,Home w/ Home Health Services,2019,SYM010,NERVOUS SYSTEM SIGNS AND SYMPTOMS,ADM017,ADMINISTRATION OF NUTRITIONAL AND ELECTROLYTIC SUBSTANCES,052,ALTERATION IN CONSCIOUSNESS,01,DISEASES AND DISORDERS OF THE NERVOUS SYSTEM,4,Extreme,Minor,Medical,Blue Cross/Blue Shield,Medicaid,,,,true,131139.27,22973.24
New York City,Manhattan,7002053,001463,NYU Langone Hospitals,18 to 29,OOS,M,Other Race,Not Span/Hispanic,3,Emergency,Home or Self Care,2019,NVS020,OTHER SPECIFIED NERVOUS SYSTEM DISORDERS,MAM011,ELECTROENCEPHALOGRAM (EEG),052,ALTERATION IN CONSCIOUSNESS,01,DISEASES AND DISORDERS OF THE NERVOUS SYSTEM,3,Major,Moderate,Medical,Private Health Insurance,,,,,true,142061.31,22634.86
New York City,Manhattan,7002053,001463,NYU Langone Hospitals,70 or Older,113,F,White,Not Span/Hispanic,11,Emergency,Inpatient Rehabilitation Facility,2019,NVS020,OTHER SPECIFIED NERVOUS SYSTEM DISORDERS,CNS002,LUMBAR PUNCTURE,052,ALTERATION IN CONSCIOUSNESS,01,DISEASES AND DISORDERS OF THE NERVOUS SYSTEM,3,Major,Major,Medical,Medicare,Private Health Insurance,,,,true,343169.38,50885.16
New York City,Manhattan,7002053,001463,NYU Langone Hospitals,0 to 17,114,M,White,Not Span/Hispanic,2,Elective,Home or Self Care,2019,SYM010,NERVOUS SYSTEM SIGNS AND SYMPTOMS,MAM011,ELECTROENCEPHALOGRAM (EEG),052,ALTERATION IN CONSCIOUSNESS,01,DISEASES AND DISORDERS OF THE NERVOUS SYSTEM,2,Moderate,Minor,Medical,Blue Cross/Blue Shield,,,,,false,68146.72,6743.04
New York City,Manhattan,7002053,001463,NYU Langone Hospitals,50 to 69,113,F,White,Not Span/Hispanic,4,Emergency,Home or Self Care,2019,NVS020,OTHER SPECIFIED NERVOUS SYSTEM DISORDERS,CNS002,LUMBAR PUNCTURE,052,ALTERATION IN CONSCIOUSNESS,01,DISEASES AND DISORDERS OF THE NERVOUS SYSTEM,2,Moderate,Minor,Medical,Medicare,Blue Cross/Blue Shield,,,,true,74744.56,17556.9
New York City,Manhattan,7002053,001463,NYU Langone Hospitals,70 or Older,113,M,White,Not Span/Hispanic,1,Emergency,Home w/ Home Health Services,2019,NVS020,OTHER SPECIFIED NERVOUS SYSTEM DISORDERS,,,052,ALTERATION IN CONSCIOUSNESS,01,DISEASES AND DISORDERS OF THE NERVOUS SYSTEM,3,Major,Major,Medical,Medicare,Blue Cross/Blue Shield,,,,true,43588.37,12686.5
New York City,Manhattan,7002053,001463,NYU Langone Hospitals,50 to 69,104,F,Other Race,Spanish/Hispanic,4,Emergency,Hospice - Home,2019,NVS020,OTHER SPECIFIED NERVOUS SYSTEM DISORDERS,RES001,BRONCHOSCOPY (DIAGNOSTIC),052,ALTERATION IN CONSCIOUSNESS,01,DISEASES AND DISORDERS OF THE NERVOUS SYSTEM,3,Major,Major,Medical,Medicare,Medicaid,,,,true,86611.22,21794.11
New York City,Manhattan,7002053,001463,NYU Langone Hospitals,70 or Older,113,M,White,Not Span/Hispanic,7,Emergency,Home w/ Home Health Services,2019,NVS020,OTHER SPECIFIED NERVOUS SYSTEM DISORDERS,MAM011,ELECTROENCEPHALOGRAM (EEG),052,ALTERATION IN CONSCIOUSNESS,01,DISEASES AND DISORDERS OF THE NERVOUS SYSTEM,3,Major,Moderate,Medical,Medicare,,,,,true,118437.77,27526.69
New York City,Manhattan,7002053,001463,NYU Langone Hospitals,70 or Older,100,M,Other Race,Unknown,6,Emergency,Home or Self Care,2019,NVS020,OTHER SPECIFIED NERVOUS SYSTEM DISORDERS,,,052,ALTERATION IN CONSCIOUSNESS,01,DISEASES AND DISORDERS OF THE NERVOUS SYSTEM,3,Major,Major,Medical,Medicare,,,,,true,109004.19,35997.7
New York City,Manhattan,7002053,001463,NYU Langone Hospitals,70 or Older,103,F,Other Race,Unknown,8,Emergency,Inpatient Rehabilitation Facility,2019,NVS020,OTHER SPECIFIED NERVOUS SYSTEM DISORDERS,MAM011,ELECTROENCEPHALOGRAM (EEG),052,ALTERATION IN CONSCIOUSNESS,01,DISEASES AND DISORDERS OF THE NERVOUS SYSTEM,3,Major,Major,Medical,Medicare,Blue Cross/Blue Shield,,,,true,350899.95,51090.07
New York City,Manhattan,7002053,001463,NYU Langone Hospitals,70 or Older,100,M,White,Not Span/Hispanic,6,Emergency,Skilled Nursing Home,2019,NVS020,OTHER SPECIFIED NERVOUS SYSTEM DISORDERS,CAR024,VENOUS AND ARTERIAL CATHETER PLACEMENT,052,ALTERATION IN CONSCIOUSNESS,01,DISEASES AND DISORDERS OF THE NERVOUS SYSTEM,4,Extreme,Extreme,Medical,Medicare,Private Health Insurance,,,,true,122689.33,29377.12
New York City,Manhattan,7002053,001463,NYU Langone Hospitals,70 or Older,100,F,White,Not Span/Hispanic,7,Emergency,Home w/ Home Health Services,2019,NVS020,OTHER SPECIFIED NERVOUS SYSTEM DISORDERS,ESA001,HEMODIALYSIS,052,ALTERATION IN CONSCIOUSNESS,01,DISEASES AND DISORDERS OF THE NERVOUS SYSTEM,3,Major,Major,Medical,Medicare,Private Health Insurance,,,,true,132597.14,34672.99
New York City,Manhattan,7002053,001463,NYU Langone Hospitals,70 or Older,100,M,Black/African American,Not Span/Hispanic,3,Elective,Home or Self Care,2019,SYM010,NERVOUS SYSTEM SIGNS AND SYMPTOMS,MAM011,ELECTROENCEPHALOGRAM (EEG),052,ALTERATION IN CONSCIOUSNESS,01,DISEASES AND DISORDERS OF THE NERVOUS SYSTEM,2,Moderate,Minor,Medical,Medicare,Federal/State/Local/VA,,,,false,64602.86,11025.64
New York City,Manhattan,7002053,001463,NYU Langone Hospitals,18 to 29,117,M,Black/African American,Not Span/Hispanic,7,Emergency,Home or Self Care,2019,NVS013,COMA; STUPOR; AND BRAIN DAMAGE,MAM011,ELECTROENCEPHALOGRAM (EEG),052,ALTERATION IN CONSCIOUSNESS,01,DISEASES AND DISORDERS OF THE NERVOUS SYSTEM,3,Major,Minor,Medical,Medicare,Blue Cross/Blue Shield,Medicaid,,,true,199257.79,28311.02
New York City,Manhattan,7002053,001463,NYU Langone Hospitals,50 to 69,112,M,White,Unknown,6,Emergency,Home w/ Home Health Services,2019,NVS020,OTHER SPECIFIED NERVOUS SYSTEM DISORDERS,ESA001,HEMODIALYSIS,052,ALTERATION IN CONSCIOUSNESS,01,DISEASES AND DISORDERS OF THE NERVOUS SYSTEM,3,Major,Moderate,Medical,Private Health Insurance,,,,,true,151546.09,32968.85
New York City,Manhattan,7002053,001463,NYU Langone Hospitals,50 to 69,113,M,White,Not Span/Hispanic,4,Emergency,Skilled Nursing Home,2019,NVS020,OTHER SPECIFIED NERVOUS SYSTEM DISORDERS,,,052,ALTERATION IN CONSCIOUSNESS,01,DISEASES AND DISORDERS OF THE NERVOUS SYSTEM,3,Major,Major,Medical,Medicare,Medicaid,,,,true,58202.06,15804.1
New York City,Manhattan,7002053,001463,NYU Langone Hospitals,30 to 49,,M,White,Unknown,3,Elective,Home or Self Care,2019,SYM010,NERVOUS SYSTEM SIGNS AND SYMPTOMS,MAM011,ELECTROENCEPHALOGRAM (EEG),052,ALTERATION IN CONSCIOUSNESS,01,DISEASES AND DISORDERS OF THE NERVOUS SYSTEM,1,Minor,Minor,Medical,Private Health Insurance,,,,,false,66964.46,11176.98
New York City,Manhattan,7002053,001463,NYU Langone Hospitals,70 or Older,100,M,Other Race,Spanish/Hispanic,1,Emergency,Left Against Medical Advice,2019,NVS020,OTHER SPECIFIED NERVOUS SYSTEM DISORDERS,ESA001,HEMODIALYSIS,052,ALTERATION IN CONSCIOUSNESS,01,DISEASES AND DISORDERS OF THE NERVOUS SYSTEM,4,Extreme,Major,Medical,Medicare,Medicaid,,,,true,36325.54,9169.74
New York City,Manhattan,7002053,001463,NYU Langone Hospitals,50 to 69,100,F,White,Not Span/Hispanic,8,Emergency,Home w/ Home Health Services,2019,NVS020,OTHER SPECIFIED NERVOUS SYSTEM DISORDERS,MAM011,ELECTROENCEPHALOGRAM (EEG),052,ALTERATION IN CONSCIOUSNESS,01,DISEASES AND DISORDERS OF THE NERVOUS SYSTEM,3,Major,Major,Medical,Private Health Insurance,,,,,true,137937.69,34041.41
New York City,Manhattan,7002053,001463,NYU Langone Hospitals,30 to 49,100,M,White,Not Span/Hispanic,2,Elective,Home or Self Care,2019,SYM010,NERVOUS SYSTEM SIGNS AND SYMPTOMS,MAM011,ELECTROENCEPHALOGRAM (EEG),052,ALTERATION IN CONSCIOUSNESS,01,DISEASES AND DISORDERS OF THE NERVOUS SYSTEM,2,Moderate,Minor,Medical,Private Health Insurance,,,,,false,66832.95,8163.68
New York City,Manhattan,7002053,001463,NYU Langone Hospitals,0 to 17,113,M,White,Not Span/Hispanic,3,Emergency,Home or Self Care,2019,NVS013,COMA; STUPOR; AND BRAIN DAMAGE,MAM011,ELECTROENCEPHALOGRAM (EEG),052,ALTERATION IN CONSCIOUSNESS,01,DISEASES AND DISORDERS OF THE NERVOUS SYSTEM,2,Moderate,Minor,Medical,Blue Cross/Blue Shield,,,,,true,92678.99,10446.23
New York City,Manhattan,7002053,001463,NYU Langone Hospitals,50 to 69,OOS,F,White,Not Span/Hispanic,1,Emergency,Home or Self Care,2019,NVS012,TRANSIENT CEREBRAL ISCHEMIA,MAM011,ELECTROENCEPHALOGRAM (EEG),052,ALTERATION IN CONSCIOUSNESS,01,DISEASES AND DISORDERS OF THE NERVOUS SYSTEM,2,Moderate,Minor,Medical,Private Health Insurance,,,,,true,50283.28,5858.42
New York City,Manhattan,7002053,001463,NYU Langone Hospitals,50 to 69,125,F,White,Not Span/Hispanic,5,Elective,Home or Self Care,2019,SYM010,NERVOUS SYSTEM SIGNS AND SYMPTOMS,MAM011,ELECTROENCEPHALOGRAM (EEG),052,ALTERATION IN CONSCIOUSNESS,01,DISEASES AND DISORDERS OF THE NERVOUS SYSTEM,2,Moderate,Minor,Medical,Medicare,Private Health Insurance,,,,false,113975.12,33215.82
New York City,Manhattan,7002053,001463,NYU Langone Hospitals,70 or Older,100,M,Other Race,Spanish/Hispanic,9,Emergency,Skilled Nursing Home,2019,NVS020,OTHER SPECIFIED NERVOUS SYSTEM DISORDERS,ESA004,NON-INVASIVE VENTILATION,052,ALTERATION IN CONSCIOUSNESS,01,DISEASES AND DISORDERS OF THE NERVOUS SYSTEM,4,Extreme,Major,Medical,Medicare,Medicare,,,,true,192782.1,48818.84
New York City,Manhattan,7002053,001463,NYU Langone Hospitals,30 to 49,112,M,White,Unknown,2,Emergency,Home or Self Care,2019,SYM010,NERVOUS SYSTEM SIGNS AND SYMPTOMS,MAM011,ELECTROENCEPHALOGRAM (EEG),052,ALTERATION IN CONSCIOUSNESS,01,DISEASES AND DISORDERS OF THE NERVOUS SYSTEM,2,Moderate,Minor,Medical,Medicaid,,,,,true,68635.35,9188.77
New York City,Manhattan,7002053,001463,NYU Langone Hospitals,30 to 49,113,M,Other Race,Not Span/Hispanic,6,Emergency,Psychiatric Hospital or Unit of Hosp,2019,NVS020,OTHER SPECIFIED NERVOUS SYSTEM DISORDERS,CNS002,LUMBAR PUNCTURE,052,ALTERATION IN CONSCIOUSNESS,01,DISEASES AND DISORDERS OF THE NERVOUS SYSTEM,3,Major,Moderate,Medical,Private Health Insurance,,,,,false,111135.38,22660.4
New York City,Manhattan,7002053,001463,NYU Langone Hospitals,70 or Older,103,M,White,Not Span/Hispanic,1,Emergency,Home or Self Care,2019,NVS012,TRANSIENT CEREBRAL ISCHEMIA,MAM011,ELECTROENCEPHALOGRAM (EEG),052,ALTERATION IN CONSCIOUSNESS,01,DISEASES AND DISORDERS OF THE NERVOUS SYSTEM,1,Minor,Minor,Medical,Medicaid,,,,,true,73204.15,11712.68
New York City,Manhattan,7002053,001463,NYU Langone Hospitals,70 or Older,111,F,White,Not Span/Hispanic,1,Emergency,Home w/ Home Health Services,2019,NVS020,OTHER SPECIFIED NERVOUS SYSTEM DISORDERS,,,052,ALTERATION IN CONSCIOUSNESS,01,DISEASES AND DISORDERS OF THE NERVOUS SYSTEM,3,Major,Major,Medical,Medicare,,,,,true,27007.58,7967.48
New York City,Manhattan,7002053,001463,NYU Langone Hospitals,30 to 49,112,M,Black/African American,Not Span/Hispanic,1,Emergency,Home or Self Care,2019,CIR008,HYPERTENSION WITH COMPLICATIONS AND SECONDARY HYPERTENSION,ADM005,ADMINISTRATION OF THROMBOLYTICS AND PLATELET INHIBITORS,052,ALTERATION IN CONSCIOUSNESS,01,DISEASES AND DISORDERS OF THE NERVOUS SYSTEM,2,Moderate,Minor,Medical,Blue Cross/Blue Shield,,,,,true,158210.07,16008.88
New York City,Manhattan,7002053,001463,NYU Langone Hospitals,0 to 17,OOS,M,Other Race,Unknown,1,Elective,Home or Self Care,2019,SYM010,NERVOUS SYSTEM SIGNS AND SYMPTOMS,MAM011,ELECTROENCEPHALOGRAM (EEG),052,ALTERATION IN CONSCIOUSNESS,01,DISEASES AND DISORDERS OF THE NERVOUS SYSTEM,1,Minor,Minor,Medical,Blue Cross/Blue Shield,,,,,false,30158,3321.83
New York City,Manhattan,7002053,001463,NYU Langone Hospitals,50 to 69,104,M,Black/African American,Not Span/Hispanic,6,Emergency,Home or Self Care,2019,NVS020,OTHER SPECIFIED NERVOUS SYSTEM DISORDERS,CNS002,LUMBAR PUNCTURE,052,ALTERATION IN CONSCIOUSNESS,01,DISEASES AND DISORDERS OF THE NERVOUS SYSTEM,3,Major,Moderate,Medical,Medicare,Blue Cross/Blue Shield,,,,true,144060.49,27121.5
New York City,Manhattan,7002053,001463,NYU Langone Hospitals,70 or Older,103,F,White,Not Span/Hispanic,1,Emergency,Home or Self Care,2019,NVS012,TRANSIENT CEREBRAL ISCHEMIA,MAM011,ELECTROENCEPHALOGRAM (EEG),052,ALTERATION IN CONSCIOUSNESS,01,DISEASES AND DISORDERS OF THE NERVOUS SYSTEM,1,Minor,Minor,Medical,Medicare,Medicare,,,,true,39837.6,10538.39
New York City,Manhattan,7002053,001463,NYU Langone Hospitals,0 to 17,112,F,White,Unknown,2,Emergency,Home or Self Care,2019,SYM010,NERVOUS SYSTEM SIGNS AND SYMPTOMS,MAM011,ELECTROENCEPHALOGRAM (EEG),052,ALTERATION IN CONSCIOUSNESS,01,DISEASES AND DISORDERS OF THE NERVOUS SYSTEM,3,Major,Minor,Medical,Medicaid,,,,,true,90529.73,13965.58
New York City,Manhattan,7002053,001463,NYU Langone Hospitals,70 or Older,100,F,White,Not Span/Hispanic,3,Emergency,Skilled Nursing Home,2019,NVS020,OTHER SPECIFIED NERVOUS SYSTEM DISORDERS,IMG007,COMPUTERIZED TOMOGRAPHY (CT) WITHOUT CONTRAST,052,ALTERATION IN CONSCIOUSNESS,01,DISEASES AND DISORDERS OF THE NERVOUS SYSTEM,3,Major,Major,Medical,Medicare,Blue Cross/Blue Shield,,,,true,39798.77,11904.62
New York City,Manhattan,7002053,001463,NYU Langone Hospitals,50 to 69,OOS,M,Black/African American,Not Span/Hispanic,3,Emergency,Home w/ Home Health Services,2019,NVS020,OTHER SPECIFIED NERVOUS SYSTEM DISORDERS,ADM021,"ADMINISTRATION OF THERAPEUTIC SUBSTANCES, NEC",052,ALTERATION IN CONSCIOUSNESS,01,DISEASES AND DISORDERS OF THE NERVOUS SYSTEM,3,Major,Moderate,Medical,Medicare,Medicaid,,,,true,70955.56,16465.13
New York City,Manhattan,7002053,001463,NYU Langone Hospitals,0 to 17,113,M,Other Race,Not Span/Hispanic,1,Elective,Home or Self Care,2019,SYM010,NERVOUS SYSTEM SIGNS AND SYMPTOMS,MAM011,ELECTROENCEPHALOGRAM (EEG),052,ALTERATION IN CONSCIOUSNESS,01,DISEASES AND DISORDERS OF THE NERVOUS SYSTEM,1,Minor,Minor,Medical,Medicaid,,,,,false,28415.57,3071.86
New York City,Manhattan,7002053,001463,NYU Langone Hospitals,0 to 17,114,F,Other Race,Not Span/Hispanic,1,Elective,Home or Self Care,2019,SYM010,NERVOUS SYSTEM SIGNS AND SYMPTOMS,MAM011,ELECTROENCEPHALOGRAM (EEG),052,ALTERATION IN CONSCIOUSNESS,01,DISEASES AND DISORDERS OF THE NERVOUS SYSTEM,1,Minor,Minor,Medical,Medicaid,,,,,false,28856.12,3127.84
New York City,Manhattan,7002053,001463,NYU Langone Hospitals,70 or Older,100,M,White,Not Span/Hispanic,2,Emergency,Home or Self Care,2019,NVS020,OTHER SPECIFIED NERVOUS SYSTEM DISORDERS,CNS002,LUMBAR PUNCTURE,052,ALTERATION IN CONSCIOUSNESS,01,DISEASES AND DISORDERS OF THE NERVOUS SYSTEM,3,Major,Minor,Medical,Medicare,,,,,false,82957.11,14765.2