Hospital Service Area,Hospital County,Operating Certificate Number,Permanent Facility Id,Facility Name,Age Group,Zip Code - 3 digits,Gender,Race,Ethnicity,Length of Stay,Type of Admission,Patient Disposition,Discharge Year,CCS Diagnosis Code,CCS Diagnosis Description,CCS Procedure Code,CCS Procedure Description,APR DRG Code,APR DRG Description,APR MDC Code,APR MDC Description,APR Severity of Illness Code,APR Severity of Illness Description,APR Risk of Mortality,APR Medical Surgical Description,Payment Typology 1,Payment Typology 2,Payment Typology 3,Birth Weight,Abortion Edit Indicator,Emergency Department Indicator,Total Charges,Total Costs
Long Island,Suffolk,5123000,000885,Long Island Community Hospital,70 or Older,117,F,White,Not Span/Hispanic,4,Emergency,Skilled Nursing Home,2019,NVS020,OTHER SPECIFIED NERVOUS SYSTEM DISORDERS,SUD001,SUBSTANCE USE DETOXIFICATION,052,ALTERATION IN CONSCIOUSNESS,01,DISEASES AND DISORDERS OF THE NERVOUS SYSTEM,3,Major,Moderate,Medical,Medicare,Medicare,Blue Cross/Blue Shield,,,true,34240.51,6089.02
Long Island,Suffolk,5123000,000885,Long Island Community Hospital,50 to 69,117,F,Black/African American,Not Span/Hispanic,7,Emergency,Skilled Nursing Home,2019,NVS020,OTHER SPECIFIED NERVOUS SYSTEM DISORDERS,MAM011,ELECTROENCEPHALOGRAM (EEG),052,ALTERATION IN CONSCIOUSNESS,01,DISEASES AND DISORDERS OF THE NERVOUS SYSTEM,2,Moderate,Minor,Medical,Private Health Insurance,Medicaid,,,,true,65527.23,11190.97
Long Island,Suffolk,5123000,000885,Long Island Community Hospital,30 to 49,117,M,White,Not Span/Hispanic,2,Emergency,Home or Self Care,2019,NVS020,OTHER SPECIFIED NERVOUS SYSTEM DISORDERS,CNS002,LUMBAR PUNCTURE,052,ALTERATION IN CONSCIOUSNESS,01,DISEASES AND DISORDERS OF THE NERVOUS SYSTEM,3,Major,Moderate,Medical,Self-Pay,,,,,true,44417.04,4163.23
Long Island,Suffolk,5123000,000885,Long Island Community Hospital,50 to 69,119,M,White,Not Span/Hispanic,4,Emergency,Home w/ Home Health Services,2019,NVS020,OTHER SPECIFIED NERVOUS SYSTEM DISORDERS,,,052,ALTERATION IN CONSCIOUSNESS,01,DISEASES AND DISORDERS OF THE NERVOUS SYSTEM,3,Major,Extreme,Medical,Medicare,Medicare,Private Health Insurance,,,true,42436.48,6334.39
Long Island,Suffolk,5123000,000885,Long Island Community Hospital,50 to 69,117,M,White,Not Span/Hispanic,3,Emergency,Home or Self Care,2019,NVS020,OTHER SPECIFIED NERVOUS SYSTEM DISORDERS,,,052,ALTERATION IN CONSCIOUSNESS,01,DISEASES AND DISORDERS OF THE NERVOUS SYSTEM,3,Major,Major,Medical,Medicare,Medicare,Blue Cross/Blue Shield,,,true,23581.48,4331.73
Long Island,Suffolk,5123000,000885,Long Island Community Hospital,30 to 49,119,M,White,Not Span/Hispanic,4,Emergency,Home or Self Care,2019,NVS020,OTHER SPECIFIED NERVOUS SYSTEM DISORDERS,,,052,ALTERATION IN CONSCIOUSNESS,01,DISEASES AND DISORDERS OF THE NERVOUS SYSTEM,3,Major,Minor,Medical,Self-Pay,,,,,true,30408.48,5576.75
Long Island,Suffolk,5123000,000885,Long Island Community Hospital,70 or Older,119,M,White,Not Span/Hispanic,3,Emergency,Home or Self Care,2019,NVS020,OTHER SPECIFIED NERVOUS SYSTEM DISORDERS,CNS002,LUMBAR PUNCTURE,052,ALTERATION IN CONSCIOUSNESS,01,DISEASES AND DISORDERS OF THE NERVOUS SYSTEM,3,Major,Moderate,Medical,Medicare,Medicare,Blue Cross/Blue Shield,,,true,59256.89,5994.9
Long Island,Suffolk,5123000,000885,Long Island Community Hospital,70 or Older,119,F,White,Not Span/Hispanic,3,Emergency,Skilled Nursing Home,2019,NVS020,OTHER SPECIFIED NERVOUS SYSTEM DISORDERS,,,052,ALTERATION IN CONSCIOUSNESS,01,DISEASES AND DISORDERS OF THE NERVOUS SYSTEM,3,Major,Major,Medical,Medicare,Medicare,,,,true,32764.77,5343.5
Long Island,Suffolk,5123000,000885,Long Island Community Hospital,18 to 29,119,M,Other Race,Not Span/Hispanic,24,Emergency,Court/Law Enforcement,2019,NVS020,OTHER SPECIFIED NERVOUS SYSTEM DISORDERS,SUD001,SUBSTANCE USE DETOXIFICATION,052,ALTERATION IN CONSCIOUSNESS,01,DISEASES AND DISORDERS OF THE NERVOUS SYSTEM,4,Extreme,Extreme,Medical,Private Health Insurance,Medicaid,,,,true,404511.31,77848.91
Long Island,Suffolk,5123000,000885,Long Island Community Hospital,50 to 69,117,M,White,Not Span/Hispanic,7,Emergency,Skilled Nursing Home,2019,NVS020,OTHER SPECIFIED NERVOUS SYSTEM DISORDERS,ESA001,HEMODIALYSIS,052,ALTERATION IN CONSCIOUSNESS,01,DISEASES AND DISORDERS OF THE NERVOUS SYSTEM,3,Major,Major,Medical,Medicare,Medicare,Private Health Insurance,,,true,62960.31,13381.47
Long Island,Suffolk,5123000,000885,Long Island Community Hospital,50 to 69,119,F,White,Not Span/Hispanic,5,Emergency,Home w/ Home Health Services,2019,NVS020,OTHER SPECIFIED NERVOUS SYSTEM DISORDERS,,,052,ALTERATION IN CONSCIOUSNESS,01,DISEASES AND DISORDERS OF THE NERVOUS SYSTEM,2,Moderate,Minor,Medical,Private Health Insurance,Medicaid,,,,true,35388.08,6853.05
Long Island,Suffolk,5123000,000885,Long Island Community Hospital,70 or Older,117,M,White,Not Span/Hispanic,9,Emergency,Skilled Nursing Home,2019,NVS020,OTHER SPECIFIED NERVOUS SYSTEM DISORDERS,,,052,ALTERATION IN CONSCIOUSNESS,01,DISEASES AND DISORDERS OF THE NERVOUS SYSTEM,3,Major,Major,Medical,Medicare,Medicare,Blue Cross/Blue Shield,,,true,70840.68,13271.97
Long Island,Suffolk,5123000,000885,Long Island Community Hospital,70 or Older,117,M,White,Not Span/Hispanic,5,Emergency,Home or Self Care,2019,NVS020,OTHER SPECIFIED NERVOUS SYSTEM DISORDERS,ESA001,HEMODIALYSIS,052,ALTERATION IN CONSCIOUSNESS,01,DISEASES AND DISORDERS OF THE NERVOUS SYSTEM,3,Major,Major,Medical,Medicare,Medicare,Blue Cross/Blue Shield,,,true,60079.45,9184.29
Long Island,Suffolk,5123000,000885,Long Island Community Hospital,70 or Older,117,F,White,Not Span/Hispanic,7,Emergency,Skilled Nursing Home,2019,NVS020,OTHER SPECIFIED NERVOUS SYSTEM DISORDERS,MAM011,ELECTROENCEPHALOGRAM (EEG),052,ALTERATION IN CONSCIOUSNESS,01,DISEASES AND DISORDERS OF THE NERVOUS SYSTEM,3,Major,Moderate,Medical,Medicare,Medicare,Private Health Insurance,,,true,87981.94,12745.86
Long Island,Suffolk,5123000,000885,Long Island Community Hospital,70 or Older,117,M,White,Not Span/Hispanic,7,Emergency,Cancer Center or Children's Hospital,2019,NVS020,OTHER SPECIFIED NERVOUS SYSTEM DISORDERS,ESA004,NON-INVASIVE VENTILATION,052,ALTERATION IN CONSCIOUSNESS,01,DISEASES AND DISORDERS OF THE NERVOUS SYSTEM,4,Extreme,Extreme,Medical,Medicare,,,,,true,76352.71,12211.96
Long Island,Suffolk,5123000,000885,Long Island Community Hospital,70 or Older,119,F,Black/African American,Not Span/Hispanic,8,Emergency,Home w/ Home Health Services,2019,CIR008,HYPERTENSION WITH COMPLICATIONS AND SECONDARY HYPERTENSION,,,052,ALTERATION IN CONSCIOUSNESS,01,DISEASES AND DISORDERS OF THE NERVOUS SYSTEM,3,Major,Major,Medical,Medicare,Medicaid,,,,true,60595.94,11221.11
Long Island,Suffolk,5123000,000885,Long Island Community Hospital,30 to 49,117,F,White,Not Span/Hispanic,7,Emergency,Psychiatric Hospital or Unit of Hosp,2019,NVS020,OTHER SPECIFIED NERVOUS SYSTEM DISORDERS,RES007,AIRWAY INTUBATION,052,ALTERATION IN CONSCIOUSNESS,01,DISEASES AND DISORDERS OF THE NERVOUS SYSTEM,4,Extreme,Extreme,Medical,Medicare,Medicaid,,,,true,80337.36,11892.16
Long Island,Suffolk,5123000,000885,Long Island Community Hospital,50 to 69,117,M,Black/African American,Not Span/Hispanic,8,Emergency,Skilled Nursing Home,2019,NVS020,OTHER SPECIFIED NERVOUS SYSTEM DISORDERS,,,052,ALTERATION IN CONSCIOUSNESS,01,DISEASES AND DISORDERS OF THE NERVOUS SYSTEM,3,Major,Moderate,Medical,Medicare,Medicare,Medicaid,,,true,60068.9,10201.3
Long Island,Suffolk,5123000,000885,Long Island Community Hospital,50 to 69,117,M,White,Not Span/Hispanic,7,Emergency,Skilled Nursing Home,2019,NVS020,OTHER SPECIFIED NERVOUS SYSTEM DISORDERS,ESA004,NON-INVASIVE VENTILATION,052,ALTERATION IN CONSCIOUSNESS,01,DISEASES AND DISORDERS OF THE NERVOUS SYSTEM,3,Major,Moderate,Medical,Medicare,Medicaid,,,,true,68838.79,11788.17
Long Island,Suffolk,5123000,000885,Long Island Community Hospital,30 to 49,117,M,White,Not Span/Hispanic,2,Emergency,Home or Self Care,2019,NVS020,OTHER SPECIFIED NERVOUS SYSTEM DISORDERS,,,052,ALTERATION IN CONSCIOUSNESS,01,DISEASES AND DISORDERS OF THE NERVOUS SYSTEM,3,Major,Minor,Medical,Private Health Insurance,Medicaid,,,,true,20301.65,3156.51
Long Island,Suffolk,5123000,000885,Long Island Community Hospital,70 or Older,117,F,White,Not Span/Hispanic,7,Emergency,Skilled Nursing Home,2019,NVS020,OTHER SPECIFIED NERVOUS SYSTEM DISORDERS,,,052,ALTERATION IN CONSCIOUSNESS,01,DISEASES AND DISORDERS OF THE NERVOUS SYSTEM,3,Major,Major,Medical,Medicare,Medicare,Blue Cross/Blue Shield,,,true,87853.15,12428.03
Long Island,Suffolk,5123000,000885,Long Island Community Hospital,50 to 69,119,F,White,Not Span/Hispanic,4,Emergency,Home or Self Care,2019,CIR024,OTHER AND ILL-DEFINED CEREBROVASCULAR DISEASE,MAM007,ELECTROCARDIOGRAM (ECG),052,ALTERATION IN CONSCIOUSNESS,01,DISEASES AND DISORDERS OF THE NERVOUS SYSTEM,3,Major,Moderate,Medical,Medicare,Medicare,,,,true,69783.02,8050.54
Long Island,Suffolk,5123000,000885,Long Island Community Hospital,70 or Older,117,F,White,Not Span/Hispanic,3,Emergency,Skilled Nursing Home,2019,NVS020,OTHER SPECIFIED NERVOUS SYSTEM DISORDERS,,,052,ALTERATION IN CONSCIOUSNESS,01,DISEASES AND DISORDERS OF THE NERVOUS SYSTEM,3,Major,Moderate,Medical,Medicare,Medicare,,,,true,22840.51,4261.42
Long Island,Suffolk,5123000,000885,Long Island Community Hospital,50 to 69,117,M,White,Not Span/Hispanic,15,Emergency,Skilled Nursing Home,2019,NVS020,OTHER SPECIFIED NERVOUS SYSTEM DISORDERS,ADM001,TRANSFUSION OF BLOOD AND BLOOD PRODUCTS,052,ALTERATION IN CONSCIOUSNESS,01,DISEASES AND DISORDERS OF THE NERVOUS SYSTEM,3,Major,Moderate,Medical,Private Health Insurance,Medicaid,,,,true,142104.36,26425.34
Long Island,Suffolk,5123000,000885,Long Island Community Hospital,70 or Older,117,M,White,Not Span/Hispanic,5,Emergency,Skilled Nursing Home,2019,NVS020,OTHER SPECIFIED NERVOUS SYSTEM DISORDERS,,,052,ALTERATION IN CONSCIOUSNESS,01,DISEASES AND DISORDERS OF THE NERVOUS SYSTEM,4,Extreme,Extreme,Medical,Medicare,Medicare,,,,true,72354.93,10441.33
Long Island,Suffolk,5123000,000885,Long Island Community Hospital,70 or Older,119,F,White,Not Span/Hispanic,10,Emergency,Skilled Nursing Home,2019,NVS020,OTHER SPECIFIED NERVOUS SYSTEM DISORDERS,ESA001,HEMODIALYSIS,052,ALTERATION IN CONSCIOUSNESS,01,DISEASES AND DISORDERS OF THE NERVOUS SYSTEM,3,Major,Major,Medical,Medicare,Medicare,Blue Cross/Blue Shield,,,true,66579.09,14313.58
Long Island,Suffolk,5123000,000885,Long Island Community Hospital,50 to 69,119,M,White,Not Span/Hispanic,7,Emergency,Home or Self Care,2019,NVS020,OTHER SPECIFIED NERVOUS SYSTEM DISORDERS,,,052,ALTERATION IN CONSCIOUSNESS,01,DISEASES AND DISORDERS OF THE NERVOUS SYSTEM,3,Major,Moderate,Medical,Private Health Insurance,Medicaid,,,,true,48540.95,10001.87
Long Island,Suffolk,5123000,000885,Long Island Community Hospital,30 to 49,117,M,White,Not Span/Hispanic,7,Emergency,Home or Self Care,2019,NVS020,OTHER SPECIFIED NERVOUS SYSTEM DISORDERS,,,052,ALTERATION IN CONSCIOUSNESS,01,DISEASES AND DISORDERS OF THE NERVOUS SYSTEM,3,Major,Moderate,Medical,Private Health Insurance,Medicaid,,,,true,58767.12,10964.97
Long Island,Suffolk,5123000,000885,Long Island Community Hospital,50 to 69,119,F,White,Not Span/Hispanic,4,Emergency,Home or Self Care,2019,NVS020,OTHER SPECIFIED NERVOUS SYSTEM DISORDERS,MAM011,ELECTROENCEPHALOGRAM (EEG),052,ALTERATION IN CONSCIOUSNESS,01,DISEASES AND DISORDERS OF THE NERVOUS SYSTEM,3,Major,Moderate,Medical,Blue Cross/Blue Shield,,,,,true,44959.86,8066.59
Long Island,Suffolk,5123000,000885,Long Island Community Hospital,30 to 49,119,M,White,Not Span/Hispanic,4,Emergency,Home or Self Care,2019,NVS020,OTHER SPECIFIED NERVOUS SYSTEM DISORDERS,ESA003,MECHANICAL VENTILATION,052,ALTERATION IN CONSCIOUSNESS,01,DISEASES AND DISORDERS OF THE NERVOUS SYSTEM,4,Extreme,Extreme,Medical,Private Health Insurance,Private Health Insurance,,,,true,70092.87,8584.23
Long Island,Suffolk,5123000,000885,Long Island Community Hospital,70 or Older,117,F,White,Not Span/Hispanic,17,Emergency,Skilled Nursing Home,2019,NVS020,OTHER SPECIFIED NERVOUS SYSTEM DISORDERS,IMG008,ULTRASONOGRAPHY,052,ALTERATION IN CONSCIOUSNESS,01,DISEASES AND DISORDERS OF THE NERVOUS SYSTEM,4,Extreme,Extreme,Medical,Medicare,,,,,true,192597.47,29434.92
Long Island,Suffolk,5123000,000885,Long Island Community Hospital,30 to 49,119,M,White,Not Span/Hispanic,14,Urgent,Home or Self Care,2019,NVS020,OTHER SPECIFIED NERVOUS SYSTEM DISORDERS,ESA003,MECHANICAL VENTILATION,052,ALTERATION IN CONSCIOUSNESS,01,DISEASES AND DISORDERS OF THE NERVOUS SYSTEM,4,Extreme,Extreme,Medical,Private Health Insurance,Medicaid,,,,false,117197.33,22641.67
Long Island,Suffolk,5123000,000885,Long Island Community Hospital,70 or Older,117,F,Black/African American,Not Span/Hispanic,2,Emergency,Home or Self Care,2019,NVS020,OTHER SPECIFIED NERVOUS SYSTEM DISORDERS,,,052,ALTERATION IN CONSCIOUSNESS,01,DISEASES AND DISORDERS OF THE NERVOUS SYSTEM,3,Major,Moderate,Medical,Medicare,Medicare,Medicaid,,,true,51814.36,4664.49
Long Island,Suffolk,5123000,000885,Long Island Community Hospital,50 to 69,117,M,Black/African American,Not Span/Hispanic,3,Emergency,Home w/ Home Health Services,2019,NVS020,OTHER SPECIFIED NERVOUS SYSTEM DISORDERS,ESA004,NON-INVASIVE VENTILATION,052,ALTERATION IN CONSCIOUSNESS,01,DISEASES AND DISORDERS OF THE NERVOUS SYSTEM,3,Major,Major,Medical,Medicare,Medicare,Medicaid,,,true,60622.8,6112.99
Long Island,Suffolk,5123000,000885,Long Island Community Hospital,18 to 29,,M,Black/African American,Not Span/Hispanic,4,Emergency,Home or Self Care,2019,NVS020,OTHER SPECIFIED NERVOUS SYSTEM DISORDERS,MAM011,ELECTROENCEPHALOGRAM (EEG),052,ALTERATION IN CONSCIOUSNESS,01,DISEASES AND DISORDERS OF THE NERVOUS SYSTEM,3,Major,Minor,Medical,Self-Pay,,,,,true,36593.3,5858.11
Long Island,Suffolk,5123000,000885,Long Island Community Hospital,70 or Older,117,F,White,Not Span/Hispanic,3,Emergency,Expired,2019,NVS020,OTHER SPECIFIED NERVOUS SYSTEM DISORDERS,,,052,ALTERATION IN CONSCIOUSNESS,01,DISEASES AND DISORDERS OF THE NERVOUS SYSTEM,4,Extreme,Extreme,Medical,Medicare,Medicare,Blue Cross/Blue Shield,,,true,14499.25,3777.69
Long Island,Suffolk,5123000,000885,Long Island Community Hospital,70 or Older,117,F,White,Not Span/Hispanic,4,Emergency,Skilled Nursing Home,2019,NVS020,OTHER SPECIFIED NERVOUS SYSTEM DISORDERS,,,052,ALTERATION IN CONSCIOUSNESS,01,DISEASES AND DISORDERS OF THE NERVOUS SYSTEM,3,Major,Moderate,Medical,Medicare,Medicare,Private Health Insurance,,,true,45241.49,5965.7
Long Island,Suffolk,5123000,000885,Long Island Community Hospital,50 to 69,117,M,White,Not Span/Hispanic,4,Emergency,Home or Self Care,2019,NVS020,OTHER SPECIFIED NERVOUS SYSTEM DISORDERS,MAM011,ELECTROENCEPHALOGRAM (EEG),052,ALTERATION IN CONSCIOUSNESS,01,DISEASES AND DISORDERS OF THE NERVOUS SYSTEM,3,Major,Minor,Medical,Medicare,Medicare,Medicaid,,,true,60110.12,8029.39
Long Island,Suffolk,5123000,000885,Long Island Community Hospital,50 to 69,117,F,White,Not Span/Hispanic,9,Emergency,Home w/ Home Health Services,2019,NVS020,OTHER SPECIFIED NERVOUS SYSTEM DISORDERS,MAM011,ELECTROENCEPHALOGRAM (EEG),052,ALTERATION IN CONSCIOUSNESS,01,DISEASES AND DISORDERS OF THE NERVOUS SYSTEM,3,Major,Moderate,Medical,Medicare,Medicare,Private Health Insurance,,,true,91996,15001.09
Long Island,Suffolk,5123000,000885,Long Island Community Hospital,50 to 69,117,M,Other Race,Not Span/Hispanic,2,Emergency,Left Against Medical Advice,2019,NVS020,OTHER SPECIFIED NERVOUS SYSTEM DISORDERS,SUD001,SUBSTANCE USE DETOXIFICATION,052,ALTERATION IN CONSCIOUSNESS,01,DISEASES AND DISORDERS OF THE NERVOUS SYSTEM,4,Extreme,Major,Medical,Private Health Insurance,Medicaid,,,,true,26755.24,3532.36
Long Island,Suffolk,5123000,000885,Long Island Community Hospital,70 or Older,119,M,White,Not Span/Hispanic,5,Emergency,Skilled Nursing Home,2019,NVS020,OTHER SPECIFIED NERVOUS SYSTEM DISORDERS,,,052,ALTERATION IN CONSCIOUSNESS,01,DISEASES AND DISORDERS OF THE NERVOUS SYSTEM,3,Major,Major,Medical,Medicare,Medicare,Private Health Insurance,,,true,61471.54,8908.23
Long Island,Suffolk,5123000,000885,Long Island Community Hospital,70 or Older,117,F,White,Not Span/Hispanic,14,Emergency,Skilled Nursing Home,2019,NVS020,OTHER SPECIFIED NERVOUS SYSTEM DISORDERS,,,052,ALTERATION IN CONSCIOUSNESS,01,DISEASES AND DISORDERS OF THE NERVOUS SYSTEM,3,Major,Major,Medical,Medicare,,,,,true,84679.98,17852.99
Long Island,Suffolk,5123000,000885,Long Island Community Hospital,70 or Older,117,F,White,Not Span/Hispanic,12,Emergency,Hospice - Home,2019,NVS020,OTHER SPECIFIED NERVOUS SYSTEM DISORDERS,,,052,ALTERATION IN CONSCIOUSNESS,01,DISEASES AND DISORDERS OF THE NERVOUS SYSTEM,3,Major,Major,Medical,Medicare,Medicare,Blue Cross/Blue Shield,,,true,80556.13,16972.54
Long Island,Suffolk,5123000,000885,Long Island Community Hospital,70 or Older,117,F,Black/African American,Not Span/Hispanic,6,Emergency,Home w/ Home Health Services,2019,CIR008,HYPERTENSION WITH COMPLICATIONS AND SECONDARY HYPERTENSION,,,052,ALTERATION IN CONSCIOUSNESS,01,DISEASES AND DISORDERS OF THE NERVOUS SYSTEM,3,Major,Major,Medical,Medicare,Medicare,Medicaid,,,true,44903.65,8678.56
Long Island,Suffolk,5123000,000885,Long Island Community Hospital,50 to 69,117,M,White,Not Span/Hispanic,7,Emergency,Home or Self Care,2019,NVS020,OTHER SPECIFIED NERVOUS SYSTEM DISORDERS,,,052,ALTERATION IN CONSCIOUSNESS,01,DISEASES AND DISORDERS OF THE NERVOUS SYSTEM,3,Major,Moderate,Medical,Medicare,Medicare,Medicaid,,,true,68341.17,12385.91
Long Island,Suffolk,5123000,000885,Long Island Community Hospital,50 to 69,119,F,White,Not Span/Hispanic,2,Emergency,Home or Self Care,2019,NVS012,TRANSIENT CEREBRAL ISCHEMIA,,,052,ALTERATION IN CONSCIOUSNESS,01,DISEASES AND DISORDERS OF THE NERVOUS SYSTEM,2,Moderate,Minor,Medical,Private Health Insurance,,,,,true,45850.09,5282.62
Long Island,Suffolk,5123000,000885,Long Island Community Hospital,30 to 49,119,F,White,Not Span/Hispanic,4,Emergency,Home or Self Care,2019,NVS020,OTHER SPECIFIED NERVOUS SYSTEM DISORDERS,,,052,ALTERATION IN CONSCIOUSNESS,01,DISEASES AND DISORDERS OF THE NERVOUS SYSTEM,3,Major,Minor,Medical,Private Health Insurance,Medicaid,,,,true,25289.71,5426.07
Long Island,Suffolk,5123000,000885,Long Island Community Hospital,50 to 69,117,M,White,Not Span/Hispanic,6,Emergency,Skilled Nursing Home,2019,NVS020,OTHER SPECIFIED NERVOUS SYSTEM DISORDERS,ESA001,HEMODIALYSIS,052,ALTERATION IN CONSCIOUSNESS,01,DISEASES AND DISORDERS OF THE NERVOUS SYSTEM,3,Major,Moderate,Medical,Medicare,Medicare,Medicaid,,,true,72081.09,11144.69
Long Island,Suffolk,5123000,000885,Long Island Community Hospital,70 or Older,117,F,White,Not Span/Hispanic,7,Emergency,Skilled Nursing Home,2019,NVS020,OTHER SPECIFIED NERVOUS SYSTEM DISORDERS,,,052,ALTERATION IN CONSCIOUSNESS,01,DISEASES AND DISORDERS OF THE NERVOUS SYSTEM,3,Major,Minor,Medical,Medicare,,,,,true,41313.94,8672.75
Long Island,Suffolk,5123000,000885,Long Island Community Hospital,50 to 69,119,F,White,Not Span/Hispanic,11,Emergency,Skilled Nursing Home,2019,NVS020,OTHER SPECIFIED NERVOUS SYSTEM DISORDERS,MAM011,ELECTROENCEPHALOGRAM (EEG),052,ALTERATION IN CONSCIOUSNESS,01,DISEASES AND DISORDERS OF THE NERVOUS SYSTEM,4,Extreme,Extreme,Medical,Private Health Insurance,Medicaid,,,,true,128259.82,22833.35
Long Island,Suffolk,5123000,000885,Long Island Community Hospital,70 or Older,117,F,White,Not Span/Hispanic,14,Emergency,Skilled Nursing Home,2019,NVS020,OTHER SPECIFIED NERVOUS SYSTEM DISORDERS,MAM011,ELECTROENCEPHALOGRAM (EEG),052,ALTERATION IN CONSCIOUSNESS,01,DISEASES AND DISORDERS OF THE NERVOUS SYSTEM,3,Major,Moderate,Medical,Medicare,Medicare,Private Health Insurance,,,true,85547.64,18404.03
Long Island,Suffolk,5123000,000885,Long Island Community Hospital,50 to 69,117,F,White,Not Span/Hispanic,2,Emergency,Home or Self Care,2019,NVS020,OTHER SPECIFIED NERVOUS SYSTEM DISORDERS,,,052,ALTERATION IN CONSCIOUSNESS,01,DISEASES AND DISORDERS OF THE NERVOUS SYSTEM,3,Major,Moderate,Medical,Medicare,Medicare,Medicaid,,,true,27163.41,4324.52
Long Island,Suffolk,5123000,000885,Long Island Community Hospital,50 to 69,117,F,White,Not Span/Hispanic,6,Emergency,Home w/ Home Health Services,2019,NVS020,OTHER SPECIFIED NERVOUS SYSTEM DISORDERS,ESA001,HEMODIALYSIS,052,ALTERATION IN CONSCIOUSNESS,01,DISEASES AND DISORDERS OF THE NERVOUS SYSTEM,3,Major,Major,Medical,Private Health Insurance,,,,,true,74160.7,11925.23
Long Island,Suffolk,5123000,000885,Long Island Community Hospital,70 or Older,117,M,White,Not Span/Hispanic,5,Emergency,Home w/ Home Health Services,2019,NVS020,OTHER SPECIFIED NERVOUS SYSTEM DISORDERS,ESA001,HEMODIALYSIS,052,ALTERATION IN CONSCIOUSNESS,01,DISEASES AND DISORDERS OF THE NERVOUS SYSTEM,3,Major,Major,Medical,Medicare,Medicare,,,,true,61677.16,10338.17
Long Island,Suffolk,5123000,000885,Long Island Community Hospital,30 to 49,117,F,Black/African American,Not Span/Hispanic,4,Emergency,Home or Self Care,2019,NVS020,OTHER SPECIFIED NERVOUS SYSTEM DISORDERS,,,052,ALTERATION IN CONSCIOUSNESS,01,DISEASES AND DISORDERS OF THE NERVOUS SYSTEM,3,Major,Moderate,Medical,Private Health Insurance,Medicaid,,,,true,49740.61,6169.75
Long Island,Suffolk,5123000,000885,Long Island Community Hospital,70 or Older,119,F,White,Not Span/Hispanic,5,Emergency,Home or Self Care,2019,NVS020,OTHER SPECIFIED NERVOUS SYSTEM DISORDERS,,,052,ALTERATION IN CONSCIOUSNESS,01,DISEASES AND DISORDERS OF THE NERVOUS SYSTEM,3,Major,Major,Medical,Medicare,Medicare,Medicaid,,,true,33442.72,7278.74
Long Island,Suffolk,5123000,000885,Long Island Community Hospital,50 to 69,117,M,White,Not Span/Hispanic,3,Emergency,Home or Self Care,2019,NVS020,OTHER SPECIFIED NERVOUS SYSTEM DISORDERS,,,052,ALTERATION IN CONSCIOUSNESS,01,DISEASES AND DISORDERS OF THE NERVOUS SYSTEM,3,Major,Minor,Medical,Medicare,Medicare,Medicaid,,,true,23661.99,4340.35
Long Island,Suffolk,5123000,000885,Long Island Community Hospital,18 to 29,117,F,Other Race,Not Span/Hispanic,2,Emergency,Skilled Nursing Home,2019,NVS020,OTHER SPECIFIED NERVOUS SYSTEM DISORDERS,ADM017,ADMINISTRATION OF NUTRITIONAL AND ELECTROLYTIC SUBSTANCES,052,ALTERATION IN CONSCIOUSNESS,01,DISEASES AND DISORDERS OF THE NERVOUS SYSTEM,4,Extreme,Extreme,Medical,Medicaid,,,,,true,27758.02,4059.05
Long Island,Suffolk,5123000,000885,Long Island Community Hospital,30 to 49,117,F,White,Not Span/Hispanic,2,Emergency,Short-term Hospital,2019,NVS020,OTHER SPECIFIED NERVOUS SYSTEM DISORDERS,CAR024,VENOUS AND ARTERIAL CATHETER PLACEMENT,052,ALTERATION IN CONSCIOUSNESS,01,DISEASES AND DISORDERS OF THE NERVOUS SYSTEM,3,Major,Minor,Medical,Medicare,Medicare,Medicaid,,,true,38952.9,4303.59
Long Island,Suffolk,5123000,000885,Long Island Community Hospital,70 or Older,117,F,White,Not Span/Hispanic,6,Emergency,Hospice - Home,2019,NVS020,OTHER SPECIFIED NERVOUS SYSTEM DISORDERS,,,052,ALTERATION IN CONSCIOUSNESS,01,DISEASES AND DISORDERS OF THE NERVOUS SYSTEM,4,Extreme,Extreme,Medical,Medicare,Medicare,Medicaid,,,true,52981.62,8653.86
Long Island,Suffolk,5123000,000885,Long Island Community Hospital,70 or Older,117,F,White,Not Span/Hispanic,7,Emergency,Hospice - Medical Facility,2019,NVS020,OTHER SPECIFIED NERVOUS SYSTEM DISORDERS,ESA001,HEMODIALYSIS,052,ALTERATION IN CONSCIOUSNESS,01,DISEASES AND DISORDERS OF THE NERVOUS SYSTEM,3,Major,Major,Medical,Medicare,Medicare,Private Health Insurance,,,true,79330.37,13166.08
Long Island,Suffolk,5123000,000885,Long Island Community Hospital,70 or Older,119,F,White,Not Span/Hispanic,4,Emergency,Skilled Nursing Home,2019,NVS020,OTHER SPECIFIED NERVOUS SYSTEM DISORDERS,SKB006,SKIN LACERATION REPAIR (EXCLUDING PERINEUM),052,ALTERATION IN CONSCIOUSNESS,01,DISEASES AND DISORDERS OF THE NERVOUS SYSTEM,3,Major,Moderate,Medical,Medicare,Medicare,,,,true,53143.64,6020.1