Hospital Service Area,Hospital County,Operating Certificate Number,Permanent Facility Id,Facility Name,Age Group,Zip Code - 3 digits,Gender,Race,Ethnicity,Length of Stay,Type of Admission,Patient Disposition,Discharge Year,CCS Diagnosis Code,CCS Diagnosis Description,CCS Procedure Code,CCS Procedure Description,APR DRG Code,APR DRG Description,APR MDC Code,APR MDC Description,APR Severity of Illness Code,APR Severity of Illness Description,APR Risk of Mortality,APR Medical Surgical Description,Payment Typology 1,Payment Typology 2,Payment Typology 3,Birth Weight,Abortion Edit Indicator,Emergency Department Indicator,Total Charges,Total Costs
New York City,Bronx,7000006,003058,Montefiore Med Center - Jack D Weiler Hosp of A Einstein College Div,50 to 69,104,F,Other Race,Spanish/Hispanic,3,Emergency,Home or Self Care,2020,NVS020,OTHER SPECIFIED NERVOUS SYSTEM DISORDERS,ADM021,"ADMINISTRATION OF THERAPEUTIC SUBSTANCES, NEC",052,ALTERATION IN CONSCIOUSNESS,01,DISEASES AND DISORDERS OF THE NERVOUS SYSTEM,3,Major,Major,Medical,Medicare,,,,,Y,36512.59,5539.99
New York City,Bronx,7000006,003058,Montefiore Med Center - Jack D Weiler Hosp of A Einstein College Div,70 or Older,104,F,Black/African American,Not Span/Hispanic,6,Emergency,Home w/ Home Health Services,2020,NVS020,OTHER SPECIFIED NERVOUS SYSTEM DISORDERS,MAM011,ELECTROENCEPHALOGRAM (EEG),052,ALTERATION IN CONSCIOUSNESS,01,DISEASES AND DISORDERS OF THE NERVOUS SYSTEM,3,Major,Major,Medical,Medicare,Private Health Insurance,,,,Y,72866.13,11489.31
New York City,Bronx,7000006,001168,Montefiore Medical Center-Wakefield Hospital,50 to 69,104,F,Other Race,Spanish/Hispanic,3,Emergency,Skilled Nursing Home,2020,NVS020,OTHER SPECIFIED NERVOUS SYSTEM DISORDERS,ADM015,ADMINISTRATION OF ANTIBIOTICS,052,ALTERATION IN CONSCIOUSNESS,01,DISEASES AND DISORDERS OF THE NERVOUS SYSTEM,2,Moderate,Moderate,Medical,Medicare,Medicaid,,,,Y,41349.7,7091.21
New York City,Bronx,7000006,003058,Montefiore Med Center - Jack D Weiler Hosp of A Einstein College Div,70 or Older,104,M,White,Not Span/Hispanic,17,Emergency,Skilled Nursing Home,2020,NVS020,OTHER SPECIFIED NERVOUS SYSTEM DISORDERS,IMG008,ULTRASONOGRAPHY,052,ALTERATION IN CONSCIOUSNESS,01,DISEASES AND DISORDERS OF THE NERVOUS SYSTEM,3,Major,Major,Medical,Medicare,Medicaid,,,,Y,201693.41,36620.2
New York City,Manhattan,7002024,001456,Mount Sinai Hospital,50 to 69,100,F,Other Race,Unknown,10,Emergency,Home or Self Care,2020,CIR024,OTHER AND ILL-DEFINED CEREBROVASCULAR DISEASE,ADM005,ADMINISTRATION OF THROMBOLYTICS AND PLATELET INHIBITORS,052,ALTERATION IN CONSCIOUSNESS,01,DISEASES AND DISORDERS OF THE NERVOUS SYSTEM,4,Extreme,Extreme,Medical,Medicaid,Self-Pay,,,,Y,227971.6,53523.18
New York City,Bronx,7000006,003058,Montefiore Med Center - Jack D Weiler Hosp of A Einstein College Div,70 or Older,104,F,Black/African American,Not Span/Hispanic,17,Emergency,Skilled Nursing Home,2020,NVS020,OTHER SPECIFIED NERVOUS SYSTEM DISORDERS,ADM021,"ADMINISTRATION OF THERAPEUTIC SUBSTANCES, NEC",052,ALTERATION IN CONSCIOUSNESS,01,DISEASES AND DISORDERS OF THE NERVOUS SYSTEM,3,Major,Moderate,Medical,Medicare,Medicaid,,,,Y,216761.1,38766.66
Capital/Adirond,Otsego,3801000,000739,A.O. Fox Memorial Hospital,50 to 69,138,M,White,Not Span/Hispanic,3,Emergency,Expired,2020,NVS020,OTHER SPECIFIED NERVOUS SYSTEM DISORDERS,ESA004,NON-INVASIVE VENTILATION,052,ALTERATION IN CONSCIOUSNESS,01,DISEASES AND DISORDERS OF THE NERVOUS SYSTEM,3,Major,Major,Medical,Medicare,Blue Cross/Blue Shield,Private Health Insurance,,,Y,9112.91,4931.5
New York City,Bronx,7000006,001169,Montefiore Medical Center - Henry & Lucy Moses Div,0 to 17,104,M,Other Race,Spanish/Hispanic,7,Emergency,Home or Self Care,2020,SYM010,NERVOUS SYSTEM SIGNS AND SYMPTOMS,MAM011,ELECTROENCEPHALOGRAM (EEG),052,ALTERATION IN CONSCIOUSNESS,01,DISEASES AND DISORDERS OF THE NERVOUS SYSTEM,2,Moderate,Minor,Medical,Blue Cross/Blue Shield,Medicaid,,,,Y,69372.64,18614.58
Hudson Valley,Westchester,5904001,001072,Montefiore New Rochelle Hospital,70 or Older,108,F,White,Unknown,2,Emergency,Home w/ Home Health Services,2020,CIR008,HYPERTENSION WITH COMPLICATIONS AND SECONDARY HYPERTENSION,,,052,ALTERATION IN CONSCIOUSNESS,01,DISEASES AND DISORDERS OF THE NERVOUS SYSTEM,2,Moderate,Minor,Medical,Medicare,Medicare,Medicaid,,,Y,26187.31,11091.91
New York City,Manhattan,7002024,001456,Mount Sinai Hospital,30 to 49,112,F,White,Spanish/Hispanic,5,Emergency,Skilled Nursing Home,2020,NVS020,OTHER SPECIFIED NERVOUS SYSTEM DISORDERS,ESA001,HEMODIALYSIS,052,ALTERATION IN CONSCIOUSNESS,01,DISEASES AND DISORDERS OF THE NERVOUS SYSTEM,3,Major,Major,Medical,Medicare,Medicaid,Self-Pay,,,Y,93238.77,21459.99
New York City,Manhattan,7002024,001456,Mount Sinai Hospital,70 or Older,100,F,Black/African American,Not Span/Hispanic,10,Emergency,Skilled Nursing Home,2020,NVS020,OTHER SPECIFIED NERVOUS SYSTEM DISORDERS,GIS017,GASTROSTOMY,052,ALTERATION IN CONSCIOUSNESS,01,DISEASES AND DISORDERS OF THE NERVOUS SYSTEM,3,Major,Major,Medical,Medicare,Medicare,Medicaid,,,Y,119199.07,30397.14
New York City,Bronx,7000006,003058,Montefiore Med Center - Jack D Weiler Hosp of A Einstein College Div,18 to 29,104,F,Black/African American,Not Span/Hispanic,15,Emergency,Home or Self Care,2020,NVS020,OTHER SPECIFIED NERVOUS SYSTEM DISORDERS,CNS002,LUMBAR PUNCTURE,052,ALTERATION IN CONSCIOUSNESS,01,DISEASES AND DISORDERS OF THE NERVOUS SYSTEM,2,Moderate,Minor,Medical,Medicaid,,,,,Y,203881.1,35341.08
New York City,Bronx,7000006,001169,Montefiore Medical Center - Henry & Lucy Moses Div,70 or Older,104,F,Other Race,Spanish/Hispanic,7,Emergency,Expired,2020,NVS020,OTHER SPECIFIED NERVOUS SYSTEM DISORDERS,ADM001,TRANSFUSION OF BLOOD AND BLOOD PRODUCTS,052,ALTERATION IN CONSCIOUSNESS,01,DISEASES AND DISORDERS OF THE NERVOUS SYSTEM,4,Extreme,Extreme,Medical,Medicare,,,,,Y,108293.85,16898
New York City,Kings,7002002,001324,Mount Sinai Brooklyn,70 or Older,112,F,White,Unknown,12,Emergency,Skilled Nursing Home,2020,NVS020,OTHER SPECIFIED NERVOUS SYSTEM DISORDERS,MAM006,PACEMAKER AND DEFIBRILLATOR INTERROGATION,052,ALTERATION IN CONSCIOUSNESS,01,DISEASES AND DISORDERS OF THE NERVOUS SYSTEM,3,Major,Major,Medical,Medicare,Medicaid,Self-Pay,,,Y,127734.58,17054.69
New York City,Kings,7002002,001324,Mount Sinai Brooklyn,70 or Older,112,M,White,Unknown,18,Emergency,Skilled Nursing Home,2020,NVS020,OTHER SPECIFIED NERVOUS SYSTEM DISORDERS,MAM011,ELECTROENCEPHALOGRAM (EEG),052,ALTERATION IN CONSCIOUSNESS,01,DISEASES AND DISORDERS OF THE NERVOUS SYSTEM,3,Major,Major,Medical,Medicare,Blue Cross/Blue Shield,Self-Pay,,,Y,200269.96,30340.46
New York City,Kings,7002002,001324,Mount Sinai Brooklyn,50 to 69,112,F,Black/African American,Unknown,3,Emergency,Home w/ Home Health Services,2020,NVS020,OTHER SPECIFIED NERVOUS SYSTEM DISORDERS,,,052,ALTERATION IN CONSCIOUSNESS,01,DISEASES AND DISORDERS OF THE NERVOUS SYSTEM,2,Moderate,Minor,Medical,Medicaid,Self-Pay,,,,Y,46086.7,7645.04
New York City,Kings,7002002,001324,Mount Sinai Brooklyn,50 to 69,112,M,White,Not Span/Hispanic,2,Emergency,Short-term Hospital,2020,NVS020,OTHER SPECIFIED NERVOUS SYSTEM DISORDERS,IMG008,ULTRASONOGRAPHY,052,ALTERATION IN CONSCIOUSNESS,01,DISEASES AND DISORDERS OF THE NERVOUS SYSTEM,3,Major,Major,Medical,Medicare,Medicaid,Self-Pay,,,N,32113.34,5353.6
New York City,Kings,7002002,001324,Mount Sinai Brooklyn,70 or Older,112,F,Black/African American,Not Span/Hispanic,8,Emergency,Skilled Nursing Home,2020,CIR008,HYPERTENSION WITH COMPLICATIONS AND SECONDARY HYPERTENSION,IMG008,ULTRASONOGRAPHY,052,ALTERATION IN CONSCIOUSNESS,01,DISEASES AND DISORDERS OF THE NERVOUS SYSTEM,2,Moderate,Moderate,Medical,Medicare,Miscellaneous/Other,Self-Pay,,,Y,102082.27,11786.52
New York City,Manhattan,7002032,001469,Mount Sinai Morningside,50 to 69,100,F,Other Race,Not Span/Hispanic,8,Emergency,Home w/ Home Health Services,2020,NVS020,OTHER SPECIFIED NERVOUS SYSTEM DISORDERS,MAM007,ELECTROCARDIOGRAM (ECG),052,ALTERATION IN CONSCIOUSNESS,01,DISEASES AND DISORDERS OF THE NERVOUS SYSTEM,3,Major,Major,Medical,Medicare,Medicare,Medicaid,,,Y,106176.48,22097.7
New York City,Manhattan,7002032,001469,Mount Sinai Morningside,70 or Older,100,F,White,Spanish/Hispanic,1,Emergency,Home w/ Home Health Services,2020,NVS020,OTHER SPECIFIED NERVOUS SYSTEM DISORDERS,ADM015,ADMINISTRATION OF ANTIBIOTICS,052,ALTERATION IN CONSCIOUSNESS,01,DISEASES AND DISORDERS OF THE NERVOUS SYSTEM,3,Major,Moderate,Medical,Medicare,Medicare,Medicaid,,,Y,17673.29,4003.96
New York City,Kings,7002002,001324,Mount Sinai Brooklyn,70 or Older,112,M,Other Race,Not Span/Hispanic,4,Emergency,Home w/ Home Health Services,2020,NVS020,OTHER SPECIFIED NERVOUS SYSTEM DISORDERS,IMG008,ULTRASONOGRAPHY,052,ALTERATION IN CONSCIOUSNESS,01,DISEASES AND DISORDERS OF THE NERVOUS SYSTEM,3,Major,Major,Medical,Private Health Insurance,Self-Pay,,,,Y,61577.48,7631.66
New York City,Bronx,7000006,003058,Montefiore Med Center - Jack D Weiler Hosp of A Einstein College Div,50 to 69,104,M,Other Race,Not Span/Hispanic,3,Emergency,Home w/ Home Health Services,2020,NVS020,OTHER SPECIFIED NERVOUS SYSTEM DISORDERS,,,052,ALTERATION IN CONSCIOUSNESS,01,DISEASES AND DISORDERS OF THE NERVOUS SYSTEM,2,Moderate,Moderate,Medical,Medicaid,,,,,Y,48847.03,6423.98
New York City,Manhattan,7002002,001439,Mount Sinai Beth Israel,50 to 69,100,M,White,Not Span/Hispanic,2,Emergency,Home or Self Care,2020,NVS020,OTHER SPECIFIED NERVOUS SYSTEM DISORDERS,ADM017,ADMINISTRATION OF NUTRITIONAL AND ELECTROLYTIC SUBSTANCES,052,ALTERATION IN CONSCIOUSNESS,01,DISEASES AND DISORDERS OF THE NERVOUS SYSTEM,3,Major,Major,Medical,Medicaid,Medicaid,Self-Pay,,,Y,26062.44,5437.66
New York City,Manhattan,7002002,001439,Mount Sinai Beth Israel,70 or Older,100,F,Other Race,Not Span/Hispanic,4,Emergency,Home w/ Home Health Services,2020,NVS020,OTHER SPECIFIED NERVOUS SYSTEM DISORDERS,IMG008,ULTRASONOGRAPHY,052,ALTERATION IN CONSCIOUSNESS,01,DISEASES AND DISORDERS OF THE NERVOUS SYSTEM,3,Major,Major,Medical,Medicare,Miscellaneous/Other,Medicaid,,,Y,47512,10876.07
New York City,Manhattan,7002032,001466,Mount Sinai West,70 or Older,100,F,White,Not Span/Hispanic,10,Emergency,Hospice - Home,2020,NVS020,OTHER SPECIFIED NERVOUS SYSTEM DISORDERS,IMG008,ULTRASONOGRAPHY,052,ALTERATION IN CONSCIOUSNESS,01,DISEASES AND DISORDERS OF THE NERVOUS SYSTEM,3,Major,Major,Medical,Medicaid,Medicaid,Self-Pay,,,Y,113379.81,25077.56
New York City,Manhattan,7002032,001466,Mount Sinai West,70 or Older,104,M,White,Not Span/Hispanic,3,Emergency,Skilled Nursing Home,2020,NVS020,OTHER SPECIFIED NERVOUS SYSTEM DISORDERS,IMG005,MAGNETIC RESONANCE IMAGING (MRI),052,ALTERATION IN CONSCIOUSNESS,01,DISEASES AND DISORDERS OF THE NERVOUS SYSTEM,3,Major,Minor,Medical,Medicare,Medicaid,Self-Pay,,,Y,49344.52,10474.79
New York City,Manhattan,7002032,001466,Mount Sinai West,70 or Older,100,M,White,Not Span/Hispanic,18,Emergency,Skilled Nursing Home,2020,NVS020,OTHER SPECIFIED NERVOUS SYSTEM DISORDERS,MAM011,ELECTROENCEPHALOGRAM (EEG),052,ALTERATION IN CONSCIOUSNESS,01,DISEASES AND DISORDERS OF THE NERVOUS SYSTEM,3,Major,Major,Medical,Medicare,Private Health Insurance,Self-Pay,,,Y,185374.33,39761.83
New York City,Manhattan,7002002,001439,Mount Sinai Beth Israel,70 or Older,100,M,White,Unknown,4,Emergency,Home or Self Care,2020,NVS020,OTHER SPECIFIED NERVOUS SYSTEM DISORDERS,IMG009,PLAIN RADIOGRAPHY,052,ALTERATION IN CONSCIOUSNESS,01,DISEASES AND DISORDERS OF THE NERVOUS SYSTEM,3,Major,Major,Medical,Medicare,Self-Pay,,,,Y,42764.52,9874.11
New York City,Bronx,7000006,001169,Montefiore Medical Center - Henry & Lucy Moses Div,0 to 17,104,F,Other Race,Unknown,2,Elective,Home or Self Care,2020,SYM010,NERVOUS SYSTEM SIGNS AND SYMPTOMS,MAM011,ELECTROENCEPHALOGRAM (EEG),052,ALTERATION IN CONSCIOUSNESS,01,DISEASES AND DISORDERS OF THE NERVOUS SYSTEM,1,Minor,Minor,Medical,Medicaid,,,,,N,23290,6032.2
New York City,Bronx,7000006,003058,Montefiore Med Center - Jack D Weiler Hosp of A Einstein College Div,70 or Older,104,M,White,Not Span/Hispanic,3,Emergency,Home w/ Home Health Services,2020,NVS020,OTHER SPECIFIED NERVOUS SYSTEM DISORDERS,MAM011,ELECTROENCEPHALOGRAM (EEG),052,ALTERATION IN CONSCIOUSNESS,01,DISEASES AND DISORDERS OF THE NERVOUS SYSTEM,2,Moderate,Moderate,Medical,Medicare,Private Health Insurance,,,,Y,36307.81,5964.71
New York City,Manhattan,7002024,001456,Mount Sinai Hospital,50 to 69,104,F,Black/African American,Not Span/Hispanic,2,Emergency,Home or Self Care,2020,NVS020,OTHER SPECIFIED NERVOUS SYSTEM DISORDERS,,,052,ALTERATION IN CONSCIOUSNESS,01,DISEASES AND DISORDERS OF THE NERVOUS SYSTEM,3,Major,Moderate,Medical,Medicare,Medicare,Self-Pay,,,Y,42086.3,8829.64
New York City,Bronx,7000006,003058,Montefiore Med Center - Jack D Weiler Hosp of A Einstein College Div,70 or Older,104,M,Other Race,Not Span/Hispanic,3,Emergency,Home w/ Home Health Services,2020,NVS020,OTHER SPECIFIED NERVOUS SYSTEM DISORDERS,ADM015,ADMINISTRATION OF ANTIBIOTICS,052,ALTERATION IN CONSCIOUSNESS,01,DISEASES AND DISORDERS OF THE NERVOUS SYSTEM,3,Major,Minor,Medical,Medicare,Blue Cross/Blue Shield,,,,Y,43987.31,7599.8
Hudson Valley,Westchester,5904001,001072,Montefiore New Rochelle Hospital,70 or Older,105,F,Black/African American,Unknown,7,Emergency,Home w/ Home Health Services,2020,NVS020,OTHER SPECIFIED NERVOUS SYSTEM DISORDERS,OTR004,ISOLATION PROCEDURES,052,ALTERATION IN CONSCIOUSNESS,01,DISEASES AND DISORDERS OF THE NERVOUS SYSTEM,3,Major,Moderate,Medical,Medicare,Medicare,Self-Pay,,,Y,46497.9,13083.69
Hudson Valley,Westchester,5903001,001061,Montefiore Mount Vernon Hospital,50 to 69,105,F,White,Spanish/Hispanic,2,Emergency,Left Against Medical Advice,2020,NVS020,OTHER SPECIFIED NERVOUS SYSTEM DISORDERS,,,052,ALTERATION IN CONSCIOUSNESS,01,DISEASES AND DISORDERS OF THE NERVOUS SYSTEM,3,Major,Moderate,Medical,Medicaid,Medicaid,Self-Pay,,,Y,20772.66,7852.77
New York City,Manhattan,7002054,003975,New York Presbyterian Hospital - Allen Hospital,70 or Older,104,M,Multi-racial,Spanish/Hispanic,6,Emergency,Skilled Nursing Home,2020,NVS020,OTHER SPECIFIED NERVOUS SYSTEM DISORDERS,ADM021,"ADMINISTRATION OF THERAPEUTIC SUBSTANCES, NEC",052,ALTERATION IN CONSCIOUSNESS,01,DISEASES AND DISORDERS OF THE NERVOUS SYSTEM,3,Major,Major,Medical,Medicare,Medicare,Medicaid,,,Y,80904.95,17176.15
Long Island,Nassau,2908000,000511,NYU Langone Hospital-Long Island,50 to 69,110,F,White,Unknown,21,Emergency,Home w/ Home Health Services,2020,NVS020,OTHER SPECIFIED NERVOUS SYSTEM DISORDERS,MAM011,ELECTROENCEPHALOGRAM (EEG),052,ALTERATION IN CONSCIOUSNESS,01,DISEASES AND DISORDERS OF THE NERVOUS SYSTEM,3,Major,Major,Medical,Medicaid,,,,,Y,257935.63,72764.5
Long Island,Nassau,2908000,000511,NYU Langone Hospital-Long Island,70 or Older,110,M,Black/African American,Not Span/Hispanic,2,Emergency,Home w/ Home Health Services,2020,NVS020,OTHER SPECIFIED NERVOUS SYSTEM DISORDERS,,,052,ALTERATION IN CONSCIOUSNESS,01,DISEASES AND DISORDERS OF THE NERVOUS SYSTEM,3,Major,Major,Medical,Medicare,Medicaid,,,,Y,43892.89,9401.82
Long Island,Nassau,2908000,000511,NYU Langone Hospital-Long Island,70 or Older,110,F,Other Race,Spanish/Hispanic,3,Emergency,Home w/ Home Health Services,2020,NVS020,OTHER SPECIFIED NERVOUS SYSTEM DISORDERS,MAM011,ELECTROENCEPHALOGRAM (EEG),052,ALTERATION IN CONSCIOUSNESS,01,DISEASES AND DISORDERS OF THE NERVOUS SYSTEM,3,Major,Major,Medical,Medicaid,,,,,Y,56027.85,13300.97
Long Island,Nassau,2908000,000511,NYU Langone Hospital-Long Island,18 to 29,110,F,White,Not Span/Hispanic,3,Emergency,Home or Self Care,2020,NVS020,OTHER SPECIFIED NERVOUS SYSTEM DISORDERS,MAM011,ELECTROENCEPHALOGRAM (EEG),052,ALTERATION IN CONSCIOUSNESS,01,DISEASES AND DISORDERS OF THE NERVOUS SYSTEM,3,Major,Major,Medical,Blue Cross/Blue Shield,Blue Cross/Blue Shield,,,,Y,137632.16,20190.29
New York City,Manhattan,7002054,001464,New York-Presbyterian Hospital - Columbia Presbyterian Center,70 or Older,100,F,White,Not Span/Hispanic,1,Emergency,Home w/ Home Health Services,2020,NVS020,OTHER SPECIFIED NERVOUS SYSTEM DISORDERS,,,052,ALTERATION IN CONSCIOUSNESS,01,DISEASES AND DISORDERS OF THE NERVOUS SYSTEM,3,Major,Major,Medical,Medicare,Medicaid,Self-Pay,,,Y,25908.88,5157.03
New York City,Manhattan,7002054,001464,New York-Presbyterian Hospital - Columbia Presbyterian Center,50 to 69,112,M,White,Not Span/Hispanic,4,Emergency,Home or Self Care,2020,NVS020,OTHER SPECIFIED NERVOUS SYSTEM DISORDERS,ADM021,"ADMINISTRATION OF THERAPEUTIC SUBSTANCES, NEC",052,ALTERATION IN CONSCIOUSNESS,01,DISEASES AND DISORDERS OF THE NERVOUS SYSTEM,3,Major,Major,Medical,Private Health Insurance,Self-Pay,,,,Y,79091.95,19669.32
New York City,Manhattan,7002054,001464,New York-Presbyterian Hospital - Columbia Presbyterian Center,50 to 69,112,M,Other Race,Not Span/Hispanic,3,Emergency,Left Against Medical Advice,2020,NVS020,OTHER SPECIFIED NERVOUS SYSTEM DISORDERS,CNS002,LUMBAR PUNCTURE,052,ALTERATION IN CONSCIOUSNESS,01,DISEASES AND DISORDERS OF THE NERVOUS SYSTEM,3,Major,Minor,Medical,Medicaid,Medicaid,Self-Pay,,,Y,54926.47,11039.65
New York City,Manhattan,7002054,001464,New York-Presbyterian Hospital - Columbia Presbyterian Center,50 to 69,119,M,White,Not Span/Hispanic,7,Emergency,Home w/ Home Health Services,2020,NVS020,OTHER SPECIFIED NERVOUS SYSTEM DISORDERS,ADM015,ADMINISTRATION OF ANTIBIOTICS,052,ALTERATION IN CONSCIOUSNESS,01,DISEASES AND DISORDERS OF THE NERVOUS SYSTEM,3,Major,Moderate,Medical,Medicare,Private Health Insurance,Self-Pay,,,Y,117076.42,25099.73
New York City,Manhattan,7002054,001464,New York-Presbyterian Hospital - Columbia Presbyterian Center,0 to 17,100,F,Multi-racial,Not Span/Hispanic,1,Elective,Home or Self Care,2020,SYM010,NERVOUS SYSTEM SIGNS AND SYMPTOMS,,,052,ALTERATION IN CONSCIOUSNESS,01,DISEASES AND DISORDERS OF THE NERVOUS SYSTEM,1,Minor,Minor,Medical,Medicaid,Medicaid,Self-Pay,,,N,16839.38,3364.64
New York City,Manhattan,7002054,001464,New York-Presbyterian Hospital - Columbia Presbyterian Center,0 to 17,104,F,Other Race,Spanish/Hispanic,1,Urgent,Home or Self Care,2020,SYM010,NERVOUS SYSTEM SIGNS AND SYMPTOMS,,,052,ALTERATION IN CONSCIOUSNESS,01,DISEASES AND DISORDERS OF THE NERVOUS SYSTEM,1,Minor,Minor,Medical,Medicaid,Medicaid,Self-Pay,,,N,16811,3350.46
New York City,Manhattan,7002024,001456,Mount Sinai Hospital,70 or Older,112,M,Other Race,Not Span/Hispanic,4,Emergency,Home w/ Home Health Services,2020,CIR008,HYPERTENSION WITH COMPLICATIONS AND SECONDARY HYPERTENSION,IMG006,COMPUTERIZED TOMOGRAPHY (CT) WITH CONTRAST,052,ALTERATION IN CONSCIOUSNESS,01,DISEASES AND DISORDERS OF THE NERVOUS SYSTEM,2,Moderate,Moderate,Medical,Medicare,Medicare,Medicaid,,,Y,62966.25,13772.33
New York City,Queens,7003010,001637,New York - Presbyterian/Queens,70 or Older,113,F,Other Race,Not Span/Hispanic,4,Emergency,Home w/ Home Health Services,2020,NVS020,OTHER SPECIFIED NERVOUS SYSTEM DISORDERS,MAM011,ELECTROENCEPHALOGRAM (EEG),052,ALTERATION IN CONSCIOUSNESS,01,DISEASES AND DISORDERS OF THE NERVOUS SYSTEM,3,Major,Moderate,Medical,Medicare,Medicaid,Self-Pay,,,Y,52332.24,10146.21
New York City,Queens,7003010,001637,New York - Presbyterian/Queens,50 to 69,114,M,White,Not Span/Hispanic,4,Emergency,Home or Self Care,2020,NVS020,OTHER SPECIFIED NERVOUS SYSTEM DISORDERS,MAM011,ELECTROENCEPHALOGRAM (EEG),052,ALTERATION IN CONSCIOUSNESS,01,DISEASES AND DISORDERS OF THE NERVOUS SYSTEM,3,Major,Moderate,Medical,Medicare,Medicaid,Self-Pay,,,Y,37907.89,8193.47
New York City,Queens,7003010,001637,New York - Presbyterian/Queens,0 to 17,113,F,White,Spanish/Hispanic,1,Elective,Home or Self Care,2020,SYM010,NERVOUS SYSTEM SIGNS AND SYMPTOMS,MAM011,ELECTROENCEPHALOGRAM (EEG),052,ALTERATION IN CONSCIOUSNESS,01,DISEASES AND DISORDERS OF THE NERVOUS SYSTEM,1,Minor,Minor,Medical,Medicaid,Self-Pay,,,,N,10375,2076.52
New York City,Queens,7003010,001637,New York - Presbyterian/Queens,70 or Older,113,M,Other Race,Spanish/Hispanic,1,Emergency,Home or Self Care,2020,NVS020,OTHER SPECIFIED NERVOUS SYSTEM DISORDERS,ADM017,ADMINISTRATION OF NUTRITIONAL AND ELECTROLYTIC SUBSTANCES,052,ALTERATION IN CONSCIOUSNESS,01,DISEASES AND DISORDERS OF THE NERVOUS SYSTEM,3,Major,Major,Medical,Medicare,Medicaid,Self-Pay,,,Y,13417.48,2940.64
New York City,Queens,7003010,001637,New York - Presbyterian/Queens,70 or Older,114,F,Black/African American,Not Span/Hispanic,5,Emergency,Skilled Nursing Home,2020,NVS020,OTHER SPECIFIED NERVOUS SYSTEM DISORDERS,ESA001,HEMODIALYSIS,052,ALTERATION IN CONSCIOUSNESS,01,DISEASES AND DISORDERS OF THE NERVOUS SYSTEM,3,Major,Moderate,Medical,Medicare,Medicaid,Self-Pay,,,Y,61258.1,12732.02
New York City,Manhattan,7002053,001463,NYU Langone Hospitals,0 to 17,113,F,Other Race,Not Span/Hispanic,1,Elective,Home or Self Care,2020,SYM010,NERVOUS SYSTEM SIGNS AND SYMPTOMS,MAM011,ELECTROENCEPHALOGRAM (EEG),052,ALTERATION IN CONSCIOUSNESS,01,DISEASES AND DISORDERS OF THE NERVOUS SYSTEM,1,Minor,Minor,Medical,Medicaid,,,,,N,5579.33,2038.96
New York City,Queens,7003010,001637,New York - Presbyterian/Queens,50 to 69,113,F,Black/African American,Not Span/Hispanic,1,Emergency,Home or Self Care,2020,CIR008,HYPERTENSION WITH COMPLICATIONS AND SECONDARY HYPERTENSION,,,052,ALTERATION IN CONSCIOUSNESS,01,DISEASES AND DISORDERS OF THE NERVOUS SYSTEM,2,Moderate,Minor,Medical,Private Health Insurance,,,,,Y,27246.58,4542.3
New York City,Kings,7002053,001304,NYU Langone Hospital-Brooklyn,70 or Older,112,F,White,Not Span/Hispanic,5,Emergency,Home w/ Home Health Services,2020,NVS020,OTHER SPECIFIED NERVOUS SYSTEM DISORDERS,,,052,ALTERATION IN CONSCIOUSNESS,01,DISEASES AND DISORDERS OF THE NERVOUS SYSTEM,3,Major,Major,Medical,Medicare,Medicaid,,,,Y,105201.01,22389.54
New York City,Queens,7003010,001637,New York - Presbyterian/Queens,70 or Older,113,F,White,Not Span/Hispanic,1,Emergency,Home or Self Care,2020,NVS012,TRANSIENT CEREBRAL ISCHEMIA,ADM010,VACCINATIONS,052,ALTERATION IN CONSCIOUSNESS,01,DISEASES AND DISORDERS OF THE NERVOUS SYSTEM,2,Moderate,Minor,Medical,Medicare,Blue Cross/Blue Shield,Self-Pay,,,Y,30237.09,4723.54
New York City,Kings,7001037,001320,University Hospital of Brooklyn,70 or Older,112,F,Black/African American,Not Span/Hispanic,11,Urgent,Home or Self Care,2020,NVS020,OTHER SPECIFIED NERVOUS SYSTEM DISORDERS,RHB002,"PHYSICAL, OCCUPATIONAL, AND RESPIRATORY THERAPY TREATMENT",052,ALTERATION IN CONSCIOUSNESS,01,DISEASES AND DISORDERS OF THE NERVOUS SYSTEM,3,Major,Moderate,Medical,Medicare,Blue Cross/Blue Shield,Private Health Insurance,,,N,58583,41495
New York City,Manhattan,7002054,001458,New York-Presbyterian Hospital - New York Weill Cornell Center,70 or Older,112,M,White,Not Span/Hispanic,8,Emergency,Skilled Nursing Home,2020,NVS020,OTHER SPECIFIED NERVOUS SYSTEM DISORDERS,ADM015,ADMINISTRATION OF ANTIBIOTICS,052,ALTERATION IN CONSCIOUSNESS,01,DISEASES AND DISORDERS OF THE NERVOUS SYSTEM,3,Major,Moderate,Medical,Medicare,Private Health Insurance,Self-Pay,,,Y,103934.64,21922.05
New York City,Manhattan,7002054,001458,New York-Presbyterian Hospital - New York Weill Cornell Center,70 or Older,113,M,White,Not Span/Hispanic,8,Emergency,Expired,2020,NVS020,OTHER SPECIFIED NERVOUS SYSTEM DISORDERS,ADM015,ADMINISTRATION OF ANTIBIOTICS,052,ALTERATION IN CONSCIOUSNESS,01,DISEASES AND DISORDERS OF THE NERVOUS SYSTEM,4,Extreme,Major,Medical,Medicare,Private Health Insurance,Self-Pay,,,Y,107457.39,36602.94
New York City,Kings,7001021,001306,New York - Presbyterian Brooklyn Methodist Hospital,50 to 69,112,M,White,Not Span/Hispanic,5,Emergency,Home or Self Care,2020,NVS020,OTHER SPECIFIED NERVOUS SYSTEM DISORDERS,,,052,ALTERATION IN CONSCIOUSNESS,01,DISEASES AND DISORDERS OF THE NERVOUS SYSTEM,3,Major,Moderate,Medical,Medicare,Blue Cross/Blue Shield,Self-Pay,,,Y,42319.1,9305.36