Hospital Service Area,Hospital County,Operating Certificate Number,Permanent Facility Id,Facility Name,Age Group,Zip Code - 3 digits,Gender,Race,Ethnicity,Length of Stay,Type of Admission,Patient Disposition,Discharge Year,CCS Diagnosis Code,CCS Diagnosis Description,CCS Procedure Code,CCS Procedure Description,APR DRG Code,APR DRG Description,APR MDC Code,APR MDC Description,APR Severity of Illness Code,APR Severity of Illness Description,APR Risk of Mortality,APR Medical Surgical Description,Payment Typology 1,Payment Typology 2,Payment Typology 3,Birth Weight,Abortion Edit Indicator,Emergency Department Indicator,Total Charges,Total Costs
New York City,Kings,7002053,001304,NYU Langone Hospital-Brooklyn,70 or Older,112,F,White,Not Span/Hispanic,5,Emergency,Home w/ Home Health Services,2020,NVS020,OTHER SPECIFIED NERVOUS SYSTEM DISORDERS,,,052,ALTERATION IN CONSCIOUSNESS,01,DISEASES AND DISORDERS OF THE NERVOUS SYSTEM,3,Major,Major,Medical,Medicare,Medicaid,,,,Y,105201.01,22389.54
New York City,Kings,7002053,001304,NYU Langone Hospital-Brooklyn,50 to 69,112,M,White,Not Span/Hispanic,14,Elective,Home w/ Home Health Services,2020,NVS020,OTHER SPECIFIED NERVOUS SYSTEM DISORDERS,RHB002,"PHYSICAL, OCCUPATIONAL, AND RESPIRATORY THERAPY TREATMENT",052,ALTERATION IN CONSCIOUSNESS,01,DISEASES AND DISORDERS OF THE NERVOUS SYSTEM,3,Major,Minor,Medical,Medicare,,,,,N,211892.33,46569.03
New York City,Kings,7002053,001304,NYU Langone Hospital-Brooklyn,30 to 49,112,F,White,Not Span/Hispanic,1,Emergency,Home or Self Care,2020,NVS020,OTHER SPECIFIED NERVOUS SYSTEM DISORDERS,ADM021,"ADMINISTRATION OF THERAPEUTIC SUBSTANCES, NEC",052,ALTERATION IN CONSCIOUSNESS,01,DISEASES AND DISORDERS OF THE NERVOUS SYSTEM,2,Moderate,Moderate,Medical,Blue Cross/Blue Shield,Blue Cross/Blue Shield,,,,Y,39296.51,10086.79
New York City,Kings,7002053,001304,NYU Langone Hospital-Brooklyn,70 or Older,112,F,White,Not Span/Hispanic,2,Emergency,Another Type Not Listed,2020,NVS020,OTHER SPECIFIED NERVOUS SYSTEM DISORDERS,ADM005,ADMINISTRATION OF THROMBOLYTICS AND PLATELET INHIBITORS,052,ALTERATION IN CONSCIOUSNESS,01,DISEASES AND DISORDERS OF THE NERVOUS SYSTEM,3,Major,Moderate,Medical,Medicare,Private Health Insurance,,,,Y,162378.94,22703.52
New York City,Kings,7002053,001304,NYU Langone Hospital-Brooklyn,70 or Older,112,M,Other Race,Not Span/Hispanic,5,Emergency,Home w/ Home Health Services,2020,NVS020,OTHER SPECIFIED NERVOUS SYSTEM DISORDERS,MAM011,ELECTROENCEPHALOGRAM (EEG),052,ALTERATION IN CONSCIOUSNESS,01,DISEASES AND DISORDERS OF THE NERVOUS SYSTEM,3,Major,Moderate,Medical,Medicare,Medicaid,,,,Y,164152.73,34770.4
New York City,Kings,7002053,001304,NYU Langone Hospital-Brooklyn,50 to 69,112,F,White,Unknown,9,Elective,Home w/ Home Health Services,2020,NVS020,OTHER SPECIFIED NERVOUS SYSTEM DISORDERS,RHB002,"PHYSICAL, OCCUPATIONAL, AND RESPIRATORY THERAPY TREATMENT",052,ALTERATION IN CONSCIOUSNESS,01,DISEASES AND DISORDERS OF THE NERVOUS SYSTEM,3,Major,Minor,Medical,Medicaid,,,,,N,82204.06,27215.4
New York City,Kings,7002053,001304,NYU Langone Hospital-Brooklyn,50 to 69,112,F,White,Not Span/Hispanic,8,Emergency,Skilled Nursing Home,2020,NVS020,OTHER SPECIFIED NERVOUS SYSTEM DISORDERS,CAR024,VENOUS AND ARTERIAL CATHETER PLACEMENT,052,ALTERATION IN CONSCIOUSNESS,01,DISEASES AND DISORDERS OF THE NERVOUS SYSTEM,3,Major,Major,Medical,Medicare,Blue Cross/Blue Shield,,,,Y,129038.6,35223.1
New York City,Kings,7002053,001304,NYU Langone Hospital-Brooklyn,50 to 69,112,M,White,Unknown,2,Emergency,Home or Self Care,2020,NVS020,OTHER SPECIFIED NERVOUS SYSTEM DISORDERS,MAM011,ELECTROENCEPHALOGRAM (EEG),052,ALTERATION IN CONSCIOUSNESS,01,DISEASES AND DISORDERS OF THE NERVOUS SYSTEM,2,Moderate,Major,Medical,Medicaid,,,,,Y,79804.81,14159.12
New York City,Kings,7002053,001304,NYU Langone Hospital-Brooklyn,30 to 49,112,M,White,Not Span/Hispanic,6,Emergency,Home or Self Care,2020,NVS020,OTHER SPECIFIED NERVOUS SYSTEM DISORDERS,CNS002,LUMBAR PUNCTURE,052,ALTERATION IN CONSCIOUSNESS,01,DISEASES AND DISORDERS OF THE NERVOUS SYSTEM,3,Major,Moderate,Medical,Medicare,,,,,Y,95539.55,23638.77
New York City,Kings,7002053,001304,NYU Langone Hospital-Brooklyn,50 to 69,112,M,White,Not Span/Hispanic,1,Emergency,Home or Self Care,2020,NVS012,TRANSIENT CEREBRAL ISCHEMIA,,,052,ALTERATION IN CONSCIOUSNESS,01,DISEASES AND DISORDERS OF THE NERVOUS SYSTEM,1,Minor,Minor,Medical,Blue Cross/Blue Shield,,,,,Y,36796.11,8173.71
New York City,Kings,7002053,001304,NYU Langone Hospital-Brooklyn,50 to 69,112,M,Other Race,Not Span/Hispanic,18,Emergency,Psychiatric Hospital or Unit of Hosp,2020,NVS020,OTHER SPECIFIED NERVOUS SYSTEM DISORDERS,MAM011,ELECTROENCEPHALOGRAM (EEG),052,ALTERATION IN CONSCIOUSNESS,01,DISEASES AND DISORDERS OF THE NERVOUS SYSTEM,3,Major,Moderate,Medical,Medicare,Medicaid,,,,N,488032.62,132905.57
New York City,Kings,7002053,001304,NYU Langone Hospital-Brooklyn,50 to 69,112,F,White,Not Span/Hispanic,3,Emergency,Home w/ Home Health Services,2020,NVS020,OTHER SPECIFIED NERVOUS SYSTEM DISORDERS,OTR004,ISOLATION PROCEDURES,052,ALTERATION IN CONSCIOUSNESS,01,DISEASES AND DISORDERS OF THE NERVOUS SYSTEM,2,Moderate,Minor,Medical,Medicare,,,,,Y,35413.69,11071.89
New York City,Kings,7002053,001304,NYU Langone Hospital-Brooklyn,70 or Older,112,M,Other Race,Not Span/Hispanic,3,Emergency,Home w/ Home Health Services,2020,NVS020,OTHER SPECIFIED NERVOUS SYSTEM DISORDERS,ADM021,"ADMINISTRATION OF THERAPEUTIC SUBSTANCES, NEC",052,ALTERATION IN CONSCIOUSNESS,01,DISEASES AND DISORDERS OF THE NERVOUS SYSTEM,3,Major,Moderate,Medical,Medicare,Medicaid,,,,Y,42903.15,11936.18
New York City,Kings,7002053,001304,NYU Langone Hospital-Brooklyn,70 or Older,112,M,White,Not Span/Hispanic,13,Emergency,Skilled Nursing Home,2020,NVS020,OTHER SPECIFIED NERVOUS SYSTEM DISORDERS,OTR004,ISOLATION PROCEDURES,052,ALTERATION IN CONSCIOUSNESS,01,DISEASES AND DISORDERS OF THE NERVOUS SYSTEM,3,Major,Major,Medical,Medicare,,,,,Y,159343.46,44233.66
New York City,Kings,7002053,001304,NYU Langone Hospital-Brooklyn,70 or Older,112,F,Other Race,Spanish/Hispanic,5,Emergency,Home w/ Home Health Services,2020,CIR008,HYPERTENSION WITH COMPLICATIONS AND SECONDARY HYPERTENSION,MAM011,ELECTROENCEPHALOGRAM (EEG),052,ALTERATION IN CONSCIOUSNESS,01,DISEASES AND DISORDERS OF THE NERVOUS SYSTEM,3,Major,Major,Medical,Medicare,Medicaid,,,,Y,168404.06,33252.82
New York City,Kings,7002053,001304,NYU Langone Hospital-Brooklyn,50 to 69,112,M,Other Race,Unknown,4,Emergency,Home w/ Home Health Services,2020,NVS020,OTHER SPECIFIED NERVOUS SYSTEM DISORDERS,MAM011,ELECTROENCEPHALOGRAM (EEG),052,ALTERATION IN CONSCIOUSNESS,01,DISEASES AND DISORDERS OF THE NERVOUS SYSTEM,3,Major,Major,Medical,Medicare,Medicaid,,,,Y,129989.98,23424.81
New York City,Kings,7002053,001304,NYU Langone Hospital-Brooklyn,70 or Older,112,M,Other Race,Spanish/Hispanic,9,Emergency,Home w/ Home Health Services,2020,NVS020,OTHER SPECIFIED NERVOUS SYSTEM DISORDERS,,,052,ALTERATION IN CONSCIOUSNESS,01,DISEASES AND DISORDERS OF THE NERVOUS SYSTEM,3,Major,Moderate,Medical,Medicare,Medicaid,,,,Y,162660.07,45453.8
New York City,Kings,7002053,001304,NYU Langone Hospital-Brooklyn,70 or Older,112,M,White,Not Span/Hispanic,7,Emergency,Skilled Nursing Home,2020,NVS020,OTHER SPECIFIED NERVOUS SYSTEM DISORDERS,ADM021,"ADMINISTRATION OF THERAPEUTIC SUBSTANCES, NEC",052,ALTERATION IN CONSCIOUSNESS,01,DISEASES AND DISORDERS OF THE NERVOUS SYSTEM,3,Major,Moderate,Medical,Medicare,,,,,Y,121700.65,35865.69
New York City,Kings,7002053,001304,NYU Langone Hospital-Brooklyn,70 or Older,112,M,White,Not Span/Hispanic,5,Emergency,Inpatient Rehabilitation Facility,2020,NVS020,OTHER SPECIFIED NERVOUS SYSTEM DISORDERS,CNS002,LUMBAR PUNCTURE,052,ALTERATION IN CONSCIOUSNESS,01,DISEASES AND DISORDERS OF THE NERVOUS SYSTEM,3,Major,Major,Medical,Medicare,Blue Cross/Blue Shield,,,,Y,169968.33,30900.23
New York City,Kings,7002053,001304,NYU Langone Hospital-Brooklyn,70 or Older,112,M,White,Not Span/Hispanic,3,Emergency,Home w/ Home Health Services,2020,NVS020,OTHER SPECIFIED NERVOUS SYSTEM DISORDERS,MAM011,ELECTROENCEPHALOGRAM (EEG),052,ALTERATION IN CONSCIOUSNESS,01,DISEASES AND DISORDERS OF THE NERVOUS SYSTEM,3,Major,Moderate,Medical,Medicare,,,,,Y,61021.03,17618.48
New York City,Kings,7002053,001304,NYU Langone Hospital-Brooklyn,50 to 69,112,F,Other Race,Spanish/Hispanic,3,Emergency,Home w/ Home Health Services,2020,NVS020,OTHER SPECIFIED NERVOUS SYSTEM DISORDERS,ESA004,NON-INVASIVE VENTILATION,052,ALTERATION IN CONSCIOUSNESS,01,DISEASES AND DISORDERS OF THE NERVOUS SYSTEM,3,Major,Moderate,Medical,Medicaid,,,,,Y,55236.86,16203.5
New York City,Kings,7002053,001304,NYU Langone Hospital-Brooklyn,50 to 69,112,M,White,Not Span/Hispanic,2,Emergency,Inpatient Rehabilitation Facility,2020,NVS020,OTHER SPECIFIED NERVOUS SYSTEM DISORDERS,MAM011,ELECTROENCEPHALOGRAM (EEG),052,ALTERATION IN CONSCIOUSNESS,01,DISEASES AND DISORDERS OF THE NERVOUS SYSTEM,3,Major,Extreme,Medical,Private Health Insurance,,,,,Y,56218.14,11930
New York City,Kings,7002053,001304,NYU Langone Hospital-Brooklyn,70 or Older,112,M,White,Not Span/Hispanic,4,Emergency,Home or Self Care,2020,NVS020,OTHER SPECIFIED NERVOUS SYSTEM DISORDERS,OTR004,ISOLATION PROCEDURES,052,ALTERATION IN CONSCIOUSNESS,01,DISEASES AND DISORDERS OF THE NERVOUS SYSTEM,3,Major,Moderate,Medical,Medicare,Medicaid,,,,Y,93138.73,23019.41
New York City,Kings,7002053,001304,NYU Langone Hospital-Brooklyn,0 to 17,112,M,Other Race,Unknown,1,Elective,Home or Self Care,2020,NVS020,OTHER SPECIFIED NERVOUS SYSTEM DISORDERS,CNS002,LUMBAR PUNCTURE,052,ALTERATION IN CONSCIOUSNESS,01,DISEASES AND DISORDERS OF THE NERVOUS SYSTEM,3,Major,Minor,Medical,Private Health Insurance,,,,,N,102046.46,9112.07
New York City,Kings,7002053,001304,NYU Langone Hospital-Brooklyn,0 to 17,112,M,Other Race,Spanish/Hispanic,2,Elective,Home or Self Care,2020,SYM010,NERVOUS SYSTEM SIGNS AND SYMPTOMS,MAM011,ELECTROENCEPHALOGRAM (EEG),052,ALTERATION IN CONSCIOUSNESS,01,DISEASES AND DISORDERS OF THE NERVOUS SYSTEM,1,Minor,Minor,Medical,Medicaid,,,,,N,70244.11,13972.92
New York City,Kings,7002053,001304,NYU Langone Hospital-Brooklyn,50 to 69,112,F,White,Not Span/Hispanic,14,Emergency,Skilled Nursing Home,2020,NVS020,OTHER SPECIFIED NERVOUS SYSTEM DISORDERS,MAM011,ELECTROENCEPHALOGRAM (EEG),052,ALTERATION IN CONSCIOUSNESS,01,DISEASES AND DISORDERS OF THE NERVOUS SYSTEM,3,Major,Minor,Medical,Medicaid,,,,,Y,198748.97,65533.19
New York City,Kings,7002053,001304,NYU Langone Hospital-Brooklyn,30 to 49,116,M,White,Not Span/Hispanic,4,Emergency,Home or Self Care,2020,NVS020,OTHER SPECIFIED NERVOUS SYSTEM DISORDERS,CNS002,LUMBAR PUNCTURE,052,ALTERATION IN CONSCIOUSNESS,01,DISEASES AND DISORDERS OF THE NERVOUS SYSTEM,3,Major,Major,Medical,Blue Cross/Blue Shield,,,,,Y,185817,37292.94
New York City,Kings,7002053,001304,NYU Langone Hospital-Brooklyn,70 or Older,112,M,White,Not Span/Hispanic,9,Emergency,Skilled Nursing Home,2020,NVS020,OTHER SPECIFIED NERVOUS SYSTEM DISORDERS,URN006,BLADDER CATHETERIZATION AND DRAINAGE,052,ALTERATION IN CONSCIOUSNESS,01,DISEASES AND DISORDERS OF THE NERVOUS SYSTEM,3,Major,Major,Medical,Medicare,Blue Cross/Blue Shield,,,,Y,171094.54,47536.48
New York City,Kings,7002053,001304,NYU Langone Hospital-Brooklyn,50 to 69,112,F,Other Race,Not Span/Hispanic,3,Emergency,Home or Self Care,2020,NVS012,TRANSIENT CEREBRAL ISCHEMIA,IMG007,COMPUTERIZED TOMOGRAPHY (CT) WITHOUT CONTRAST,052,ALTERATION IN CONSCIOUSNESS,01,DISEASES AND DISORDERS OF THE NERVOUS SYSTEM,1,Minor,Minor,Medical,Medicaid,,,,,Y,61084.19,16975.19
New York City,Kings,7002053,001304,NYU Langone Hospital-Brooklyn,70 or Older,112,M,White,Not Span/Hispanic,6,Emergency,Skilled Nursing Home,2020,NVS020,OTHER SPECIFIED NERVOUS SYSTEM DISORDERS,CNS002,LUMBAR PUNCTURE,052,ALTERATION IN CONSCIOUSNESS,01,DISEASES AND DISORDERS OF THE NERVOUS SYSTEM,3,Major,Moderate,Medical,Medicare,Blue Cross/Blue Shield,,,,Y,161741.87,33866.17
New York City,Kings,7002053,001304,NYU Langone Hospital-Brooklyn,0 to 17,112,M,Other Race,Not Span/Hispanic,2,Elective,Home or Self Care,2020,SYM010,NERVOUS SYSTEM SIGNS AND SYMPTOMS,MAM011,ELECTROENCEPHALOGRAM (EEG),052,ALTERATION IN CONSCIOUSNESS,01,DISEASES AND DISORDERS OF THE NERVOUS SYSTEM,2,Moderate,Minor,Medical,Medicaid,,,,,N,62737.71,7217.82
New York City,Kings,7002053,001304,NYU Langone Hospital-Brooklyn,50 to 69,112,M,White,Not Span/Hispanic,1,Emergency,Home or Self Care,2020,NVS020,OTHER SPECIFIED NERVOUS SYSTEM DISORDERS,ADM021,"ADMINISTRATION OF THERAPEUTIC SUBSTANCES, NEC",052,ALTERATION IN CONSCIOUSNESS,01,DISEASES AND DISORDERS OF THE NERVOUS SYSTEM,3,Major,Moderate,Medical,Blue Cross/Blue Shield,,,,,Y,41143.81,8363.85
New York City,Kings,7002053,001304,NYU Langone Hospital-Brooklyn,70 or Older,112,F,White,Not Span/Hispanic,12,Emergency,Hospice - Home,2020,NVS020,OTHER SPECIFIED NERVOUS SYSTEM DISORDERS,GIS006,PARACENTESIS,052,ALTERATION IN CONSCIOUSNESS,01,DISEASES AND DISORDERS OF THE NERVOUS SYSTEM,4,Extreme,Extreme,Medical,Medicare,Blue Cross/Blue Shield,,,,Y,259211.35,67960.44
New York City,Kings,7002053,001304,NYU Langone Hospital-Brooklyn,70 or Older,112,F,White,Not Span/Hispanic,5,Emergency,Skilled Nursing Home,2020,NVS020,OTHER SPECIFIED NERVOUS SYSTEM DISORDERS,OTR004,ISOLATION PROCEDURES,052,ALTERATION IN CONSCIOUSNESS,01,DISEASES AND DISORDERS OF THE NERVOUS SYSTEM,2,Moderate,Moderate,Medical,Medicare,Medicaid,,,,Y,86261.11,29131.19
New York City,Kings,7002053,001304,NYU Langone Hospital-Brooklyn,70 or Older,112,M,White,Not Span/Hispanic,13,Elective,Skilled Nursing Home,2020,NVS020,OTHER SPECIFIED NERVOUS SYSTEM DISORDERS,RHB002,"PHYSICAL, OCCUPATIONAL, AND RESPIRATORY THERAPY TREATMENT",052,ALTERATION IN CONSCIOUSNESS,01,DISEASES AND DISORDERS OF THE NERVOUS SYSTEM,3,Major,Minor,Medical,Medicare,Medicare,,,,N,139768.47,43053.39
New York City,Kings,7002053,001304,NYU Langone Hospital-Brooklyn,70 or Older,112,F,White,Not Span/Hispanic,3,Emergency,Home or Self Care,2020,NVS020,OTHER SPECIFIED NERVOUS SYSTEM DISORDERS,MAM011,ELECTROENCEPHALOGRAM (EEG),052,ALTERATION IN CONSCIOUSNESS,01,DISEASES AND DISORDERS OF THE NERVOUS SYSTEM,2,Moderate,Minor,Medical,Medicare,Medicare,,,,Y,115592.29,18787.68
New York City,Kings,7002053,001304,NYU Langone Hospital-Brooklyn,70 or Older,112,F,Other Race,Unknown,6,Emergency,Skilled Nursing Home,2020,NVS020,OTHER SPECIFIED NERVOUS SYSTEM DISORDERS,,,052,ALTERATION IN CONSCIOUSNESS,01,DISEASES AND DISORDERS OF THE NERVOUS SYSTEM,3,Major,Major,Medical,Medicare,Medicaid,,,,Y,121913.3,33567.61
