Hospital Service Area,Hospital County,Operating Certificate Number,Permanent Facility Id,Facility Name,Age Group,Zip Code - 3 digits,Gender,Race,Ethnicity,Length of Stay,Type of Admission,Patient Disposition,Discharge Year,CCS Diagnosis Code,CCS Diagnosis Description,CCS Procedure Code,CCS Procedure Description,APR DRG Code,APR DRG Description,APR MDC Code,APR MDC Description,APR Severity of Illness Code,APR Severity of Illness Description,APR Risk of Mortality,APR Medical Surgical Description,Payment Typology 1,Payment Typology 2,Payment Typology 3,Birth Weight,Abortion Edit Indicator,Emergency Department Indicator,Total Charges,Total Costs
Long Island,Suffolk,5123000,000885,Long Island Community Hospital,50 to 69,117,F,White,Not Span/Hispanic,3,Emergency,Home or Self Care,2020,NVS009,EPILEPSY; CONVULSIONS,,,053,SEIZURE,01,DISEASES AND DISORDERS OF THE NERVOUS SYSTEM,1,Minor,Minor,Medical,Private Health Insurance,Medicaid,,,,Y,28530.06,4946.79
Long Island,Suffolk,5123000,000885,Long Island Community Hospital,70 or Older,117,M,White,Not Span/Hispanic,5,Emergency,Skilled Nursing Home,2020,NVS009,EPILEPSY; CONVULSIONS,,,053,SEIZURE,01,DISEASES AND DISORDERS OF THE NERVOUS SYSTEM,2,Moderate,Major,Medical,Medicare,Medicare,Private Health Insurance,,,Y,46707.36,8307.07
Long Island,Suffolk,5123000,000885,Long Island Community Hospital,70 or Older,117,F,White,Not Span/Hispanic,17,Emergency,Skilled Nursing Home,2020,NVS009,EPILEPSY; CONVULSIONS,RES007,AIRWAY INTUBATION,053,SEIZURE,01,DISEASES AND DISORDERS OF THE NERVOUS SYSTEM,4,Extreme,Extreme,Medical,Medicare,,,,,Y,188207.37,32011.12
Long Island,Suffolk,5123000,000885,Long Island Community Hospital,70 or Older,117,F,White,Not Span/Hispanic,4,Emergency,Skilled Nursing Home,2020,NVS009,EPILEPSY; CONVULSIONS,,,053,SEIZURE,01,DISEASES AND DISORDERS OF THE NERVOUS SYSTEM,3,Major,Major,Medical,Medicare,Medicare,Private Health Insurance,,,Y,29882.1,6048.46
Long Island,Suffolk,5123000,000885,Long Island Community Hospital,50 to 69,117,M,White,Not Span/Hispanic,2,Emergency,Home or Self Care,2020,NVS009,EPILEPSY; CONVULSIONS,SUD001,SUBSTANCE USE DETOXIFICATION,053,SEIZURE,01,DISEASES AND DISORDERS OF THE NERVOUS SYSTEM,1,Minor,Minor,Medical,Private Health Insurance,,,,,Y,24811.74,4180.21
Long Island,Suffolk,5123000,000885,Long Island Community Hospital,50 to 69,117,F,White,Not Span/Hispanic,3,Emergency,Home or Self Care,2020,NVS009,EPILEPSY; CONVULSIONS,,,053,SEIZURE,01,DISEASES AND DISORDERS OF THE NERVOUS SYSTEM,2,Moderate,Moderate,Medical,Medicare,Medicare,Medicaid,,,Y,25329.42,4468.89
Long Island,Suffolk,5123000,000885,Long Island Community Hospital,50 to 69,119,M,Other Race,Not Span/Hispanic,4,Emergency,Home or Self Care,2020,NVS009,EPILEPSY; CONVULSIONS,,,053,SEIZURE,01,DISEASES AND DISORDERS OF THE NERVOUS SYSTEM,2,Moderate,Minor,Medical,Private Health Insurance,Medicaid,,,,Y,41263.42,7744.13
Long Island,Suffolk,5123000,000885,Long Island Community Hospital,18 to 29,117,F,White,Not Span/Hispanic,4,Emergency,Home or Self Care,2020,NVS009,EPILEPSY; CONVULSIONS,ESA003,MECHANICAL VENTILATION,053,SEIZURE,01,DISEASES AND DISORDERS OF THE NERVOUS SYSTEM,4,Extreme,Extreme,Medical,Private Health Insurance,Medicaid,,,,Y,61387.75,9831.37
Long Island,Suffolk,5123000,000885,Long Island Community Hospital,50 to 69,119,F,Black/African American,Not Span/Hispanic,3,Emergency,Home or Self Care,2020,NVS009,EPILEPSY; CONVULSIONS,,,053,SEIZURE,01,DISEASES AND DISORDERS OF THE NERVOUS SYSTEM,2,Moderate,Minor,Medical,Private Health Insurance,Medicaid,,,,Y,20428.98,4173.39
Long Island,Suffolk,5123000,000885,Long Island Community Hospital,18 to 29,119,M,Black/African American,Not Span/Hispanic,14,Emergency,Short-term Hospital,2020,NVS009,EPILEPSY; CONVULSIONS,ESA003,MECHANICAL VENTILATION,053,SEIZURE,01,DISEASES AND DISORDERS OF THE NERVOUS SYSTEM,3,Major,Extreme,Medical,Medicare,Medicare,Medicaid,,,Y,184421.96,31377.85
Long Island,Suffolk,5123000,000885,Long Island Community Hospital,50 to 69,117,F,Black/African American,Not Span/Hispanic,32,Emergency,Home w/ Home Health Services,2020,NVS009,EPILEPSY; CONVULSIONS,ADM001,TRANSFUSION OF BLOOD AND BLOOD PRODUCTS,053,SEIZURE,01,DISEASES AND DISORDERS OF THE NERVOUS SYSTEM,4,Extreme,Extreme,Medical,Medicare,Medicare,Blue Cross/Blue Shield,,,Y,219145.89,49937.18
Long Island,Suffolk,5123000,000885,Long Island Community Hospital,30 to 49,117,M,White,Not Span/Hispanic,2,Emergency,Home or Self Care,2020,NVS009,EPILEPSY; CONVULSIONS,,,053,SEIZURE,01,DISEASES AND DISORDERS OF THE NERVOUS SYSTEM,1,Minor,Minor,Medical,Medicare,Medicare,Medicaid,,,Y,33173.9,5570.19
Long Island,Suffolk,5123000,000885,Long Island Community Hospital,70 or Older,117,F,Other Race,Not Span/Hispanic,6,Emergency,Skilled Nursing Home,2020,NVS009,EPILEPSY; CONVULSIONS,,,053,SEIZURE,01,DISEASES AND DISORDERS OF THE NERVOUS SYSTEM,3,Major,Major,Medical,Medicare,Medicare,Medicaid,,,Y,68985.73,11931.59
Long Island,Suffolk,5123000,000885,Long Island Community Hospital,30 to 49,117,F,Other Race,Not Span/Hispanic,2,Emergency,Home or Self Care,2020,NVS009,EPILEPSY; CONVULSIONS,RES007,AIRWAY INTUBATION,053,SEIZURE,01,DISEASES AND DISORDERS OF THE NERVOUS SYSTEM,4,Extreme,Extreme,Medical,Medicare,Medicaid,,,,Y,34228.49,7837.15
Long Island,Suffolk,5123000,000885,Long Island Community Hospital,18 to 29,117,M,White,Not Span/Hispanic,1,Emergency,Left Against Medical Advice,2020,NVS009,EPILEPSY; CONVULSIONS,,,053,SEIZURE,01,DISEASES AND DISORDERS OF THE NERVOUS SYSTEM,1,Minor,Minor,Medical,Private Health Insurance,Medicaid,,,,Y,18906.75,2082.33
Long Island,Suffolk,5123000,000885,Long Island Community Hospital,30 to 49,119,F,Other Race,Not Span/Hispanic,3,Emergency,Short-term Hospital,2020,NVS009,EPILEPSY; CONVULSIONS,,,053,SEIZURE,01,DISEASES AND DISORDERS OF THE NERVOUS SYSTEM,2,Moderate,Minor,Medical,Blue Cross/Blue Shield,,,,,Y,52788.8,7165.95
Long Island,Suffolk,5123000,000885,Long Island Community Hospital,70 or Older,OOS,M,White,Not Span/Hispanic,2,Emergency,Home or Self Care,2020,NVS009,EPILEPSY; CONVULSIONS,,,053,SEIZURE,01,DISEASES AND DISORDERS OF THE NERVOUS SYSTEM,2,Moderate,Minor,Medical,Medicare,Medicare,Private Health Insurance,,,Y,30929.16,5395.12
Long Island,Suffolk,5123000,000885,Long Island Community Hospital,50 to 69,119,M,White,Not Span/Hispanic,1,Emergency,Home or Self Care,2020,NVS009,EPILEPSY; CONVULSIONS,,,053,SEIZURE,01,DISEASES AND DISORDERS OF THE NERVOUS SYSTEM,1,Minor,Minor,Medical,Medicaid,,,,,Y,14682.16,1994.05
Long Island,Suffolk,5123000,000885,Long Island Community Hospital,50 to 69,117,M,White,Not Span/Hispanic,6,Emergency,Home or Self Care,2020,NVS009,EPILEPSY; CONVULSIONS,MAM011,ELECTROENCEPHALOGRAM (EEG),053,SEIZURE,01,DISEASES AND DISORDERS OF THE NERVOUS SYSTEM,1,Minor,Minor,Medical,Medicare,Medicare,Medicaid,,,Y,61643.65,11208.21
Long Island,Suffolk,5123000,000885,Long Island Community Hospital,70 or Older,119,M,White,Not Span/Hispanic,2,Emergency,Home or Self Care,2020,NVS009,EPILEPSY; CONVULSIONS,MST028,"SUBCUTANEOUS TISSUE AND FASCIA PROCEDURES, NEC",053,SEIZURE,01,DISEASES AND DISORDERS OF THE NERVOUS SYSTEM,3,Major,Extreme,Medical,Medicare,,,,,Y,132814.14,17827.01
Long Island,Suffolk,5123000,000885,Long Island Community Hospital,18 to 29,,M,Other Race,Not Span/Hispanic,4,Emergency,Home or Self Care,2020,NVS009,EPILEPSY; CONVULSIONS,ESA003,MECHANICAL VENTILATION,053,SEIZURE,01,DISEASES AND DISORDERS OF THE NERVOUS SYSTEM,4,Extreme,Extreme,Medical,Self-Pay,,,,,Y,73801.4,12369.92
Long Island,Suffolk,5123000,000885,Long Island Community Hospital,50 to 69,117,F,White,Not Span/Hispanic,6,Emergency,Home or Self Care,2020,NVS009,EPILEPSY; CONVULSIONS,SUD002,PHARMACOTHERAPY FOR SUBSTANCE USE,053,SEIZURE,01,DISEASES AND DISORDERS OF THE NERVOUS SYSTEM,2,Moderate,Moderate,Medical,Medicare,Medicare,Medicaid,,,Y,49682.35,9978.77
Long Island,Suffolk,5123000,000885,Long Island Community Hospital,70 or Older,117,F,White,Not Span/Hispanic,6,Emergency,Home or Self Care,2020,NVS009,EPILEPSY; CONVULSIONS,,,053,SEIZURE,01,DISEASES AND DISORDERS OF THE NERVOUS SYSTEM,3,Major,Major,Medical,Medicare,,,,,Y,66216.27,10624.63
Long Island,Suffolk,5123000,000885,Long Island Community Hospital,70 or Older,119,M,Black/African American,Not Span/Hispanic,6,Emergency,Skilled Nursing Home,2020,NVS009,EPILEPSY; CONVULSIONS,,,053,SEIZURE,01,DISEASES AND DISORDERS OF THE NERVOUS SYSTEM,3,Major,Moderate,Medical,Medicare,Private Health Insurance,,,,Y,68032.88,10950.64
Long Island,Suffolk,5123000,000885,Long Island Community Hospital,30 to 49,117,M,Other Race,Not Span/Hispanic,1,Elective,Home or Self Care,2020,NVS009,EPILEPSY; CONVULSIONS,,,053,SEIZURE,01,DISEASES AND DISORDERS OF THE NERVOUS SYSTEM,2,Moderate,Moderate,Medical,Private Health Insurance,,,,,N,17025.25,2544.44
Long Island,Suffolk,5123000,000885,Long Island Community Hospital,70 or Older,115,M,White,Not Span/Hispanic,2,Emergency,Home or Self Care,2020,NVS009,EPILEPSY; CONVULSIONS,,,053,SEIZURE,01,DISEASES AND DISORDERS OF THE NERVOUS SYSTEM,2,Moderate,Moderate,Medical,Medicare,Medicare,Private Health Insurance,,,Y,31057.34,3583.07
Long Island,Suffolk,5123000,000885,Long Island Community Hospital,50 to 69,117,F,White,Not Span/Hispanic,6,Emergency,Home w/ Home Health Services,2020,NVS009,EPILEPSY; CONVULSIONS,,,053,SEIZURE,01,DISEASES AND DISORDERS OF THE NERVOUS SYSTEM,2,Moderate,Minor,Medical,Medicare,Medicare,Medicaid,,,Y,43469.44,8756.87
Long Island,Suffolk,5123000,000885,Long Island Community Hospital,50 to 69,117,M,White,Not Span/Hispanic,27,Emergency,Skilled Nursing Home,2020,NVS009,EPILEPSY; CONVULSIONS,CAR024,VENOUS AND ARTERIAL CATHETER PLACEMENT,053,SEIZURE,01,DISEASES AND DISORDERS OF THE NERVOUS SYSTEM,3,Major,Major,Medical,Medicare,Medicare,Medicaid,,,Y,185683.27,43337.44
Long Island,Suffolk,5123000,000885,Long Island Community Hospital,30 to 49,117,M,White,Not Span/Hispanic,4,Emergency,Home or Self Care,2020,NVS009,EPILEPSY; CONVULSIONS,OTR004,ISOLATION PROCEDURES,053,SEIZURE,01,DISEASES AND DISORDERS OF THE NERVOUS SYSTEM,2,Moderate,Minor,Medical,Medicare,Medicare,Medicaid,,,Y,48604.93,6149.33
Long Island,Suffolk,5123000,000885,Long Island Community Hospital,50 to 69,119,F,White,Not Span/Hispanic,5,Emergency,Skilled Nursing Home,2020,NVS009,EPILEPSY; CONVULSIONS,,,053,SEIZURE,01,DISEASES AND DISORDERS OF THE NERVOUS SYSTEM,1,Minor,Minor,Medical,Private Health Insurance,Medicaid,,,,Y,60239.43,7232.42
Long Island,Suffolk,5123000,000885,Long Island Community Hospital,50 to 69,119,F,White,Not Span/Hispanic,4,Emergency,Left Against Medical Advice,2020,NVS009,EPILEPSY; CONVULSIONS,SKB006,SKIN LACERATION REPAIR (EXCLUDING PERINEUM),053,SEIZURE,01,DISEASES AND DISORDERS OF THE NERVOUS SYSTEM,2,Moderate,Minor,Medical,Medicare,Medicare,,,,Y,43987.7,7658.12
Long Island,Suffolk,5123000,000885,Long Island Community Hospital,30 to 49,119,F,White,Not Span/Hispanic,1,Emergency,Left Against Medical Advice,2020,NVS009,EPILEPSY; CONVULSIONS,,,053,SEIZURE,01,DISEASES AND DISORDERS OF THE NERVOUS SYSTEM,4,Extreme,Major,Medical,Private Health Insurance,Medicaid,,,,Y,14581.57,1994.65
Long Island,Suffolk,5123000,000885,Long Island Community Hospital,50 to 69,119,M,White,Not Span/Hispanic,1,Emergency,Skilled Nursing Home,2020,NVS009,EPILEPSY; CONVULSIONS,OTR004,ISOLATION PROCEDURES,053,SEIZURE,01,DISEASES AND DISORDERS OF THE NERVOUS SYSTEM,3,Major,Moderate,Medical,Medicare,Medicare,Medicaid,,,Y,15608.27,2162.38
Long Island,Suffolk,5123000,000885,Long Island Community Hospital,30 to 49,119,F,White,Not Span/Hispanic,1,Emergency,Left Against Medical Advice,2020,NVS009,EPILEPSY; CONVULSIONS,,,053,SEIZURE,01,DISEASES AND DISORDERS OF THE NERVOUS SYSTEM,3,Major,Moderate,Medical,Private Health Insurance,Medicaid,,,,Y,13276.27,2000.82
Long Island,Suffolk,5123000,000885,Long Island Community Hospital,50 to 69,119,M,Other Race,Not Span/Hispanic,6,Emergency,Home w/ Home Health Services,2020,NVS009,EPILEPSY; CONVULSIONS,,,053,SEIZURE,01,DISEASES AND DISORDERS OF THE NERVOUS SYSTEM,1,Minor,Minor,Medical,Medicare,Medicaid,,,,Y,73375.09,13361.51
Long Island,Suffolk,5123000,000885,Long Island Community Hospital,18 to 29,117,M,White,Not Span/Hispanic,6,Emergency,Home or Self Care,2020,NVS009,EPILEPSY; CONVULSIONS,SUD001,SUBSTANCE USE DETOXIFICATION,053,SEIZURE,01,DISEASES AND DISORDERS OF THE NERVOUS SYSTEM,3,Major,Moderate,Medical,Private Health Insurance,Medicaid,,,,Y,47914.21,11227.1
Long Island,Suffolk,5123000,000885,Long Island Community Hospital,50 to 69,117,M,White,Not Span/Hispanic,2,Emergency,Home or Self Care,2020,NVS009,EPILEPSY; CONVULSIONS,SUD002,PHARMACOTHERAPY FOR SUBSTANCE USE,053,SEIZURE,01,DISEASES AND DISORDERS OF THE NERVOUS SYSTEM,2,Moderate,Minor,Medical,Private Health Insurance,Medicaid,,,,Y,20845.23,3529.9
Long Island,Suffolk,5123000,000885,Long Island Community Hospital,18 to 29,119,F,Black/African American,Not Span/Hispanic,1,Emergency,Short-term Hospital,2020,NVS009,EPILEPSY; CONVULSIONS,,,053,SEIZURE,01,DISEASES AND DISORDERS OF THE NERVOUS SYSTEM,2,Moderate,Moderate,Medical,Private Health Insurance,Medicaid,,,,Y,19910.44,2947.91
Long Island,Suffolk,5123000,000885,Long Island Community Hospital,30 to 49,119,F,White,Not Span/Hispanic,3,Emergency,Home or Self Care,2020,NVS009,EPILEPSY; CONVULSIONS,,,053,SEIZURE,01,DISEASES AND DISORDERS OF THE NERVOUS SYSTEM,1,Minor,Minor,Medical,Private Health Insurance,Medicaid,,,,Y,25939.51,4553.06
Long Island,Suffolk,5123000,000885,Long Island Community Hospital,30 to 49,117,F,White,Not Span/Hispanic,4,Emergency,Home or Self Care,2020,NVS009,EPILEPSY; CONVULSIONS,OTR004,ISOLATION PROCEDURES,053,SEIZURE,01,DISEASES AND DISORDERS OF THE NERVOUS SYSTEM,2,Moderate,Moderate,Medical,Private Health Insurance,Medicaid,,,,Y,42440.52,7372.26
Long Island,Suffolk,5123000,000885,Long Island Community Hospital,30 to 49,119,F,Black/African American,Not Span/Hispanic,1,Emergency,Home or Self Care,2020,NVS009,EPILEPSY; CONVULSIONS,SUD002,PHARMACOTHERAPY FOR SUBSTANCE USE,053,SEIZURE,01,DISEASES AND DISORDERS OF THE NERVOUS SYSTEM,1,Minor,Minor,Medical,Private Health Insurance,Medicaid,,,,Y,13962.9,1885.06
Long Island,Suffolk,5123000,000885,Long Island Community Hospital,30 to 49,119,M,White,Not Span/Hispanic,4,Emergency,Home w/ Home Health Services,2020,NVS009,EPILEPSY; CONVULSIONS,ADM017,ADMINISTRATION OF NUTRITIONAL AND ELECTROLYTIC SUBSTANCES,053,SEIZURE,01,DISEASES AND DISORDERS OF THE NERVOUS SYSTEM,3,Major,Moderate,Medical,Medicare,Medicare,Medicaid,,,Y,47422.06,7665.86
Long Island,Suffolk,5123000,000885,Long Island Community Hospital,30 to 49,119,M,White,Not Span/Hispanic,3,Emergency,Left Against Medical Advice,2020,NVS009,EPILEPSY; CONVULSIONS,SUD002,PHARMACOTHERAPY FOR SUBSTANCE USE,053,SEIZURE,01,DISEASES AND DISORDERS OF THE NERVOUS SYSTEM,2,Moderate,Moderate,Medical,Medicare,Medicare,,,,Y,28912.68,5553.49
Long Island,Suffolk,5123000,000885,Long Island Community Hospital,50 to 69,117,F,White,Not Span/Hispanic,3,Emergency,Home or Self Care,2020,NVS009,EPILEPSY; CONVULSIONS,,,053,SEIZURE,01,DISEASES AND DISORDERS OF THE NERVOUS SYSTEM,3,Major,Moderate,Medical,Medicare,Medicare,Blue Cross/Blue Shield,,,Y,37242.83,6116.04
Long Island,Suffolk,5123000,000885,Long Island Community Hospital,50 to 69,117,M,Other Race,Not Span/Hispanic,10,Emergency,Home w/ Home Health Services,2020,NVS009,EPILEPSY; CONVULSIONS,,,053,SEIZURE,01,DISEASES AND DISORDERS OF THE NERVOUS SYSTEM,4,Extreme,Major,Medical,Medicare,Medicare,Medicaid,,,Y,106088.53,22677.94
Long Island,Suffolk,5123000,000885,Long Island Community Hospital,30 to 49,117,F,Other Race,Not Span/Hispanic,2,Emergency,Short-term Hospital,2020,NVS009,EPILEPSY; CONVULSIONS,,,053,SEIZURE,01,DISEASES AND DISORDERS OF THE NERVOUS SYSTEM,2,Moderate,Minor,Medical,Private Health Insurance,Medicaid,,,,Y,27695.73,5556.27
Long Island,Suffolk,5123000,000885,Long Island Community Hospital,50 to 69,117,M,White,Not Span/Hispanic,11,Emergency,Short-term Hospital,2020,NVS009,EPILEPSY; CONVULSIONS,GIS007,GI SYSTEM DRAINAGE (EXCLUDING PARACENTESIS),053,SEIZURE,01,DISEASES AND DISORDERS OF THE NERVOUS SYSTEM,4,Extreme,Extreme,Medical,Medicare,Medicare,Blue Cross/Blue Shield,,,Y,174851.04,28493.32
Long Island,Suffolk,5123000,000885,Long Island Community Hospital,70 or Older,117,M,White,Not Span/Hispanic,2,Emergency,Home or Self Care,2020,NVS009,EPILEPSY; CONVULSIONS,,,053,SEIZURE,01,DISEASES AND DISORDERS OF THE NERVOUS SYSTEM,1,Minor,Minor,Medical,Medicare,Medicare,Private Health Insurance,,,Y,22352.03,3805.32
Long Island,Suffolk,5123000,000885,Long Island Community Hospital,50 to 69,117,F,Black/African American,Not Span/Hispanic,3,Emergency,Home w/ Home Health Services,2020,NVS009,EPILEPSY; CONVULSIONS,ESA003,MECHANICAL VENTILATION,053,SEIZURE,01,DISEASES AND DISORDERS OF THE NERVOUS SYSTEM,3,Major,Extreme,Medical,Medicare,Medicare,Medicaid,,,Y,31326.58,8170.73
Long Island,Suffolk,5123000,000885,Long Island Community Hospital,70 or Older,117,F,White,Not Span/Hispanic,4,Emergency,Home w/ Home Health Services,2020,NVS009,EPILEPSY; CONVULSIONS,,,053,SEIZURE,01,DISEASES AND DISORDERS OF THE NERVOUS SYSTEM,2,Moderate,Moderate,Medical,Medicare,Medicare,Medicaid,,,Y,40867.91,7011.18
Long Island,Suffolk,5123000,000885,Long Island Community Hospital,70 or Older,117,F,White,Not Span/Hispanic,7,Emergency,Skilled Nursing Home,2020,NVS009,EPILEPSY; CONVULSIONS,,,053,SEIZURE,01,DISEASES AND DISORDERS OF THE NERVOUS SYSTEM,3,Major,Major,Medical,Medicare,Medicare,Blue Cross/Blue Shield,,,Y,58820.45,12570.79
Long Island,Suffolk,5123000,000885,Long Island Community Hospital,30 to 49,119,M,White,Not Span/Hispanic,2,Emergency,Home or Self Care,2020,NVS009,EPILEPSY; CONVULSIONS,OTR004,ISOLATION PROCEDURES,053,SEIZURE,01,DISEASES AND DISORDERS OF THE NERVOUS SYSTEM,2,Moderate,Major,Medical,Private Health Insurance,Medicaid,,,,Y,69690.8,6994.09
Long Island,Suffolk,5123000,000885,Long Island Community Hospital,18 to 29,117,F,White,Not Span/Hispanic,10,Emergency,Home or Self Care,2020,NVS009,EPILEPSY; CONVULSIONS,RES007,AIRWAY INTUBATION,053,SEIZURE,01,DISEASES AND DISORDERS OF THE NERVOUS SYSTEM,3,Major,Extreme,Medical,Blue Cross/Blue Shield,Blue Cross/Blue Shield,,,,Y,150279.55,28073.36
Long Island,Suffolk,5123000,000885,Long Island Community Hospital,50 to 69,117,M,White,Not Span/Hispanic,7,Emergency,Home or Self Care,2020,NVS009,EPILEPSY; CONVULSIONS,MAM011,ELECTROENCEPHALOGRAM (EEG),053,SEIZURE,01,DISEASES AND DISORDERS OF THE NERVOUS SYSTEM,2,Moderate,Minor,Medical,Private Health Insurance,Medicaid,,,,Y,45575.6,10215.36
Long Island,Suffolk,5123000,000885,Long Island Community Hospital,30 to 49,119,M,White,Not Span/Hispanic,2,Emergency,Home or Self Care,2020,NVS009,EPILEPSY; CONVULSIONS,SUD001,SUBSTANCE USE DETOXIFICATION,053,SEIZURE,01,DISEASES AND DISORDERS OF THE NERVOUS SYSTEM,3,Major,Major,Medical,Medicare,Medicare,,,,Y,29568,4600.31
Long Island,Suffolk,5123000,000885,Long Island Community Hospital,70 or Older,117,M,White,Not Span/Hispanic,3,Emergency,Home or Self Care,2020,NVS009,EPILEPSY; CONVULSIONS,SUD001,SUBSTANCE USE DETOXIFICATION,053,SEIZURE,01,DISEASES AND DISORDERS OF THE NERVOUS SYSTEM,2,Moderate,Moderate,Medical,Medicare,Medicare,Medicaid,,,Y,27846.72,4606.13
Long Island,Suffolk,5123000,000885,Long Island Community Hospital,50 to 69,119,F,White,Not Span/Hispanic,6,Emergency,Skilled Nursing Home,2020,NVS009,EPILEPSY; CONVULSIONS,,,053,SEIZURE,01,DISEASES AND DISORDERS OF THE NERVOUS SYSTEM,1,Minor,Minor,Medical,Medicare,Medicare,Medicaid,,,Y,36829.69,8451.44
Long Island,Suffolk,5123000,000885,Long Island Community Hospital,50 to 69,117,F,White,Not Span/Hispanic,6,Emergency,Skilled Nursing Home,2020,NVS009,EPILEPSY; CONVULSIONS,MAM011,ELECTROENCEPHALOGRAM (EEG),053,SEIZURE,01,DISEASES AND DISORDERS OF THE NERVOUS SYSTEM,1,Minor,Minor,Medical,Private Health Insurance,Medicaid,,,,Y,42629.49,8601.86
Long Island,Suffolk,5123000,000885,Long Island Community Hospital,30 to 49,119,F,Black/African American,Not Span/Hispanic,1,Emergency,Left Against Medical Advice,2020,NVS009,EPILEPSY; CONVULSIONS,,,053,SEIZURE,01,DISEASES AND DISORDERS OF THE NERVOUS SYSTEM,2,Moderate,Major,Medical,Medicare,Medicare,Medicaid,,,Y,18844.94,2049.09
Long Island,Suffolk,5123000,000885,Long Island Community Hospital,18 to 29,119,M,Black/African American,Not Span/Hispanic,5,Emergency,Home or Self Care,2020,NVS009,EPILEPSY; CONVULSIONS,MAM011,ELECTROENCEPHALOGRAM (EEG),053,SEIZURE,01,DISEASES AND DISORDERS OF THE NERVOUS SYSTEM,2,Moderate,Minor,Medical,Medicaid,,,,,N,59449.39,12181.17
Long Island,Suffolk,5123000,000885,Long Island Community Hospital,50 to 69,117,F,White,Not Span/Hispanic,4,Emergency,Home w/ Home Health Services,2020,NVS009,EPILEPSY; CONVULSIONS,,,053,SEIZURE,01,DISEASES AND DISORDERS OF THE NERVOUS SYSTEM,2,Moderate,Minor,Medical,Medicare,Medicare,Private Health Insurance,,,Y,47186.75,6695.31
Long Island,Suffolk,5123000,000885,Long Island Community Hospital,50 to 69,117,M,White,Not Span/Hispanic,9,Emergency,Skilled Nursing Home,2020,NVS009,EPILEPSY; CONVULSIONS,RES007,AIRWAY INTUBATION,053,SEIZURE,01,DISEASES AND DISORDERS OF THE NERVOUS SYSTEM,4,Extreme,Extreme,Medical,Blue Cross/Blue Shield,Medicare,Medicare,,,Y,105413.03,20582.3
Long Island,Suffolk,5123000,000885,Long Island Community Hospital,30 to 49,117,F,Other Race,Not Span/Hispanic,6,Emergency,Home or Self Care,2020,NVS009,EPILEPSY; CONVULSIONS,SUD001,SUBSTANCE USE DETOXIFICATION,053,SEIZURE,01,DISEASES AND DISORDERS OF THE NERVOUS SYSTEM,3,Major,Major,Medical,Private Health Insurance,Medicaid,,,,Y,54002.99,10375.75
Long Island,Suffolk,5123000,000885,Long Island Community Hospital,70 or Older,117,M,White,Not Span/Hispanic,7,Emergency,Skilled Nursing Home,2020,NVS009,EPILEPSY; CONVULSIONS,SKB006,SKIN LACERATION REPAIR (EXCLUDING PERINEUM),053,SEIZURE,01,DISEASES AND DISORDERS OF THE NERVOUS SYSTEM,2,Moderate,Minor,Medical,Medicare,,,,,Y,95052.75,13379.97
Long Island,Suffolk,5123000,000885,Long Island Community Hospital,50 to 69,117,M,White,Not Span/Hispanic,4,Emergency,Home or Self Care,2020,NVS009,EPILEPSY; CONVULSIONS,SUD001,SUBSTANCE USE DETOXIFICATION,053,SEIZURE,01,DISEASES AND DISORDERS OF THE NERVOUS SYSTEM,3,Major,Major,Medical,Private Health Insurance,Medicaid,,,,Y,39873.58,7423.19
Long Island,Suffolk,5123000,000885,Long Island Community Hospital,18 to 29,117,F,White,Not Span/Hispanic,1,Emergency,Home or Self Care,2020,NVS009,EPILEPSY; CONVULSIONS,,,053,SEIZURE,01,DISEASES AND DISORDERS OF THE NERVOUS SYSTEM,3,Major,Minor,Medical,Blue Cross/Blue Shield,,,,,Y,15955.06,2236.44
Long Island,Suffolk,5123000,000885,Long Island Community Hospital,50 to 69,119,F,White,Not Span/Hispanic,3,Emergency,Home or Self Care,2020,NVS009,EPILEPSY; CONVULSIONS,,,053,SEIZURE,01,DISEASES AND DISORDERS OF THE NERVOUS SYSTEM,2,Moderate,Moderate,Medical,Medicare,Medicare,Medicaid,,,Y,44642.83,5676.17
Long Island,Suffolk,5123000,000885,Long Island Community Hospital,70 or Older,117,F,White,Not Span/Hispanic,3,Emergency,Home or Self Care,2020,NVS009,EPILEPSY; CONVULSIONS,,,053,SEIZURE,01,DISEASES AND DISORDERS OF THE NERVOUS SYSTEM,1,Minor,Minor,Medical,Medicare,Medicare,Private Health Insurance,,,Y,35780.69,6624.44
Long Island,Suffolk,5123000,000885,Long Island Community Hospital,18 to 29,117,F,White,Not Span/Hispanic,4,Emergency,Skilled Nursing Home,2020,NVS009,EPILEPSY; CONVULSIONS,,,053,SEIZURE,01,DISEASES AND DISORDERS OF THE NERVOUS SYSTEM,2,Moderate,Minor,Medical,Private Health Insurance,Medicaid,,,,Y,31395.47,6214.66
Long Island,Suffolk,5123000,000885,Long Island Community Hospital,70 or Older,117,M,White,Not Span/Hispanic,4,Emergency,Skilled Nursing Home,2020,NVS009,EPILEPSY; CONVULSIONS,,,053,SEIZURE,01,DISEASES AND DISORDERS OF THE NERVOUS SYSTEM,3,Major,Extreme,Medical,Medicare,Medicare,Blue Cross/Blue Shield,,,Y,70040.86,8898.44