Hospital Service Area,Hospital County,Operating Certificate Number,Permanent Facility Id,Facility Name,Age Group,Zip Code - 3 digits,Gender,Race,Ethnicity,Length of Stay,Type of Admission,Patient Disposition,Discharge Year,CCS Diagnosis Code,CCS Diagnosis Description,CCS Procedure Code,CCS Procedure Description,APR DRG Code,APR DRG Description,APR MDC Code,APR MDC Description,APR Severity of Illness Code,APR Severity of Illness Description,APR Risk of Mortality,APR Medical Surgical Description,Payment Typology 1,Payment Typology 2,Payment Typology 3,Birth Weight,Abortion Edit Indicator,Emergency Department Indicator,Total Charges,Total Costs
Long Island,Nassau,2908000,000511,NYU Winthrop Hospital,50 to 69,115,F,Black/African American,Not Span/Hispanic,1,Emergency,Home or Self Care,2017,042,Secondary malignancies,130,OT DX PRCS; FEMALE ORGN,530,Female reproductive system malignancy,13,Diseases and Disorders of the Female Reproductive System,2,Moderate,Moderate,Medical,Medicaid,Medicaid,,,N,Y,35478.24,5574.63
Long Island,Nassau,2908000,000511,NYU Winthrop Hospital,50 to 69,117,F,White,Not Span/Hispanic,1,Elective,Home or Self Care,2017,025,Cancer of uterus,224,CANCER CHEMOTHERAPY,530,Female reproductive system malignancy,13,Diseases and Disorders of the Female Reproductive System,2,Moderate,Moderate,Medical,Medicare,Medicare,Private Health Insurance,,N,N,12879.59,2456.23
Long Island,Nassau,2908000,000511,NYU Winthrop Hospital,50 to 69,117,F,Other Race,Not Span/Hispanic,1,Urgent,Home or Self Care,2017,027,Cancer of ovary,224,CANCER CHEMOTHERAPY,530,Female reproductive system malignancy,13,Diseases and Disorders of the Female Reproductive System,2,Moderate,Moderate,Medical,Medicaid,Medicaid,,,N,N,60670.16,13438.53
Long Island,Nassau,2908000,000511,NYU Winthrop Hospital,30 to 49,113,F,White,Not Span/Hispanic,2,Emergency,Home or Self Care,2017,027,Cancer of ovary,054,OT VASC CATH; NOT HEART,530,Female reproductive system malignancy,13,Diseases and Disorders of the Female Reproductive System,3,Major,Moderate,Medical,Blue Cross/Blue Shield,,,,N,Y,35675.39,9457.18
Long Island,Nassau,2908000,000511,NYU Winthrop Hospital,70 or Older,110,F,White,Not Span/Hispanic,7,Emergency,Hospice - Home,2017,026,Cancer of cervix,000,NO PROC,530,Female reproductive system malignancy,13,Diseases and Disorders of the Female Reproductive System,3,Major,Moderate,Medical,Medicare,Medicare,Self-Pay,,N,Y,38697.71,9950.49
Long Island,Nassau,2908000,000511,NYU Winthrop Hospital,70 or Older,110,F,White,Not Span/Hispanic,5,Emergency,Skilled Nursing Home,2017,025,Cancer of uterus,210,OTHER RADIOISOTOPE SCAN,530,Female reproductive system malignancy,13,Diseases and Disorders of the Female Reproductive System,2,Moderate,Moderate,Medical,Medicare,Medicare,Medicaid,,N,Y,93642.32,22186.85
Long Island,Nassau,2908000,000511,NYU Winthrop Hospital,50 to 69,117,F,White,Not Span/Hispanic,1,Elective,Home or Self Care,2017,027,Cancer of ovary,000,NO PROC,530,Female reproductive system malignancy,13,Diseases and Disorders of the Female Reproductive System,2,Moderate,Moderate,Medical,Blue Cross/Blue Shield,Medicare,,,N,N,41701.42,9324.83
Long Island,Nassau,2908000,000511,NYU Winthrop Hospital,70 or Older,115,F,White,Not Span/Hispanic,1,Emergency,Left Against Medical Advice,2017,027,Cancer of ovary,000,NO PROC,530,Female reproductive system malignancy,13,Diseases and Disorders of the Female Reproductive System,3,Major,Major,Medical,Medicare,Medicare,,,N,Y,13328.00,2958.89
Long Island,Nassau,2908000,000511,NYU Winthrop Hospital,70 or Older,115,F,White,Not Span/Hispanic,3,Emergency,Hospice - Medical Facility,2017,027,Cancer of ovary,222,BLOOD TRANSFUSION,530,Female reproductive system malignancy,13,Diseases and Disorders of the Female Reproductive System,3,Major,Major,Medical,Medicare,Medicare,Private Health Insurance,,N,Y,43684.85,8394.25
Long Island,Nassau,2908000,000511,NYU Winthrop Hospital,70 or Older,110,F,White,Not Span/Hispanic,3,Emergency,Home or Self Care,2017,027,Cancer of ovary,088,ABDOMINAL PARACENTESIS,530,Female reproductive system malignancy,13,Diseases and Disorders of the Female Reproductive System,3,Major,Major,Medical,Medicare,Medicare,,,N,Y,73546.90,13421.90
Long Island,Nassau,2908000,000511,NYU Winthrop Hospital,70 or Older,117,F,White,Not Span/Hispanic,1,Urgent,Home or Self Care,2017,027,Cancer of ovary,039,INCISION OF PLEURA,530,Female reproductive system malignancy,13,Diseases and Disorders of the Female Reproductive System,2,Moderate,Moderate,Medical,Medicare,Medicare,Private Health Insurance,,N,Y,44876.28,10114.61
Long Island,Nassau,2908000,000511,NYU Winthrop Hospital,70 or Older,110,F,White,Not Span/Hispanic,2,Emergency,Home or Self Care,2017,027,Cancer of ovary,088,ABDOMINAL PARACENTESIS,530,Female reproductive system malignancy,13,Diseases and Disorders of the Female Reproductive System,3,Major,Major,Medical,Medicare,Medicare,Medicaid,,N,Y,45302.20,10116.27
Long Island,Nassau,2908000,000511,NYU Winthrop Hospital,50 to 69,112,F,Black/African American,Not Span/Hispanic,59,Emergency,Expired,2017,027,Cancer of ovary,039,INCISION OF PLEURA,530,Female reproductive system malignancy,13,Diseases and Disorders of the Female Reproductive System,4,Extreme,Extreme,Medical,Medicaid,,,,N,Y,930101.96,222284.70
Long Island,Nassau,2908000,000511,NYU Winthrop Hospital,50 to 69,115,F,Black/African American,Not Span/Hispanic,2,Elective,Home or Self Care,2017,026,Cancer of cervix,054,OT VASC CATH; NOT HEART,530,Female reproductive system malignancy,13,Diseases and Disorders of the Female Reproductive System,1,Minor,Minor,Medical,Medicare,Medicare,,,N,N,40289.76,10842.70
