Hospital Service Area,Hospital County,Operating Certificate Number,Permanent Facility Id,Facility Name,Age Group,Zip Code - 3 digits,Gender,Race,Ethnicity,Length of Stay,Type of Admission,Patient Disposition,Discharge Year,CCS Diagnosis Code,CCS Diagnosis Description,CCS Procedure Code,CCS Procedure Description,APR DRG Code,APR DRG Description,APR MDC Code,APR MDC Description,APR Severity of Illness Code,APR Severity of Illness Description,APR Risk of Mortality,APR Medical Surgical Description,Payment Typology 1,Payment Typology 2,Payment Typology 3,Birth Weight,Abortion Edit Indicator,Emergency Department Indicator,Total Charges,Total Costs
New York City,Manhattan,7002017,001450,Lenox Hill Hospital,30 to 49,112,F,Other Race,Not Span/Hispanic,2,Emergency,Home or Self Care,2019,NEO032,FEMALE REPRODUCTIVE SYSTEM CANCERS - CERVIX,URN003,URETER AND OTHER URINARY TRACT DILATION,530,FEMALE REPRODUCTIVE SYSTEM MALIGNANCY,13,DISEASES AND DISORDERS OF THE FEMALE REPRODUCTIVE SYSTEM,3,Major,Moderate,Medical,Private Health Insurance,,,,,true,63080.08,12763.26
Finger Lakes,Monroe,2701003,000411,Rochester General Hospital,50 to 69,145,F,White,Not Span/Hispanic,13,Urgent,Skilled Nursing Home,2019,NEO035,FEMALE REPRODUCTIVE SYSTEM CANCERS - ENDOMETRIUM,RES005,CHEST TUBE PLACEMENT AND THERAPEUTIC THORACENTESIS,530,FEMALE REPRODUCTIVE SYSTEM MALIGNANCY,13,DISEASES AND DISORDERS OF THE FEMALE REPRODUCTIVE SYSTEM,4,Extreme,Extreme,Medical,Medicare,,,,,false,52422.94,23305.26
New York City,Manhattan,7002053,001463,NYU Langone Hospitals,30 to 49,112,F,Other Race,Not Span/Hispanic,1,Elective,Home or Self Care,2019,NEO032,FEMALE REPRODUCTIVE SYSTEM CANCERS - CERVIX,FRS015,"FEMALE REPRODUCTIVE SYSTEM PROCEDURES, NEC",530,FEMALE REPRODUCTIVE SYSTEM MALIGNANCY,13,DISEASES AND DISORDERS OF THE FEMALE REPRODUCTIVE SYSTEM,2,Moderate,Moderate,Medical,Private Health Insurance,,,,,false,40378.59,8475.42
Long Island,Nassau,2952005,000552,Plainview Hospital,50 to 69,118,F,Other Race,Spanish/Hispanic,3,Emergency,Short-term Hospital,2019,NEO033,FEMALE REPRODUCTIVE SYSTEM CANCERS - OVARY,GIS006,PARACENTESIS,530,FEMALE REPRODUCTIVE SYSTEM MALIGNANCY,13,DISEASES AND DISORDERS OF THE FEMALE REPRODUCTIVE SYSTEM,3,Major,Major,Medical,Medicaid,,,,,true,37567.29,10218.96
Finger Lakes,Monroe,2701003,000411,Rochester General Hospital,30 to 49,146,F,Black/African American,Not Span/Hispanic,4,Emergency,Home w/ Home Health Services,2019,NEO032,FEMALE REPRODUCTIVE SYSTEM CANCERS - CERVIX,CAR028,INFERIOR VENA CAVA (IVC) FILTER PROCEDURES,530,FEMALE REPRODUCTIVE SYSTEM MALIGNANCY,13,DISEASES AND DISORDERS OF THE FEMALE REPRODUCTIVE SYSTEM,3,Major,Major,Medical,Medicaid,,,,,true,35580.74,12317.64
Long Island,Suffolk,5154001,000925,Good Samaritan Hospital Medical Center,50 to 69,115,F,Other Race,Not Span/Hispanic,19,Emergency,Home w/ Home Health Services,2019,NEO032,FEMALE REPRODUCTIVE SYSTEM CANCERS - CERVIX,GIS006,PARACENTESIS,530,FEMALE REPRODUCTIVE SYSTEM MALIGNANCY,13,DISEASES AND DISORDERS OF THE FEMALE REPRODUCTIVE SYSTEM,3,Major,Major,Medical,Medicaid,,,,,true,144792.31,28114.34
New York City,Manhattan,7002024,001456,Mount Sinai Hospital,30 to 49,100,F,Black/African American,Unknown,18,Emergency,Home w/ Home Health Services,2019,NEO032,FEMALE REPRODUCTIVE SYSTEM CANCERS - CERVIX,RAD001,BEAM RADIATION,530,FEMALE REPRODUCTIVE SYSTEM MALIGNANCY,13,DISEASES AND DISORDERS OF THE FEMALE REPRODUCTIVE SYSTEM,3,Major,Major,Medical,Medicaid,Medicaid,Self-Pay,,,true,246879.54,67839.26
Central NY,Onondaga,3301008,000636,Crouse Hospital,50 to 69,138,F,White,Spanish/Hispanic,7,Urgent,Home w/ Home Health Services,2019,NEO035,FEMALE REPRODUCTIVE SYSTEM CANCERS - ENDOMETRIUM,CAR025,PLACEMENT OF TUNNELED OR IMPLANTABLE PORTION OF A VASCULAR ACCESS DEVICE,530,FEMALE REPRODUCTIVE SYSTEM MALIGNANCY,13,DISEASES AND DISORDERS OF THE FEMALE REPRODUCTIVE SYSTEM,2,Moderate,Minor,Medical,Medicare,Medicare,,,,false,39768.69,17351.69
New York City,Manhattan,7002024,001456,Mount Sinai Hospital,50 to 69,OOS,F,Other Race,Not Span/Hispanic,2,Emergency,Home or Self Care,2019,NEO033,FEMALE REPRODUCTIVE SYSTEM CANCERS - OVARY,GIS006,PARACENTESIS,530,FEMALE REPRODUCTIVE SYSTEM MALIGNANCY,13,DISEASES AND DISORDERS OF THE FEMALE REPRODUCTIVE SYSTEM,3,Major,Moderate,Medical,Private Health Insurance,Self-Pay,,,,true,32784.49,10114.45
Long Island,Suffolk,5154001,000925,Good Samaritan Hospital Medical Center,70 or Older,117,F,Black/African American,Not Span/Hispanic,1,Elective,Home or Self Care,2019,NEO035,FEMALE REPRODUCTIVE SYSTEM CANCERS - ENDOMETRIUM,,,530,FEMALE REPRODUCTIVE SYSTEM MALIGNANCY,13,DISEASES AND DISORDERS OF THE FEMALE REPRODUCTIVE SYSTEM,3,Major,Moderate,Medical,Medicaid,Medicaid,,,,false,4996,901.72
Hudson Valley,Westchester,5957001,001139,Westchester Medical Center,70 or Older,105,F,Other Race,Unknown,2,Urgent,Home or Self Care,2019,NEO031,FEMALE REPRODUCTIVE SYSTEM CANCERS - UTERUS,FRS015,"FEMALE REPRODUCTIVE SYSTEM PROCEDURES, NEC",530,FEMALE REPRODUCTIVE SYSTEM MALIGNANCY,13,DISEASES AND DISORDERS OF THE FEMALE REPRODUCTIVE SYSTEM,1,Minor,Moderate,Medical,Medicare,Medicare,,,,false,44183.26,7273.72
New York City,Kings,7001021,001306,New York - Presbyterian Brooklyn Methodist Hospital,30 to 49,112,F,White,Not Span/Hispanic,2,Emergency,Home or Self Care,2019,NEO032,FEMALE REPRODUCTIVE SYSTEM CANCERS - CERVIX,URN001,CYSTOSCOPY AND URETEROSCOPY (INCLUDING BIOPSY),530,FEMALE REPRODUCTIVE SYSTEM MALIGNANCY,13,DISEASES AND DISORDERS OF THE FEMALE REPRODUCTIVE SYSTEM,2,Moderate,Minor,Medical,Private Health Insurance,Self-Pay,,,,false,24816.64,10937.21
New York City,Kings,7001021,001306,New York - Presbyterian Brooklyn Methodist Hospital,30 to 49,112,F,White,Not Span/Hispanic,3,Emergency,Home or Self Care,2019,NEO032,FEMALE REPRODUCTIVE SYSTEM CANCERS - CERVIX,FRS015,"FEMALE REPRODUCTIVE SYSTEM PROCEDURES, NEC",530,FEMALE REPRODUCTIVE SYSTEM MALIGNANCY,13,DISEASES AND DISORDERS OF THE FEMALE REPRODUCTIVE SYSTEM,2,Moderate,Minor,Medical,Private Health Insurance,Self-Pay,,,,true,46021.59,13648.07
New York City,Kings,7001021,001306,New York - Presbyterian Brooklyn Methodist Hospital,50 to 69,112,F,Black/African American,Not Span/Hispanic,3,Emergency,Home or Self Care,2019,NEO031,FEMALE REPRODUCTIVE SYSTEM CANCERS - UTERUS,CAR024,VENOUS AND ARTERIAL CATHETER PLACEMENT,530,FEMALE REPRODUCTIVE SYSTEM MALIGNANCY,13,DISEASES AND DISORDERS OF THE FEMALE REPRODUCTIVE SYSTEM,3,Major,Moderate,Medical,Blue Cross/Blue Shield,Self-Pay,,,,true,24270.8,5984.55
Long Island,Suffolk,5151001,000245,Stony Brook University Hospital,70 or Older,117,F,White,Not Span/Hispanic,7,Emergency,Hospice - Home,2019,NEO033,FEMALE REPRODUCTIVE SYSTEM CANCERS - OVARY,HEP001,LIVER BIOPSY,530,FEMALE REPRODUCTIVE SYSTEM MALIGNANCY,13,DISEASES AND DISORDERS OF THE FEMALE REPRODUCTIVE SYSTEM,3,Major,Major,Medical,Medicare,Blue Cross/Blue Shield,,,,true,82509.43,23870.83
New York City,Bronx,7000011,001175,Calvary Hospital Inc,50 to 69,112,F,Black/African American,Not Span/Hispanic,5,Elective,Home or Self Care,2019,NEO031,FEMALE REPRODUCTIVE SYSTEM CANCERS - UTERUS,ADM021,"ADMINISTRATION OF THERAPEUTIC SUBSTANCES, NEC",530,FEMALE REPRODUCTIVE SYSTEM MALIGNANCY,13,DISEASES AND DISORDERS OF THE FEMALE REPRODUCTIVE SYSTEM,2,Moderate,Moderate,Medical,Medicare,Blue Cross/Blue Shield,,,,false,13284.87,7820.24
New York City,Kings,7001045,001692,Woodhull Medical & Mental Health Center,70 or Older,112,F,Black/African American,Not Span/Hispanic,2,Emergency,Home or Self Care,2019,NEO035,FEMALE REPRODUCTIVE SYSTEM CANCERS - ENDOMETRIUM,ADM001,TRANSFUSION OF BLOOD AND BLOOD PRODUCTS,530,FEMALE REPRODUCTIVE SYSTEM MALIGNANCY,13,DISEASES AND DISORDERS OF THE FEMALE REPRODUCTIVE SYSTEM,2,Moderate,Moderate,Medical,Medicare,Medicaid,,,,true,24415.11,19062.9
New York City,Kings,7001020,001305,Maimonides Medical Center,50 to 69,112,F,Black/African American,Not Span/Hispanic,9,Emergency,Home w/ Home Health Services,2019,NEO031,FEMALE REPRODUCTIVE SYSTEM CANCERS - UTERUS,URN005,NEPHROSTOMY AND URETEROSTOMY PROCEDURES (INCLUDING STENTS),530,FEMALE REPRODUCTIVE SYSTEM MALIGNANCY,13,DISEASES AND DISORDERS OF THE FEMALE REPRODUCTIVE SYSTEM,4,Extreme,Extreme,Medical,Medicare,Medicaid,Self-Pay,,,false,75025.04,21545.93
Long Island,Suffolk,5151001,000245,Stony Brook University Hospital,70 or Older,117,F,White,Not Span/Hispanic,1,Elective,Home or Self Care,2019,NEO033,FEMALE REPRODUCTIVE SYSTEM CANCERS - OVARY,,,530,FEMALE REPRODUCTIVE SYSTEM MALIGNANCY,13,DISEASES AND DISORDERS OF THE FEMALE REPRODUCTIVE SYSTEM,1,Minor,Moderate,Medical,Medicare,Blue Cross/Blue Shield,,,,false,6889,2246.81
New York City,Bronx,7000006,001169,Montefiore Medical Center - Henry & Lucy Moses Div,70 or Older,104,F,Black/African American,Not Span/Hispanic,3,Emergency,Home or Self Care,2019,NEO032,FEMALE REPRODUCTIVE SYSTEM CANCERS - CERVIX,,,530,FEMALE REPRODUCTIVE SYSTEM MALIGNANCY,13,DISEASES AND DISORDERS OF THE FEMALE REPRODUCTIVE SYSTEM,2,Moderate,Moderate,Medical,Medicare,Medicaid,,,,true,42184.61,7170.74
Capital/Adirond,Albany,0101004,000005,St. Peter's Hospital,50 to 69,122,F,White,Not Span/Hispanic,3,Emergency,Home or Self Care,2019,NEO033,FEMALE REPRODUCTIVE SYSTEM CANCERS - OVARY,GIS007,GI SYSTEM DRAINAGE (EXCLUDING PARACENTESIS),530,FEMALE REPRODUCTIVE SYSTEM MALIGNANCY,13,DISEASES AND DISORDERS OF THE FEMALE REPRODUCTIVE SYSTEM,2,Moderate,Moderate,Medical,Private Health Insurance,,,,,true,18094.35,5624.01
New York City,Manhattan,7002032,001469,Mount Sinai Morningside,30 to 49,104,F,Other Race,Spanish/Hispanic,2,Emergency,Home or Self Care,2019,NEO031,FEMALE REPRODUCTIVE SYSTEM CANCERS - UTERUS,GNR008,"ABDOMINAL WALL PROCEDURES, NEC",530,FEMALE REPRODUCTIVE SYSTEM MALIGNANCY,13,DISEASES AND DISORDERS OF THE FEMALE REPRODUCTIVE SYSTEM,1,Minor,Minor,Medical,Private Health Insurance,Medicaid,Self-Pay,,,true,45228.99,11050.26
New York City,Kings,7001033,001315,Kingsbrook Jewish Medical Center,70 or Older,112,F,Black/African American,Not Span/Hispanic,2,Emergency,Home or Self Care,2019,NEO033,FEMALE REPRODUCTIVE SYSTEM CANCERS - OVARY,GIS006,PARACENTESIS,530,FEMALE REPRODUCTIVE SYSTEM MALIGNANCY,13,DISEASES AND DISORDERS OF THE FEMALE REPRODUCTIVE SYSTEM,2,Moderate,Moderate,Medical,Medicare,Medicare,Self-Pay,,,true,28482,7536.55
New York City,Kings,7001021,001306,New York - Presbyterian Brooklyn Methodist Hospital,70 or Older,112,F,Black/African American,Not Span/Hispanic,12,Emergency,Skilled Nursing Home,2019,NEO035,FEMALE REPRODUCTIVE SYSTEM CANCERS - ENDOMETRIUM,ADM001,TRANSFUSION OF BLOOD AND BLOOD PRODUCTS,530,FEMALE REPRODUCTIVE SYSTEM MALIGNANCY,13,DISEASES AND DISORDERS OF THE FEMALE REPRODUCTIVE SYSTEM,4,Extreme,Major,Medical,Medicare,Medicaid,Self-Pay,,,true,72325.87,19308.41
New York City,Kings,7001021,001306,New York - Presbyterian Brooklyn Methodist Hospital,30 to 49,112,F,Black/African American,Not Span/Hispanic,3,Emergency,Home or Self Care,2019,NEO032,FEMALE REPRODUCTIVE SYSTEM CANCERS - CERVIX,FRS015,"FEMALE REPRODUCTIVE SYSTEM PROCEDURES, NEC",530,FEMALE REPRODUCTIVE SYSTEM MALIGNANCY,13,DISEASES AND DISORDERS OF THE FEMALE REPRODUCTIVE SYSTEM,3,Major,Moderate,Medical,Private Health Insurance,,,,,true,57531.6,34538.72
New York City,Kings,7001037,001320,University Hospital of Brooklyn,70 or Older,112,F,Black/African American,Not Span/Hispanic,22,Emergency,Skilled Nursing Home,2019,NEO033,FEMALE REPRODUCTIVE SYSTEM CANCERS - OVARY,ADM001,TRANSFUSION OF BLOOD AND BLOOD PRODUCTS,530,FEMALE REPRODUCTIVE SYSTEM MALIGNANCY,13,DISEASES AND DISORDERS OF THE FEMALE REPRODUCTIVE SYSTEM,4,Extreme,Extreme,Medical,Medicare,Private Health Insurance,Self-Pay,,,true,137266.5,85327.16
New York City,Manhattan,7002024,001456,Mount Sinai Hospital,30 to 49,104,F,Black/African American,Spanish/Hispanic,8,Emergency,Home or Self Care,2019,NEO032,FEMALE REPRODUCTIVE SYSTEM CANCERS - CERVIX,FRS015,"FEMALE REPRODUCTIVE SYSTEM PROCEDURES, NEC",530,FEMALE REPRODUCTIVE SYSTEM MALIGNANCY,13,DISEASES AND DISORDERS OF THE FEMALE REPRODUCTIVE SYSTEM,2,Moderate,Minor,Medical,Medicaid,Medicaid,Self-Pay,,,true,116841.38,36267.11
New York City,Kings,7001021,001306,New York - Presbyterian Brooklyn Methodist Hospital,50 to 69,112,F,Other Race,Not Span/Hispanic,2,Emergency,Home or Self Care,2019,NEO032,FEMALE REPRODUCTIVE SYSTEM CANCERS - CERVIX,,,530,FEMALE REPRODUCTIVE SYSTEM MALIGNANCY,13,DISEASES AND DISORDERS OF THE FEMALE REPRODUCTIVE SYSTEM,2,Moderate,Minor,Medical,"Managed Care, Unspecified",Medicaid,Self-Pay,,,true,13881.06,3609.88
Capital/Adirond,Albany,0101004,000005,St. Peter's Hospital,50 to 69,121,F,White,Not Span/Hispanic,9,Emergency,Skilled Nursing Home,2019,NEO035,FEMALE REPRODUCTIVE SYSTEM CANCERS - ENDOMETRIUM,ADM012,CHEMOTHERAPY,530,FEMALE REPRODUCTIVE SYSTEM MALIGNANCY,13,DISEASES AND DISORDERS OF THE FEMALE REPRODUCTIVE SYSTEM,2,Moderate,Minor,Medical,Blue Cross/Blue Shield,,,,,true,81013,22569.98
New York City,Kings,7001020,001305,Maimonides Medical Center,70 or Older,112,F,White,Not Span/Hispanic,7,Emergency,Hospice - Home,2019,NEO031,FEMALE REPRODUCTIVE SYSTEM CANCERS - UTERUS,ADM017,ADMINISTRATION OF NUTRITIONAL AND ELECTROLYTIC SUBSTANCES,530,FEMALE REPRODUCTIVE SYSTEM MALIGNANCY,13,DISEASES AND DISORDERS OF THE FEMALE REPRODUCTIVE SYSTEM,4,Extreme,Major,Medical,Medicare,Medicaid,Self-Pay,,,true,46069.01,12733.71
Hudson Valley,Putnam,3950000,000752,Putnam Hospital,50 to 69,125,F,White,Not Span/Hispanic,3,Emergency,Home or Self Care,2019,NEO033,FEMALE REPRODUCTIVE SYSTEM CANCERS - OVARY,RES003,THORACENTESIS (DIAGNOSTIC),530,FEMALE REPRODUCTIVE SYSTEM MALIGNANCY,13,DISEASES AND DISORDERS OF THE FEMALE REPRODUCTIVE SYSTEM,3,Major,Major,Medical,Medicare,"Managed Care, Unspecified",,,,true,39326.3,10006.97
New York City,Queens,7003010,001637,New York - Presbyterian/Queens,50 to 69,113,F,Black/African American,Not Span/Hispanic,22,Emergency,Skilled Nursing Home,2019,NEO033,FEMALE REPRODUCTIVE SYSTEM CANCERS - OVARY,ADM021,"ADMINISTRATION OF THERAPEUTIC SUBSTANCES, NEC",530,FEMALE REPRODUCTIVE SYSTEM MALIGNANCY,13,DISEASES AND DISORDERS OF THE FEMALE REPRODUCTIVE SYSTEM,4,Extreme,Major,Medical,Medicare,Blue Cross/Blue Shield,Self-Pay,,,true,153945.17,40935.24
New York City,Kings,7001021,001306,New York - Presbyterian Brooklyn Methodist Hospital,70 or Older,112,F,Black/African American,Not Span/Hispanic,8,Emergency,Home w/ Home Health Services,2019,NEO031,FEMALE REPRODUCTIVE SYSTEM CANCERS - UTERUS,RES005,CHEST TUBE PLACEMENT AND THERAPEUTIC THORACENTESIS,530,FEMALE REPRODUCTIVE SYSTEM MALIGNANCY,13,DISEASES AND DISORDERS OF THE FEMALE REPRODUCTIVE SYSTEM,4,Extreme,Extreme,Medical,Medicare,Medicare,Self-Pay,,,true,65245.26,14649.96
New York City,Kings,7001021,001306,New York - Presbyterian Brooklyn Methodist Hospital,70 or Older,112,F,White,Not Span/Hispanic,5,Emergency,Home or Self Care,2019,NEO032,FEMALE REPRODUCTIVE SYSTEM CANCERS - CERVIX,ADM001,TRANSFUSION OF BLOOD AND BLOOD PRODUCTS,530,FEMALE REPRODUCTIVE SYSTEM MALIGNANCY,13,DISEASES AND DISORDERS OF THE FEMALE REPRODUCTIVE SYSTEM,3,Major,Major,Medical,"Managed Care, Unspecified",Medicaid,Self-Pay,,,true,34304.95,8907.49
Central NY,Onondaga,3301007,000635,University Hospital SUNY Health Science Center,70 or Older,136,F,White,Unknown,5,Emergency,Home or Self Care,2019,NEO035,FEMALE REPRODUCTIVE SYSTEM CANCERS - ENDOMETRIUM,IMG008,ULTRASONOGRAPHY,530,FEMALE REPRODUCTIVE SYSTEM MALIGNANCY,13,DISEASES AND DISORDERS OF THE FEMALE REPRODUCTIVE SYSTEM,3,Major,Major,Medical,Medicare,,,,,true,51403.9,12860.72
Long Island,Suffolk,5154001,000925,Good Samaritan Hospital Medical Center,50 to 69,115,F,Other Race,Not Span/Hispanic,4,Emergency,Home or Self Care,2019,NEO031,FEMALE REPRODUCTIVE SYSTEM CANCERS - UTERUS,GIS006,PARACENTESIS,530,FEMALE REPRODUCTIVE SYSTEM MALIGNANCY,13,DISEASES AND DISORDERS OF THE FEMALE REPRODUCTIVE SYSTEM,3,Major,Major,Medical,Medicaid,,,,,true,48125.31,8282.72
Central NY,Onondaga,3301007,000635,University Hospital SUNY Health Science Center,50 to 69,131,F,White,Not Span/Hispanic,9,Emergency,Skilled Nursing Home,2019,NEO033,FEMALE REPRODUCTIVE SYSTEM CANCERS - OVARY,GNR008,"ABDOMINAL WALL PROCEDURES, NEC",530,FEMALE REPRODUCTIVE SYSTEM MALIGNANCY,13,DISEASES AND DISORDERS OF THE FEMALE REPRODUCTIVE SYSTEM,4,Extreme,Extreme,Medical,Medicaid,,,,,true,93342.56,27782.93
New York City,Kings,7001021,001306,New York - Presbyterian Brooklyn Methodist Hospital,50 to 69,103,F,White,Not Span/Hispanic,5,Emergency,Home or Self Care,2019,NEO035,FEMALE REPRODUCTIVE SYSTEM CANCERS - ENDOMETRIUM,ADM001,TRANSFUSION OF BLOOD AND BLOOD PRODUCTS,530,FEMALE REPRODUCTIVE SYSTEM MALIGNANCY,13,DISEASES AND DISORDERS OF THE FEMALE REPRODUCTIVE SYSTEM,3,Major,Moderate,Medical,"Managed Care, Unspecified",Medicaid,Self-Pay,,,false,32351.9,9971.88
New York City,Manhattan,7002054,001458,New York-Presbyterian Hospital - New York Weill Cornell Center,50 to 69,115,F,White,Not Span/Hispanic,7,Emergency,Expired,2019,NEO033,FEMALE REPRODUCTIVE SYSTEM CANCERS - OVARY,GIS006,PARACENTESIS,530,FEMALE REPRODUCTIVE SYSTEM MALIGNANCY,13,DISEASES AND DISORDERS OF THE FEMALE REPRODUCTIVE SYSTEM,4,Extreme,Extreme,Medical,Medicare,Private Health Insurance,Self-Pay,,,true,189694.79,79371.53
New York City,Manhattan,7002001,001438,Bellevue Hospital Center,50 to 69,100,F,Black/African American,Not Span/Hispanic,10,Emergency,Home w/ Home Health Services,2019,NEO033,FEMALE REPRODUCTIVE SYSTEM CANCERS - OVARY,RES005,CHEST TUBE PLACEMENT AND THERAPEUTIC THORACENTESIS,530,FEMALE REPRODUCTIVE SYSTEM MALIGNANCY,13,DISEASES AND DISORDERS OF THE FEMALE REPRODUCTIVE SYSTEM,4,Extreme,Major,Medical,Medicaid,,,,,true,62175.32,41321.72
New York City,Kings,7001035,001318,Wyckoff Heights Medical Center,70 or Older,112,F,Other Race,Not Span/Hispanic,13,Emergency,Home w/ Home Health Services,2019,NEO031,FEMALE REPRODUCTIVE SYSTEM CANCERS - UTERUS,ADM001,TRANSFUSION OF BLOOD AND BLOOD PRODUCTS,530,FEMALE REPRODUCTIVE SYSTEM MALIGNANCY,13,DISEASES AND DISORDERS OF THE FEMALE REPRODUCTIVE SYSTEM,3,Major,Major,Medical,Medicare,Miscellaneous/Other,Medicare,,,true,62163.51,27595.38
Western NY,Erie,1401010,000216,Roswell Park Cancer Institute,30 to 49,142,F,Other Race,Not Span/Hispanic,3,Urgent,Home w/ Home Health Services,2019,NEO031,FEMALE REPRODUCTIVE SYSTEM CANCERS - UTERUS,GIS006,PARACENTESIS,530,FEMALE REPRODUCTIVE SYSTEM MALIGNANCY,13,DISEASES AND DISORDERS OF THE FEMALE REPRODUCTIVE SYSTEM,3,Major,Major,Medical,Private Health Insurance,Self-Pay,,,,false,27058.93,10469.47
New York City,Queens,7003010,001637,New York - Presbyterian/Queens,70 or Older,114,F,Black/African American,Not Span/Hispanic,2,Emergency,Home w/ Home Health Services,2019,NEO032,FEMALE REPRODUCTIVE SYSTEM CANCERS - CERVIX,IMG006,COMPUTERIZED TOMOGRAPHY (CT) WITH CONTRAST,530,FEMALE REPRODUCTIVE SYSTEM MALIGNANCY,13,DISEASES AND DISORDERS OF THE FEMALE REPRODUCTIVE SYSTEM,3,Major,Major,Medical,Medicare,Medicare,Medicaid,,,true,24190.7,5196.97
New York City,Manhattan,7002054,001458,New York-Presbyterian Hospital - New York Weill Cornell Center,70 or Older,112,F,Black/African American,Not Span/Hispanic,5,Emergency,Home or Self Care,2019,NEO035,FEMALE REPRODUCTIVE SYSTEM CANCERS - ENDOMETRIUM,ADM017,ADMINISTRATION OF NUTRITIONAL AND ELECTROLYTIC SUBSTANCES,530,FEMALE REPRODUCTIVE SYSTEM MALIGNANCY,13,DISEASES AND DISORDERS OF THE FEMALE REPRODUCTIVE SYSTEM,3,Major,Moderate,Medical,Private Health Insurance,Medicare,,,,true,63314.52,14553.67
Hudson Valley,Rockland,4324000,000776,Montefiore Nyack,70 or Older,109,F,White,Not Span/Hispanic,28,Emergency,Expired,2019,NEO033,FEMALE REPRODUCTIVE SYSTEM CANCERS - OVARY,ESA003,MECHANICAL VENTILATION,530,FEMALE REPRODUCTIVE SYSTEM MALIGNANCY,13,DISEASES AND DISORDERS OF THE FEMALE REPRODUCTIVE SYSTEM,4,Extreme,Extreme,Medical,Medicare,Blue Cross/Blue Shield,,,,false,248181.91,53256.22
New York City,Manhattan,7002054,001464,New York-Presbyterian Hospital - Columbia Presbyterian Center,70 or Older,104,F,Other Race,Not Span/Hispanic,4,Emergency,Hospice - Home,2019,NEO035,FEMALE REPRODUCTIVE SYSTEM CANCERS - ENDOMETRIUM,,,530,FEMALE REPRODUCTIVE SYSTEM MALIGNANCY,13,DISEASES AND DISORDERS OF THE FEMALE REPRODUCTIVE SYSTEM,3,Major,Major,Medical,Medicare,Medicare,Medicaid,,,true,47172.85,10533.65
New York City,Bronx,7000006,001169,Montefiore Medical Center - Henry & Lucy Moses Div,70 or Older,105,F,Black/African American,Not Span/Hispanic,7,Emergency,Home w/ Home Health Services,2019,NEO033,FEMALE REPRODUCTIVE SYSTEM CANCERS - OVARY,GIS006,PARACENTESIS,530,FEMALE REPRODUCTIVE SYSTEM MALIGNANCY,13,DISEASES AND DISORDERS OF THE FEMALE REPRODUCTIVE SYSTEM,3,Major,Major,Medical,Medicare,Medicaid,,,,false,83845.74,16992.81
New York City,Manhattan,7002054,001458,New York-Presbyterian Hospital - New York Weill Cornell Center,50 to 69,100,F,White,Not Span/Hispanic,4,Emergency,Home w/ Home Health Services,2019,NEO033,FEMALE REPRODUCTIVE SYSTEM CANCERS - OVARY,GNR009,"RETROPERITONEAL PROCEDURES, NEC",530,FEMALE REPRODUCTIVE SYSTEM MALIGNANCY,13,DISEASES AND DISORDERS OF THE FEMALE REPRODUCTIVE SYSTEM,3,Major,Moderate,Medical,Blue Cross/Blue Shield,Self-Pay,,,,true,90008.77,20678.06
New York City,Kings,7001016,001301,Kings County Hospital Center,50 to 69,112,F,Black/African American,Not Span/Hispanic,2,Emergency,Home or Self Care,2019,NEO032,FEMALE REPRODUCTIVE SYSTEM CANCERS - CERVIX,,,530,FEMALE REPRODUCTIVE SYSTEM MALIGNANCY,13,DISEASES AND DISORDERS OF THE FEMALE REPRODUCTIVE SYSTEM,2,Moderate,Moderate,Medical,Medicaid,,,,,true,17911.08,12723.33
Capital/Adirond,Albany,0101000,000001,Albany Medical Center Hospital,50 to 69,123,F,Other Race,Not Span/Hispanic,76,Emergency,Skilled Nursing Home,2019,NEO033,FEMALE REPRODUCTIVE SYSTEM CANCERS - OVARY,GIS003,GI SYSTEM BIOPSY (NON-ENDOSCOPIC),530,FEMALE REPRODUCTIVE SYSTEM MALIGNANCY,13,DISEASES AND DISORDERS OF THE FEMALE REPRODUCTIVE SYSTEM,4,Extreme,Extreme,Medical,Medicaid,,,,,true,445111.78,136706.32
New York City,Manhattan,7002017,001450,Lenox Hill Hospital,70 or Older,105,F,White,Not Span/Hispanic,3,Urgent,Home or Self Care,2019,NEO033,FEMALE REPRODUCTIVE SYSTEM CANCERS - OVARY,,,530,FEMALE REPRODUCTIVE SYSTEM MALIGNANCY,13,DISEASES AND DISORDERS OF THE FEMALE REPRODUCTIVE SYSTEM,2,Moderate,Extreme,Medical,Medicare,Medicaid,,,,false,36197.98,6769.55
New York City,Bronx,7000011,001175,Calvary Hospital Inc,50 to 69,104,F,White,Not Span/Hispanic,80,Elective,Home or Self Care,2019,NEO031,FEMALE REPRODUCTIVE SYSTEM CANCERS - UTERUS,ADM021,"ADMINISTRATION OF THERAPEUTIC SUBSTANCES, NEC",530,FEMALE REPRODUCTIVE SYSTEM MALIGNANCY,13,DISEASES AND DISORDERS OF THE FEMALE REPRODUCTIVE SYSTEM,3,Major,Extreme,Medical,Medicare,Medicaid,,,,false,170410.32,87749.94
New York City,Bronx,7000011,001175,Calvary Hospital Inc,70 or Older,104,F,Black/African American,Not Span/Hispanic,16,Elective,Expired,2019,NEO035,FEMALE REPRODUCTIVE SYSTEM CANCERS - ENDOMETRIUM,,,530,FEMALE REPRODUCTIVE SYSTEM MALIGNANCY,13,DISEASES AND DISORDERS OF THE FEMALE REPRODUCTIVE SYSTEM,2,Moderate,Moderate,Medical,Medicare,Private Health Insurance,,,,false,33169.79,17008.05
New York City,Bronx,7000011,001175,Calvary Hospital Inc,70 or Older,104,F,Other Race,Not Span/Hispanic,3,Elective,Home or Self Care,2019,NEO038,FEMALE REPRODUCTIVE SYSTEM CANCERS - ALL OTHER TYPES,,,530,FEMALE REPRODUCTIVE SYSTEM MALIGNANCY,13,DISEASES AND DISORDERS OF THE FEMALE REPRODUCTIVE SYSTEM,3,Major,Major,Medical,Private Health Insurance,Medicare,,,,false,6775.66,3679.5
Western NY,Erie,1401014,000207,Buffalo General Medical Center,50 to 69,142,F,White,Not Span/Hispanic,3,Emergency,Home or Self Care,2019,NEO033,FEMALE REPRODUCTIVE SYSTEM CANCERS - OVARY,,,530,FEMALE REPRODUCTIVE SYSTEM MALIGNANCY,13,DISEASES AND DISORDERS OF THE FEMALE REPRODUCTIVE SYSTEM,3,Major,Moderate,Medical,Private Health Insurance,Self-Pay,,,,true,16616.75,5830.7