Hospital Service Area,Hospital County,Operating Certificate Number,Permanent Facility Id,Facility Name,Age Group,Zip Code - 3 digits,Gender,Race,Ethnicity,Length of Stay,Type of Admission,Patient Disposition,Discharge Year,CCS Diagnosis Code,CCS Diagnosis Description,CCS Procedure Code,CCS Procedure Description,APR DRG Code,APR DRG Description,APR MDC Code,APR MDC Description,APR Severity of Illness Code,APR Severity of Illness Description,APR Risk of Mortality,APR Medical Surgical Description,Payment Typology 1,Payment Typology 2,Payment Typology 3,Birth Weight,Abortion Edit Indicator,Emergency Department Indicator,Total Charges,Total Costs
New York City,Manhattan,7002053,001463,NYU Langone Hospitals,70 or Older,100,F,White,Not Span/Hispanic,3,Emergency,Home w/ Home Health Services,2017,004,Mycoses,000,NO PROC,531,Female reproductive system infections,13,Diseases and Disorders of the Female Reproductive System,3,Major,Major,Medical,Medicare,,,,N,Y,50668.11,13532.40
New York City,Manhattan,7002053,001463,NYU Langone Hospitals,18 to 29,112,F,Other Race,Spanish/Hispanic,2,Emergency,Home or Self Care,2017,168,Inflammatory diseases of female pelvic organs,000,NO PROC,531,Female reproductive system infections,13,Diseases and Disorders of the Female Reproductive System,1,Minor,Minor,Medical,Private Health Insurance,,,,N,Y,22219.27,5854.87
New York City,Manhattan,7002053,001463,NYU Langone Hospitals,30 to 49,100,F,Other Race,Not Span/Hispanic,2,Emergency,Home or Self Care,2017,168,Inflammatory diseases of female pelvic organs,000,NO PROC,531,Female reproductive system infections,13,Diseases and Disorders of the Female Reproductive System,1,Minor,Minor,Medical,Private Health Insurance,,,,N,Y,26374.30,7547.90
New York City,Manhattan,7002053,001463,NYU Langone Hospitals,0 to 17,112,F,White,Not Span/Hispanic,2,Emergency,Home or Self Care,2017,168,Inflammatory diseases of female pelvic organs,168,"INCIS/DRAIN, SKIN/SUBCU",531,Female reproductive system infections,13,Diseases and Disorders of the Female Reproductive System,2,Moderate,Minor,Medical,Private Health Insurance,,,,N,Y,33721.78,8426.27
New York City,Manhattan,7002053,001463,NYU Langone Hospitals,30 to 49,112,F,Black/African American,Not Span/Hispanic,1,Emergency,Home or Self Care,2017,168,Inflammatory diseases of female pelvic organs,000,NO PROC,531,Female reproductive system infections,13,Diseases and Disorders of the Female Reproductive System,2,Moderate,Minor,Medical,Private Health Insurance,,,,N,Y,17918.32,5059.80
New York City,Manhattan,7002053,001463,NYU Langone Hospitals,30 to 49,100,F,Other Race,Spanish/Hispanic,3,Emergency,Home or Self Care,2017,168,Inflammatory diseases of female pelvic organs,000,NO PROC,531,Female reproductive system infections,13,Diseases and Disorders of the Female Reproductive System,3,Major,Minor,Medical,Blue Cross/Blue Shield,,,,N,Y,38733.29,12349.17
New York City,Manhattan,7002053,001463,NYU Langone Hospitals,30 to 49,100,F,Black/African American,Not Span/Hispanic,1,Emergency,Home or Self Care,2017,168,Inflammatory diseases of female pelvic organs,222,BLOOD TRANSFUSION,531,Female reproductive system infections,13,Diseases and Disorders of the Female Reproductive System,3,Major,Moderate,Medical,Medicaid,,,,N,Y,21925.32,7319.98
New York City,Manhattan,7002053,001463,NYU Langone Hospitals,30 to 49,112,F,Black/African American,Not Span/Hispanic,5,Emergency,Home or Self Care,2017,168,Inflammatory diseases of female pelvic organs,231,OTHER THERAPEUTIC PRCS,531,Female reproductive system infections,13,Diseases and Disorders of the Female Reproductive System,1,Minor,Minor,Medical,Medicaid,,,,N,Y,50727.61,13436.10
New York City,Manhattan,7002053,001463,NYU Langone Hospitals,50 to 69,112,F,White,Not Span/Hispanic,4,Emergency,Home or Self Care,2017,168,Inflammatory diseases of female pelvic organs,088,ABDOMINAL PARACENTESIS,531,Female reproductive system infections,13,Diseases and Disorders of the Female Reproductive System,1,Minor,Minor,Medical,Private Health Insurance,,,,N,Y,35005.78,13554.95
New York City,Manhattan,7002053,001463,NYU Langone Hospitals,30 to 49,113,F,Other Race,Not Span/Hispanic,2,Emergency,Home or Self Care,2017,168,Inflammatory diseases of female pelvic organs,000,NO PROC,531,Female reproductive system infections,13,Diseases and Disorders of the Female Reproductive System,1,Minor,Minor,Medical,Medicaid,,,,N,Y,46685.46,13746.72
New York City,Manhattan,7002053,001463,NYU Langone Hospitals,50 to 69,100,F,White,Not Span/Hispanic,1,Emergency,Home or Self Care,2017,168,Inflammatory diseases of female pelvic organs,000,NO PROC,531,Female reproductive system infections,13,Diseases and Disorders of the Female Reproductive System,1,Minor,Minor,Medical,Private Health Insurance,,,,N,Y,19136.27,5269.94
New York City,Manhattan,7002053,001463,NYU Langone Hospitals,0 to 17,,F,Other Race,Not Span/Hispanic,2,Emergency,Home or Self Care,2017,168,Inflammatory diseases of female pelvic organs,000,NO PROC,531,Female reproductive system infections,13,Diseases and Disorders of the Female Reproductive System,2,Moderate,Minor,Medical,Medicaid,,,,N,Y,21755.71,6338.90
New York City,Manhattan,7002053,001463,NYU Langone Hospitals,30 to 49,113,F,Other Race,Unknown,5,Emergency,Home or Self Care,2017,168,Inflammatory diseases of female pelvic organs,000,NO PROC,531,Female reproductive system infections,13,Diseases and Disorders of the Female Reproductive System,1,Minor,Minor,Medical,Medicaid,,,,N,Y,54131.87,15178.26
New York City,Manhattan,7002053,001463,NYU Langone Hospitals,18 to 29,104,F,Other Race,Unknown,6,Emergency,Home or Self Care,2017,168,Inflammatory diseases of female pelvic organs,130,OT DX PRCS; FEMALE ORGN,531,Female reproductive system infections,13,Diseases and Disorders of the Female Reproductive System,2,Moderate,Minor,Medical,Private Health Insurance,,,,N,Y,77979.84,28510.45
New York City,Manhattan,7002053,001463,NYU Langone Hospitals,30 to 49,OOS,F,Black/African American,Not Span/Hispanic,3,Emergency,Home or Self Care,2017,168,Inflammatory diseases of female pelvic organs,000,NO PROC,531,Female reproductive system infections,13,Diseases and Disorders of the Female Reproductive System,2,Moderate,Minor,Medical,Private Health Insurance,,,,N,Y,40025.46,10883.91
