Hospital Service Area,Hospital County,Operating Certificate Number,Permanent Facility Id,Facility Name,Age Group,Zip Code - 3 digits,Gender,Race,Ethnicity,Length of Stay,Type of Admission,Patient Disposition,Discharge Year,CCS Diagnosis Code,CCS Diagnosis Description,CCS Procedure Code,CCS Procedure Description,APR DRG Code,APR DRG Description,APR MDC Code,APR MDC Description,APR Severity of Illness Code,APR Severity of Illness Description,APR Risk of Mortality,APR Medical Surgical Description,Payment Typology 1,Payment Typology 2,Payment Typology 3,Birth Weight,Abortion Edit Indicator,Emergency Department Indicator,Total Charges,Total Costs
New York City,Manhattan,7002053,001463,NYU Langone Hospitals,18 to 29,112,F,Other Race,Not Span/Hispanic,2,Emergency,Home or Self Care,2019,GEN018,INFLAMMATORY DISEASES OF FEMALE PELVIC ORGANS,,,531,FEMALE REPRODUCTIVE SYSTEM INFECTIONS,13,DISEASES AND DISORDERS OF THE FEMALE REPRODUCTIVE SYSTEM,1,Minor,Minor,Medical,Private Health Insurance,,,,,true,40812.38,10214.48
New York City,Manhattan,7002053,001463,NYU Langone Hospitals,50 to 69,OOS,F,White,Not Span/Hispanic,1,Emergency,Home or Self Care,2019,GEN018,INFLAMMATORY DISEASES OF FEMALE PELVIC ORGANS,,,531,FEMALE REPRODUCTIVE SYSTEM INFECTIONS,13,DISEASES AND DISORDERS OF THE FEMALE REPRODUCTIVE SYSTEM,1,Minor,Minor,Medical,Private Health Insurance,,,,,true,26967.59,6570.47
New York City,Manhattan,7002053,001463,NYU Langone Hospitals,30 to 49,112,F,Black/African American,Not Span/Hispanic,2,Emergency,Home or Self Care,2019,GEN018,INFLAMMATORY DISEASES OF FEMALE PELVIC ORGANS,OTR004,ISOLATION PROCEDURES,531,FEMALE REPRODUCTIVE SYSTEM INFECTIONS,13,DISEASES AND DISORDERS OF THE FEMALE REPRODUCTIVE SYSTEM,2,Moderate,Minor,Medical,Private Health Insurance,,,,,true,46932.95,10354.3
New York City,Manhattan,7002053,001463,NYU Langone Hospitals,18 to 29,113,F,Other Race,Not Span/Hispanic,2,Emergency,Home or Self Care,2019,GEN018,INFLAMMATORY DISEASES OF FEMALE PELVIC ORGANS,IMG008,ULTRASONOGRAPHY,531,FEMALE REPRODUCTIVE SYSTEM INFECTIONS,13,DISEASES AND DISORDERS OF THE FEMALE REPRODUCTIVE SYSTEM,2,Moderate,Minor,Medical,Blue Cross/Blue Shield,,,,,true,51689.99,11076.66
New York City,Manhattan,7002053,001463,NYU Langone Hospitals,50 to 69,100,F,Black/African American,Not Span/Hispanic,4,Emergency,Skilled Nursing Home,2019,GEN018,INFLAMMATORY DISEASES OF FEMALE PELVIC ORGANS,GIS006,PARACENTESIS,531,FEMALE REPRODUCTIVE SYSTEM INFECTIONS,13,DISEASES AND DISORDERS OF THE FEMALE REPRODUCTIVE SYSTEM,2,Moderate,Moderate,Medical,Medicare,Medicaid,,,,true,71375.34,17791.08
New York City,Manhattan,7002053,001463,NYU Langone Hospitals,30 to 49,112,F,White,Not Span/Hispanic,3,Emergency,Home or Self Care,2019,GEN018,INFLAMMATORY DISEASES OF FEMALE PELVIC ORGANS,,,531,FEMALE REPRODUCTIVE SYSTEM INFECTIONS,13,DISEASES AND DISORDERS OF THE FEMALE REPRODUCTIVE SYSTEM,2,Moderate,Minor,Medical,Private Health Insurance,,,,,true,44149.73,12309.68
New York City,Manhattan,7002053,001463,NYU Langone Hospitals,18 to 29,100,F,White,Not Span/Hispanic,4,Emergency,Home or Self Care,2019,GEN018,INFLAMMATORY DISEASES OF FEMALE PELVIC ORGANS,,,531,FEMALE REPRODUCTIVE SYSTEM INFECTIONS,13,DISEASES AND DISORDERS OF THE FEMALE REPRODUCTIVE SYSTEM,2,Moderate,Minor,Medical,Private Health Insurance,,,,,true,49966.12,14263.41
New York City,Manhattan,7002053,001463,NYU Langone Hospitals,30 to 49,,F,Black/African American,Not Span/Hispanic,2,Emergency,Home or Self Care,2019,GEN018,INFLAMMATORY DISEASES OF FEMALE PELVIC ORGANS,ADM021,"ADMINISTRATION OF THERAPEUTIC SUBSTANCES, NEC",531,FEMALE REPRODUCTIVE SYSTEM INFECTIONS,13,DISEASES AND DISORDERS OF THE FEMALE REPRODUCTIVE SYSTEM,2,Moderate,Minor,Medical,Blue Cross/Blue Shield,,,,,true,23613.72,7597.94
New York City,Manhattan,7002053,001463,NYU Langone Hospitals,30 to 49,113,F,White,Not Span/Hispanic,1,Emergency,Home or Self Care,2019,GEN018,INFLAMMATORY DISEASES OF FEMALE PELVIC ORGANS,,,531,FEMALE REPRODUCTIVE SYSTEM INFECTIONS,13,DISEASES AND DISORDERS OF THE FEMALE REPRODUCTIVE SYSTEM,1,Minor,Minor,Medical,Blue Cross/Blue Shield,,,,,true,28943.96,6540.04
New York City,Manhattan,7002053,001463,NYU Langone Hospitals,30 to 49,107,F,Other Race,Not Span/Hispanic,3,Emergency,Home or Self Care,2019,GEN018,INFLAMMATORY DISEASES OF FEMALE PELVIC ORGANS,FRS015,"FEMALE REPRODUCTIVE SYSTEM PROCEDURES, NEC",531,FEMALE REPRODUCTIVE SYSTEM INFECTIONS,13,DISEASES AND DISORDERS OF THE FEMALE REPRODUCTIVE SYSTEM,2,Moderate,Minor,Medical,Private Health Insurance,,,,,true,55435.74,14348.8
New York City,Manhattan,7002053,001463,NYU Langone Hospitals,18 to 29,100,F,Black/African American,Unknown,1,Emergency,Home or Self Care,2019,GEN018,INFLAMMATORY DISEASES OF FEMALE PELVIC ORGANS,FRS015,"FEMALE REPRODUCTIVE SYSTEM PROCEDURES, NEC",531,FEMALE REPRODUCTIVE SYSTEM INFECTIONS,13,DISEASES AND DISORDERS OF THE FEMALE REPRODUCTIVE SYSTEM,1,Minor,Minor,Medical,Medicaid,,,,,true,24076.84,5630.56
New York City,Manhattan,7002053,001463,NYU Langone Hospitals,30 to 49,112,F,Black/African American,Spanish/Hispanic,6,Emergency,Home or Self Care,2019,GEN018,INFLAMMATORY DISEASES OF FEMALE PELVIC ORGANS,ADM001,TRANSFUSION OF BLOOD AND BLOOD PRODUCTS,531,FEMALE REPRODUCTIVE SYSTEM INFECTIONS,13,DISEASES AND DISORDERS OF THE FEMALE REPRODUCTIVE SYSTEM,3,Major,Moderate,Medical,Medicaid,,,,,true,115218.41,26850.91
New York City,Manhattan,7002053,001463,NYU Langone Hospitals,18 to 29,112,F,White,Not Span/Hispanic,1,Emergency,Home or Self Care,2019,GEN018,INFLAMMATORY DISEASES OF FEMALE PELVIC ORGANS,,,531,FEMALE REPRODUCTIVE SYSTEM INFECTIONS,13,DISEASES AND DISORDERS OF THE FEMALE REPRODUCTIVE SYSTEM,1,Minor,Minor,Medical,Private Health Insurance,,,,,true,34908.32,7136.49
New York City,Manhattan,7002053,001463,NYU Langone Hospitals,50 to 69,,F,White,Not Span/Hispanic,4,Emergency,Home or Self Care,2019,GEN018,INFLAMMATORY DISEASES OF FEMALE PELVIC ORGANS,FRS015,"FEMALE REPRODUCTIVE SYSTEM PROCEDURES, NEC",531,FEMALE REPRODUCTIVE SYSTEM INFECTIONS,13,DISEASES AND DISORDERS OF THE FEMALE REPRODUCTIVE SYSTEM,2,Moderate,Minor,Medical,Blue Cross/Blue Shield,,,,,true,79391.27,18901.37
New York City,Manhattan,7002053,001463,NYU Langone Hospitals,18 to 29,104,F,Other Race,Not Span/Hispanic,1,Emergency,Home or Self Care,2019,GEN018,INFLAMMATORY DISEASES OF FEMALE PELVIC ORGANS,,,531,FEMALE REPRODUCTIVE SYSTEM INFECTIONS,13,DISEASES AND DISORDERS OF THE FEMALE REPRODUCTIVE SYSTEM,1,Minor,Minor,Medical,Self-Pay,,,,,true,27521.37,5472.15
New York City,Manhattan,7002053,001463,NYU Langone Hospitals,30 to 49,112,F,White,Unknown,3,Emergency,Home or Self Care,2019,GEN018,INFLAMMATORY DISEASES OF FEMALE PELVIC ORGANS,,,531,FEMALE REPRODUCTIVE SYSTEM INFECTIONS,13,DISEASES AND DISORDERS OF THE FEMALE REPRODUCTIVE SYSTEM,2,Moderate,Minor,Medical,Medicaid,,,,,true,54609.18,13757.77
New York City,Manhattan,7002053,001463,NYU Langone Hospitals,30 to 49,100,F,Other Race,Not Span/Hispanic,3,Emergency,Home or Self Care,2019,GEN018,INFLAMMATORY DISEASES OF FEMALE PELVIC ORGANS,,,531,FEMALE REPRODUCTIVE SYSTEM INFECTIONS,13,DISEASES AND DISORDERS OF THE FEMALE REPRODUCTIVE SYSTEM,2,Moderate,Minor,Medical,Private Health Insurance,,,,,true,48029.98,13081.42
New York City,Manhattan,7002053,001463,NYU Langone Hospitals,30 to 49,100,F,White,Not Span/Hispanic,2,Emergency,Home or Self Care,2019,GEN018,INFLAMMATORY DISEASES OF FEMALE PELVIC ORGANS,,,531,FEMALE REPRODUCTIVE SYSTEM INFECTIONS,13,DISEASES AND DISORDERS OF THE FEMALE REPRODUCTIVE SYSTEM,1,Minor,Minor,Medical,Private Health Insurance,,,,,true,34651.83,9750.76
New York City,Manhattan,7002053,001463,NYU Langone Hospitals,30 to 49,OOS,F,White,Not Span/Hispanic,3,Emergency,Home or Self Care,2019,GEN018,INFLAMMATORY DISEASES OF FEMALE PELVIC ORGANS,,,531,FEMALE REPRODUCTIVE SYSTEM INFECTIONS,13,DISEASES AND DISORDERS OF THE FEMALE REPRODUCTIVE SYSTEM,1,Minor,Minor,Medical,Blue Cross/Blue Shield,,,,,true,39875.64,11796.92
New York City,Manhattan,7002053,001463,NYU Langone Hospitals,30 to 49,100,F,White,Not Span/Hispanic,5,Emergency,Home or Self Care,2019,GEN018,INFLAMMATORY DISEASES OF FEMALE PELVIC ORGANS,MAM011,ELECTROENCEPHALOGRAM (EEG),531,FEMALE REPRODUCTIVE SYSTEM INFECTIONS,13,DISEASES AND DISORDERS OF THE FEMALE REPRODUCTIVE SYSTEM,2,Moderate,Minor,Medical,Medicaid,,,,,true,93427.84,21105.6
New York City,Manhattan,7002053,001463,NYU Langone Hospitals,0 to 17,100,F,White,Not Span/Hispanic,2,Emergency,Home or Self Care,2019,GEN018,INFLAMMATORY DISEASES OF FEMALE PELVIC ORGANS,CNS002,LUMBAR PUNCTURE,531,FEMALE REPRODUCTIVE SYSTEM INFECTIONS,13,DISEASES AND DISORDERS OF THE FEMALE REPRODUCTIVE SYSTEM,1,Minor,Minor,Medical,Blue Cross/Blue Shield,,,,,true,27979.78,8119.88
New York City,Manhattan,7002053,001463,NYU Langone Hospitals,30 to 49,OOS,F,Other Race,Spanish/Hispanic,3,Emergency,Home or Self Care,2019,GEN018,INFLAMMATORY DISEASES OF FEMALE PELVIC ORGANS,,,531,FEMALE REPRODUCTIVE SYSTEM INFECTIONS,13,DISEASES AND DISORDERS OF THE FEMALE REPRODUCTIVE SYSTEM,2,Moderate,Minor,Medical,Private Health Insurance,Private Health Insurance,,,,true,41998.67,12445.46
New York City,Manhattan,7002053,001463,NYU Langone Hospitals,30 to 49,100,F,White,Not Span/Hispanic,2,Emergency,Home or Self Care,2019,GEN018,INFLAMMATORY DISEASES OF FEMALE PELVIC ORGANS,,,531,FEMALE REPRODUCTIVE SYSTEM INFECTIONS,13,DISEASES AND DISORDERS OF THE FEMALE REPRODUCTIVE SYSTEM,1,Minor,Minor,Medical,Private Health Insurance,,,,,true,42090.65,10550.87
New York City,Manhattan,7002053,001463,NYU Langone Hospitals,30 to 49,114,F,Black/African American,Not Span/Hispanic,2,Emergency,Home w/ Home Health Services,2019,GEN018,INFLAMMATORY DISEASES OF FEMALE PELVIC ORGANS,,,531,FEMALE REPRODUCTIVE SYSTEM INFECTIONS,13,DISEASES AND DISORDERS OF THE FEMALE REPRODUCTIVE SYSTEM,1,Minor,Minor,Medical,Private Health Insurance,,,,,true,38623.79,10181.78
New York City,Manhattan,7002053,001463,NYU Langone Hospitals,18 to 29,OOS,F,Other Race,Not Span/Hispanic,1,Emergency,Home or Self Care,2019,GEN018,INFLAMMATORY DISEASES OF FEMALE PELVIC ORGANS,FRS011,FEMALE LOWER GENITAL TRACT EXCISION,531,FEMALE REPRODUCTIVE SYSTEM INFECTIONS,13,DISEASES AND DISORDERS OF THE FEMALE REPRODUCTIVE SYSTEM,1,Minor,Minor,Medical,Private Health Insurance,,,,,true,45545.96,9045.72
New York City,Manhattan,7002053,001463,NYU Langone Hospitals,30 to 49,113,F,White,Not Span/Hispanic,3,Emergency,Home or Self Care,2019,GEN018,INFLAMMATORY DISEASES OF FEMALE PELVIC ORGANS,,,531,FEMALE REPRODUCTIVE SYSTEM INFECTIONS,13,DISEASES AND DISORDERS OF THE FEMALE REPRODUCTIVE SYSTEM,1,Minor,Minor,Medical,Blue Cross/Blue Shield,,,,,true,46494.26,13181.36
New York City,Manhattan,7002053,001463,NYU Langone Hospitals,70 or Older,100,F,Other Race,Not Span/Hispanic,3,Emergency,Home w/ Home Health Services,2019,GEN018,INFLAMMATORY DISEASES OF FEMALE PELVIC ORGANS,,,531,FEMALE REPRODUCTIVE SYSTEM INFECTIONS,13,DISEASES AND DISORDERS OF THE FEMALE REPRODUCTIVE SYSTEM,3,Major,Moderate,Medical,Medicare,,,,,true,43964.63,12178.55
New York City,Manhattan,7002053,001463,NYU Langone Hospitals,50 to 69,112,F,White,Not Span/Hispanic,4,Emergency,Home or Self Care,2019,GEN018,INFLAMMATORY DISEASES OF FEMALE PELVIC ORGANS,GIS006,PARACENTESIS,531,FEMALE REPRODUCTIVE SYSTEM INFECTIONS,13,DISEASES AND DISORDERS OF THE FEMALE REPRODUCTIVE SYSTEM,1,Minor,Minor,Medical,Medicaid,,,,,true,69848.84,17973.05
